{
"autoplayBgm":false,"autoplayBgs":false,"battleback1Name":"","battleback2Name":"","bgm":{"name":"","pan":0,"pitch":100,"volume":60},"bgs":{"name":"","pan":0,"pitch":100,"volume":60},"disableDashing":true,"displayName":"","encounterList":[],"encounterStep":999,"height":1,"note":"","parallaxLoopX":true,"parallaxLoopY":false,"parallaxName":"DarkClouds","parallaxShow":true,"parallaxSx":1,"parallaxSy":0,"scrollType":0,"specifyBattleback":false,"tilesetId":2,"width":3,
"data":[2816,-1,0,0,0,0,0,0,0,0,-1,0,0,0,0,0,0,0],
"events":[
null,
{"id":1,"name":"MapSetup","note":"","pages":[{"conditions":{"actorId":1,"actorValid":false,"itemId":1,"itemValid":false,"selfSwitchCh":"A","selfSwitchValid":false,"switch1Id":1,"switch1Valid":false,"switch2Id":1,"switch2Valid":false,"variableId":1,"variableValid":false,"variableValue":0},"directionFix":false,"image":{"characterIndex":0,"characterName":"","direction":2,"pattern":0,"tileId":0},"list":[{"code":122,"indent":0,"parameters":[5,5,0,0,6]},{"code":117,"indent":0,"parameters":[1]},{"code":214,"indent":0,"parameters":[]},{"code":0,"indent":0,"parameters":[]}],"moveFrequency":3,"moveRoute":{"list":[{"code":0,"parameters":[]}],"repeat":true,"skippable":false,"wait":false},"moveSpeed":3,"moveType":0,"priorityType":0,"stepAnime":false,"through":false,"trigger":4,"walkAnime":false}],"x":1,"y":0},
{"id":2,"name":"Narration","note":"","pages":[{"conditions":{"actorId":1,"actorValid":false,"itemId":1,"itemValid":false,"selfSwitchCh":"A","selfSwitchValid":false,"switch1Id":1,"switch1Valid":false,"switch2Id":1,"switch2Valid":false,"variableId":1,"variableValid":false,"variableValue":0},"directionFix":false,"image":{"characterIndex":0,"characterName":"","direction":2,"pattern":0,"tileId":0},"list":[{"code":101,"indent":0,"parameters":["",0,1,1,""]},{"code":401,"indent":0,"parameters":["After all these adventures, I managed to reach our"]},{"code":401,"indent":0,"parameters":["childhood village.\\. Although I was tired, I was"]},{"code":401,"indent":0,"parameters":["looking forward to seeing you again."]},{"code":101,"indent":0,"parameters":["",0,1,1,""]},{"code":401,"indent":0,"parameters":["However, I was inhabited by a strange feeling.\\."]},{"code":401,"indent":0,"parameters":["The apparent calm of the streets, the weather"]},{"code":401,"indent":0,"parameters":["becoming gloomy\\..\\..\\.. Was it all a bad omen?"]},{"code":101,"indent":0,"parameters":["",0,1,1,""]},{"code":401,"indent":0,"parameters":["Despite this, I was mov\\^"]},{"code":224,"indent":0,"parameters":[[255,255,255,170],30,false]},{"code":225,"indent":0,"parameters":[3,5,60,false]},{"code":224,"indent":0,"parameters":[[255,255,255,170],60,true]},{"code":230,"indent":0,"parameters":[60]},{"code":101,"indent":0,"parameters":["",0,1,1,""]},{"code":401,"indent":0,"parameters":["Huh?\\. What's going on?\\.\\^"]},{"code":224,"indent":0,"parameters":[[255,255,255,204],30,false]},{"code":225,"indent":0,"parameters":[5,7,60,false]},{"code":224,"indent":0,"parameters":[[255,255,255,204],60,true]},{"code":230,"indent":0,"parameters":[60]},{"code":101,"indent":0,"parameters":["",0,1,1,""]},{"code":401,"indent":0,"parameters":["Hey!\\.\\^"]},{"code":224,"indent":0,"parameters":[[255,255,255,238],30,false]},{"code":225,"indent":0,"parameters":[7,9,60,false]},{"code":224,"indent":0,"parameters":[[255,255,255,238],60,true]},{"code":117,"indent":0,"parameters":[2]},{"code":0,"indent":0,"parameters":[]}],"moveFrequency":3,"moveRoute":{"list":[{"code":0,"parameters":[]}],"repeat":true,"skippable":false,"wait":false},"moveSpeed":3,"moveType":0,"priorityType":0,"stepAnime":false,"through":false,"trigger":3,"walkAnime":false}],"x":2,"y":0}
]
}