{
"autoplayBgm":false,"autoplayBgs":false,"battleback1Name":"","battleback2Name":"","bgm":{"name":"","pan":0,"pitch":100,"volume":60},"bgs":{"name":"","pan":0,"pitch":100,"volume":60},"disableDashing":true,"displayName":"","encounterList":[],"encounterStep":999,"height":1,"note":"","parallaxLoopX":false,"parallaxLoopY":false,"parallaxName":"","parallaxShow":true,"parallaxSx":1,"parallaxSy":0,"scrollType":0,"specifyBattleback":false,"tilesetId":2,"width":2,
"data":[2816,-1,0,0,0,0,0,-1,0,0,0,0],
"events":[
null,
{"id":1,"name":"Tutorial","note":"","pages":[{"conditions":{"actorId":1,"actorValid":false,"itemId":1,"itemValid":false,"selfSwitchCh":"A","selfSwitchValid":false,"switch1Id":1,"switch1Valid":false,"switch2Id":1,"switch2Valid":false,"variableId":1,"variableValid":false,"variableValue":0},"directionFix":false,"image":{"characterIndex":0,"characterName":"","direction":2,"pattern":0,"tileId":0},"list":[{"code":102,"indent":0,"parameters":[["View the quick help","Start the game now"],1,0,1,1]},{"code":402,"indent":0,"parameters":[0,"View the quick help"]},{"code":101,"indent":1,"parameters":["",0,1,1,""]},{"code":401,"indent":1,"parameters":["You can play with the mouse or with the keyboard."]},{"code":101,"indent":1,"parameters":["",0,1,1,""]},{"code":401,"indent":1,"parameters":["Mouse: the left click is used to move or select/validate"]},{"code":401,"indent":1,"parameters":["an action, while the right click is used to cancel it or"]},{"code":401,"indent":1,"parameters":["display the menu."]},{"code":101,"indent":1,"parameters":["",0,1,1,""]},{"code":401,"indent":1,"parameters":["Keyboard: use the WASD keys to move/select an action, the"]},{"code":401,"indent":1,"parameters":["space bar or the Z key to confirm it. The X key is used to"]},{"code":401,"indent":1,"parameters":["cancel the action or display the menu. Help is integrated"]},{"code":401,"indent":1,"parameters":["in the game."]},{"code":101,"indent":1,"parameters":["",0,1,1,""]},{"code":401,"indent":1,"parameters":["Exploration: interact with objects, doors and creatures by"]},{"code":401,"indent":1,"parameters":["simply entering in contact with them. Not all of them are"]},{"code":401,"indent":1,"parameters":["active or \"visible\", it's up to you to discover them."]},{"code":101,"indent":1,"parameters":["",0,1,1,""]},{"code":401,"indent":1,"parameters":["Fighting: actions increase your fighting spirit which allows you"]},{"code":401,"indent":1,"parameters":["to perform beneficial commands. The fighting skills, although very"]},{"code":401,"indent":1,"parameters":["powerful, consume your fighting power. Guarding allows you to"]},{"code":401,"indent":1,"parameters":["protect yourself while recovering some of this power."]},{"code":101,"indent":1,"parameters":["",0,2,1,""]},{"code":401,"indent":1,"parameters":["Autosave: the game is automatically saved after each"]},{"code":401,"indent":1,"parameters":["completed scene."]},{"code":101,"indent":1,"parameters":["",0,1,1,""]},{"code":401,"indent":1,"parameters":["The rest is up to you to discover. Now let's play!"]},{"code":221,"indent":1,"parameters":[]},{"code":201,"indent":1,"parameters":[0,1,0,0,0,0]},{"code":0,"indent":1,"parameters":[]},{"code":402,"indent":0,"parameters":[1,"Start the game now"]},{"code":221,"indent":1,"parameters":[]},{"code":201,"indent":1,"parameters":[0,1,0,0,0,0]},{"code":0,"indent":1,"parameters":[]},{"code":404,"indent":0,"parameters":[]},{"code":0,"indent":0,"parameters":[]}],"moveFrequency":3,"moveRoute":{"list":[{"code":0,"parameters":[]}],"repeat":true,"skippable":false,"wait":false},"moveSpeed":3,"moveType":0,"priorityType":0,"stepAnime":false,"through":false,"trigger":3,"walkAnime":false}],"x":1,"y":0},
null,
null
]
}