{
  "fields": [
    {
      "constraints": {
        "required": true
      },
      "description": "Année de production de la donnée",
      "name": "annee",
      "title": "Année",
      "type": "integer"
    },
    {
      "constraints": {
        "pattern": "^\\w{9}",
        "required": true
      },
      "description": "Numéro FINESS de l'établissement géographique ou de l'entité juridique lié(e) à la donnée",
      "name": "finess",
      "title": "Numéro FINESS",
      "type": "string"
    },
    {
      "constraints": {
        "enum": [
          "geo",
          "jur"
        ],
        "required": true
      },
      "description": "Type de FINESS correspondant : \"geo\" pour un établissement géographique, \"jur\" pour une entité juridique",
      "name": "finess_type",
      "title": "Type de FINESS",
      "type": "string"
    },
    {
      "constraints": {
        "required": true
      },
      "description": "Clé de donnée, correspondance avec le champ \"name\" de la table metadata",
      "name": "key",
      "title": "Clé de donnée",
      "type": "string"
    },
    {
      "description": "Colonne contenant les valeurs des variables booléenne",
      "name": "value_boolean",
      "type": "boolean"
    },
    {
      "description": "Colonne contenant les valeurs des variables textuelles",
      "name": "value_string",
      "type": "string"
    },
    {
      "description": "Colonne contenant les valeurs des variables entières",
      "name": "value_integer",
      "type": "integer"
    },
    {
      "description": "Colonne contenant les valeurs des variables décimales",
      "name": "value_float",
      "type": "number"
    },
    {
      "description": "Colonne contenant les valeurs manquantes de tous les types de variables",
      "name": "missing_value",
      "type": "string"
    },
    {
      "description": "Colonne contenant les valeurs des variables temporelles",
      "name": "value_date",
      "type": "date"
    }
  ],
  "primaryKey": [
    "annee",
    "finess",
    "key"
  ],
  "title": "Fichier de données clé-valeur de la base BQSS"
}
