key,value,label
classement_48h,A,score >= 77.3
classement_48h,B,score dans l'intervalle [74-77.3[
classement_48h,C,score dans l'intervalle [70.7-74[
classement_48h,D,score < 70.7
classement_48h,DI,données insuffisantes (moins de 30 questionnaires exploitables)
classement_48h,NR,non répondant
