{
  "audio_dev": "default",
  "cameras": [
    {
      "hdr": "auto",
      "libcamera": true,
      "name": "0",
      "video_height": 720,
      "video_width": 1280
    }
  ],
  "force_h264_bitrate": 0,
  "h264_profile": "main",
  "http_address": "0.0.0.0",
  "http_port": "8000s",
  "hw_encoder": true,
  "log_path": "log",
  "mbrola_params": "-a 100 -s 120 -p 20 -v mb/mb-fr1",
  "picture_height": 1080,
  "picture_width": 1920,
  "record_path": "record",
  "robot_name": "carpi",
  "role_minimal_audio": "full",
  "role_minimal_video": "full",
  "shm_path": "/dev/shm/",
  "ssl_certificate": "nestorpi.pem",
  "stun_url": "stun.l.google.com:19302",
  "turn_url": "fmssoftware@hotmail.com:lolilol#numb.viagenie.ca"
}
