{
    "swagger": "2.0",
    "info": {
        "title": "Verwerkingenlogging API",
        "description": "Een API om een verwerkingenlogging (VLC) te benaderen.\n\n\nDe VERWERKINGSACTIE is het kernobject in deze API. De Verwerkingenlogging API heeft\ntot dusverre geen relaties met andere API's.\n\n**Autorisatie**\n\nDee API vereist autorisatie. Er is zijn eindpoints aangemaakt om een token te\nverkrijgen. Meer informatie over het aanmaken of refreshen van een token is te vinden\nonder het kopje \"token\" in de zijbalk. Een volledige lijst met scopes is hieronder\nte vinden. In de zijbalk is er meer informatie te vinden over beide endpoints.\n\nDe scopes corresponderen met de `vertrouwelijkheid`'s waarde op een VERWERKINGSACTIE.\n\n**Scopes**\n\n`read.normal` `read.confidential` `create.normal` `create.confidential` `update.normal` `update.confidential` `delete.normal` `delete.confidential`\n\n**Handige links**\n\n* [Documentatie](https://vng-realisatie.github.io/gemma-zaken/standaard)\n* [Zaakgericht werken](https://vng-realisatie.github.io/gemma-zaken)\n* [Postman collectie](https://documenter.getpostman.com/view/6277499/UVsEUoJQ)\n",
        "contact": {
            "url": "https://vng-realisatie.github.io/gemma-zaken",
            "email": "standaarden.ondersteuning@vng.nl"
        },
        "license": {
            "name": "EUPL 1.2",
            "url": "https://opensource.org/licenses/EUPL-1.2"
        },
        "version": "0.9.0-alpha2"
    },
    "basePath": "/api/v1",
    "consumes": [
        "application/json"
    ],
    "produces": [
        "application/json"
    ],
    "securityDefinitions": {
        "JWT-Claims": {
            "type": "http",
            "scheme": "bearer",
            "bearerFormat": "JWT"
        }
    },
    "security": [
        {
            "JWT-Claims": []
        }
    ],
    "paths": {
        "/token/": {
            "post": {
                "operationId": "token_create",
                "description": "",
                "parameters": [
                    {
                        "name": "Content-Type",
                        "in": "header",
                        "description": "Content type van de verzoekinhoud.",
                        "required": true,
                        "type": "string",
                        "enum": [
                            "application/json"
                        ]
                    },
                    {
                        "name": "data",
                        "in": "body",
                        "required": true,
                        "schema": {
                            "$ref": "#/definitions/TokenObtainPair"
                        }
                    }
                ],
                "responses": {
                    "201": {
                        "description": "Created",
                        "schema": {
                            "$ref": "#/definitions/TokenObtainPair"
                        },
                        "headers": {
                            "API-version": {
                                "schema": {
                                    "type": "string"
                                },
                                "description": "Geeft een specifieke API-versie aan in de context van een specifieke aanroep. Voorbeeld: 1.2.1."
                            },
                            "Location": {
                                "schema": {
                                    "type": "string",
                                    "format": "uri"
                                },
                                "description": "URL waar de resource leeft."
                            }
                        }
                    }
                },
                "tags": [
                    "token"
                ]
            },
            "parameters": []
        },
        "/token/refresh/": {
            "post": {
                "operationId": "token_refresh_create",
                "description": "",
                "parameters": [
                    {
                        "name": "Content-Type",
                        "in": "header",
                        "description": "Content type van de verzoekinhoud.",
                        "required": true,
                        "type": "string",
                        "enum": [
                            "application/json"
                        ]
                    },
                    {
                        "name": "data",
                        "in": "body",
                        "required": true,
                        "schema": {
                            "$ref": "#/definitions/TokenRefresh"
                        }
                    }
                ],
                "responses": {
                    "201": {
                        "description": "Created",
                        "schema": {
                            "$ref": "#/definitions/TokenRefresh"
                        },
                        "headers": {
                            "API-version": {
                                "schema": {
                                    "type": "string"
                                },
                                "description": "Geeft een specifieke API-versie aan in de context van een specifieke aanroep. Voorbeeld: 1.2.1."
                            },
                            "Location": {
                                "schema": {
                                    "type": "string",
                                    "format": "uri"
                                },
                                "description": "URL waar de resource leeft."
                            }
                        }
                    }
                },
                "tags": [
                    "token"
                ]
            },
            "parameters": []
        },
        "/verwerkingsacties": {
            "get": {
                "operationId": "verwerkingsactie_list",
                "description": "",
                "parameters": [
                    {
                        "name": "objecttype",
                        "in": "query",
                        "description": "Objecttype van een VERWERKTOBJECT.",
                        "required": true,
                        "type": "string"
                    },
                    {
                        "name": "soortObjectId",
                        "in": "query",
                        "description": "SoortObjectId van een VERWERKTOBJECT.",
                        "required": true,
                        "type": "string"
                    },
                    {
                        "name": "objectId",
                        "in": "query",
                        "description": "ObjectId van een VERWERKTOBJECT.",
                        "required": true,
                        "type": "string"
                    },
                    {
                        "name": "beginDatum",
                        "in": "query",
                        "description": "Begin datum van een VERWERKINGSACTIE.",
                        "required": false,
                        "type": "string"
                    },
                    {
                        "name": "eindDatum",
                        "in": "query",
                        "description": "Eind datum van een VERWERKINGSACTIE.",
                        "required": false,
                        "type": "string"
                    },
                    {
                        "name": "vertrouwelijkheid",
                        "in": "query",
                        "description": "Vertrouwelijkheid van een VERWERKINGSACTIE.",
                        "required": false,
                        "type": "string"
                    },
                    {
                        "name": "verwerkingsactiviteitId",
                        "in": "query",
                        "description": "Het ID van het verwerkingsactiviteit.",
                        "required": false,
                        "type": "string"
                    },
                    {
                        "name": "page",
                        "in": "query",
                        "description": "Een pagina binnen de gepagineerde set resultaten.",
                        "required": false,
                        "type": "integer"
                    }
                ],
                "responses": {
                    "200": {
                        "description": "OK",
                        "schema": {
                            "required": [
                                "count",
                                "results"
                            ],
                            "type": "object",
                            "properties": {
                                "count": {
                                    "type": "integer"
                                },
                                "next": {
                                    "type": "string",
                                    "format": "uri",
                                    "x-nullable": true
                                },
                                "previous": {
                                    "type": "string",
                                    "format": "uri",
                                    "x-nullable": true
                                },
                                "results": {
                                    "type": "array",
                                    "items": {
                                        "$ref": "#/definitions/Verwerkingsactie"
                                    }
                                }
                            }
                        },
                        "headers": {
                            "API-version": {
                                "schema": {
                                    "type": "string"
                                },
                                "description": "Geeft een specifieke API-versie aan in de context van een specifieke aanroep. Voorbeeld: 1.2.1."
                            }
                        }
                    },
                    "400": {
                        "$ref": "#/responses/400"
                    },
                    "401": {
                        "$ref": "#/responses/401"
                    },
                    "403": {
                        "$ref": "#/responses/403"
                    },
                    "406": {
                        "$ref": "#/responses/406"
                    },
                    "409": {
                        "$ref": "#/responses/409"
                    },
                    "410": {
                        "$ref": "#/responses/410"
                    },
                    "415": {
                        "$ref": "#/responses/415"
                    },
                    "429": {
                        "$ref": "#/responses/429"
                    },
                    "500": {
                        "$ref": "#/responses/500"
                    }
                },
                "tags": [
                    "verwerkingsacties"
                ]
            },
            "post": {
                "operationId": "verwerkingsactie_create",
                "description": "",
                "parameters": [
                    {
                        "name": "Content-Type",
                        "in": "header",
                        "description": "Content type van de verzoekinhoud.",
                        "required": true,
                        "type": "string",
                        "enum": [
                            "application/json"
                        ]
                    },
                    {
                        "name": "data",
                        "in": "body",
                        "required": true,
                        "schema": {
                            "$ref": "#/definitions/Verwerkingsactie"
                        }
                    }
                ],
                "responses": {
                    "201": {
                        "description": "Created",
                        "schema": {
                            "$ref": "#/definitions/Verwerkingsactie"
                        },
                        "headers": {
                            "API-version": {
                                "schema": {
                                    "type": "string"
                                },
                                "description": "Geeft een specifieke API-versie aan in de context van een specifieke aanroep. Voorbeeld: 1.2.1."
                            },
                            "Location": {
                                "schema": {
                                    "type": "string",
                                    "format": "uri"
                                },
                                "description": "URL waar de resource leeft."
                            }
                        }
                    },
                    "400": {
                        "$ref": "#/responses/400"
                    },
                    "401": {
                        "$ref": "#/responses/401"
                    },
                    "403": {
                        "$ref": "#/responses/403"
                    },
                    "406": {
                        "$ref": "#/responses/406"
                    },
                    "409": {
                        "$ref": "#/responses/409"
                    },
                    "410": {
                        "$ref": "#/responses/410"
                    },
                    "415": {
                        "$ref": "#/responses/415"
                    },
                    "429": {
                        "$ref": "#/responses/429"
                    },
                    "500": {
                        "$ref": "#/responses/500"
                    }
                },
                "tags": [
                    "verwerkingsacties"
                ]
            },
            "parameters": []
        },
        "/verwerkingsacties/{actieId}": {
            "get": {
                "operationId": "verwerkingsactie_read",
                "description": "",
                "parameters": [
                    {
                        "name": "If-None-Match",
                        "in": "header",
                        "description": "Voer een voorwaardelijk verzoek uit. Deze header moet \u00e9\u00e9n of meerdere ETag-waardes bevatten van resources die de consumer gecached heeft. Indien de waarde van de ETag van de huidige resource voorkomt in deze set, dan antwoordt de provider met een lege HTTP 304 request. Zie [MDN](https://developer.mozilla.org/en-US/docs/Web/HTTP/Headers/If-None-Match) voor meer informatie.",
                        "required": false,
                        "type": "string",
                        "examples": {
                            "oneValue": {
                                "summary": "E\u00e9n ETag-waarde",
                                "value": "\"79054025255fb1a26e4bc422aef54eb4\""
                            },
                            "multipleValues": {
                                "summary": "Meerdere ETag-waardes",
                                "value": "\"79054025255fb1a26e4bc422aef54eb4\", \"e4d909c290d0fb1ca068ffaddf22cbd0\""
                            }
                        }
                    }
                ],
                "responses": {
                    "200": {
                        "description": "OK",
                        "schema": {
                            "$ref": "#/definitions/Verwerkingsactie"
                        },
                        "headers": {
                            "ETag": {
                                "description": "De ETag berekend op de response body JSON. Indien twee resources exact dezelfde ETag hebben, dan zijn deze resources identiek aan elkaar. Je kan de ETag gebruiken om caching te implementeren.",
                                "type": "string"
                            },
                            "API-version": {
                                "schema": {
                                    "type": "string"
                                },
                                "description": "Geeft een specifieke API-versie aan in de context van een specifieke aanroep. Voorbeeld: 1.2.1."
                            }
                        }
                    },
                    "401": {
                        "$ref": "#/responses/401"
                    },
                    "403": {
                        "$ref": "#/responses/403"
                    },
                    "404": {
                        "$ref": "#/responses/404"
                    },
                    "406": {
                        "$ref": "#/responses/406"
                    },
                    "409": {
                        "$ref": "#/responses/409"
                    },
                    "410": {
                        "$ref": "#/responses/410"
                    },
                    "415": {
                        "$ref": "#/responses/415"
                    },
                    "429": {
                        "$ref": "#/responses/429"
                    },
                    "500": {
                        "$ref": "#/responses/500"
                    }
                },
                "tags": [
                    "verwerkingsacties"
                ]
            },
            "put": {
                "operationId": "verwerkingsactie_update",
                "description": "Creates a new Verwerkingsactie if the provided data passes validation.\nThis operation mixes behavior from DRF's update & create methods because\na new Verwerkingsactie is created.",
                "parameters": [
                    {
                        "name": "Content-Type",
                        "in": "header",
                        "description": "Content type van de verzoekinhoud.",
                        "required": true,
                        "type": "string",
                        "enum": [
                            "application/json"
                        ]
                    },
                    {
                        "name": "data",
                        "in": "body",
                        "required": true,
                        "schema": {
                            "$ref": "#/definitions/Verwerkingsactie"
                        }
                    }
                ],
                "responses": {
                    "200": {
                        "description": "OK",
                        "schema": {
                            "$ref": "#/definitions/Verwerkingsactie"
                        },
                        "headers": {
                            "API-version": {
                                "schema": {
                                    "type": "string"
                                },
                                "description": "Geeft een specifieke API-versie aan in de context van een specifieke aanroep. Voorbeeld: 1.2.1."
                            }
                        }
                    },
                    "400": {
                        "$ref": "#/responses/400"
                    },
                    "401": {
                        "$ref": "#/responses/401"
                    },
                    "403": {
                        "$ref": "#/responses/403"
                    },
                    "404": {
                        "$ref": "#/responses/404"
                    },
                    "406": {
                        "$ref": "#/responses/406"
                    },
                    "409": {
                        "$ref": "#/responses/409"
                    },
                    "410": {
                        "$ref": "#/responses/410"
                    },
                    "415": {
                        "$ref": "#/responses/415"
                    },
                    "429": {
                        "$ref": "#/responses/429"
                    },
                    "500": {
                        "$ref": "#/responses/500"
                    }
                },
                "tags": [
                    "verwerkingsacties"
                ]
            },
            "patch": {
                "operationId": "verwerkingsactie_partial_update",
                "description": "",
                "parameters": [
                    {
                        "name": "Content-Type",
                        "in": "header",
                        "description": "Content type van de verzoekinhoud.",
                        "required": true,
                        "type": "string",
                        "enum": [
                            "application/json"
                        ]
                    },
                    {
                        "name": "data",
                        "in": "body",
                        "required": true,
                        "schema": {
                            "$ref": "#/definitions/VerwerkingsactiePartialUpdate"
                        }
                    }
                ],
                "responses": {
                    "200": {
                        "description": "OK",
                        "schema": {
                            "$ref": "#/definitions/VerwerkingsactiePartialUpdate"
                        },
                        "headers": {
                            "API-version": {
                                "schema": {
                                    "type": "string"
                                },
                                "description": "Geeft een specifieke API-versie aan in de context van een specifieke aanroep. Voorbeeld: 1.2.1."
                            }
                        }
                    },
                    "400": {
                        "$ref": "#/responses/400"
                    },
                    "401": {
                        "$ref": "#/responses/401"
                    },
                    "403": {
                        "$ref": "#/responses/403"
                    },
                    "404": {
                        "$ref": "#/responses/404"
                    },
                    "406": {
                        "$ref": "#/responses/406"
                    },
                    "409": {
                        "$ref": "#/responses/409"
                    },
                    "410": {
                        "$ref": "#/responses/410"
                    },
                    "415": {
                        "$ref": "#/responses/415"
                    },
                    "429": {
                        "$ref": "#/responses/429"
                    },
                    "500": {
                        "$ref": "#/responses/500"
                    }
                },
                "tags": [
                    "verwerkingsacties"
                ]
            },
            "delete": {
                "operationId": "verwerkingsactie_delete",
                "description": "",
                "parameters": [],
                "responses": {
                    "204": {
                        "description": "No content",
                        "headers": {
                            "API-version": {
                                "schema": {
                                    "type": "string"
                                },
                                "description": "Geeft een specifieke API-versie aan in de context van een specifieke aanroep. Voorbeeld: 1.2.1."
                            }
                        }
                    },
                    "401": {
                        "$ref": "#/responses/401"
                    },
                    "403": {
                        "$ref": "#/responses/403"
                    },
                    "404": {
                        "$ref": "#/responses/404"
                    },
                    "406": {
                        "$ref": "#/responses/406"
                    },
                    "409": {
                        "$ref": "#/responses/409"
                    },
                    "410": {
                        "$ref": "#/responses/410"
                    },
                    "415": {
                        "$ref": "#/responses/415"
                    },
                    "429": {
                        "$ref": "#/responses/429"
                    },
                    "500": {
                        "$ref": "#/responses/500"
                    }
                },
                "tags": [
                    "verwerkingsacties"
                ]
            },
            "parameters": [
                {
                    "name": "actieId",
                    "in": "path",
                    "required": true,
                    "type": "string",
                    "format": "uuid"
                }
            ]
        },
        "/verwerkte-objecten": {
            "get": {
                "operationId": "verwerktobject_list",
                "description": "",
                "parameters": [
                    {
                        "name": "objecttype",
                        "in": "query",
                        "description": "Soort object dat verwerkt is.",
                        "required": false,
                        "type": "string",
                        "enum": [
                            "persoon"
                        ]
                    },
                    {
                        "name": "soortObjectId",
                        "in": "query",
                        "description": "Soort identificator waarmee het object ge\u00efdentificeerd wordt.",
                        "required": false,
                        "type": "string"
                    },
                    {
                        "name": "objectId",
                        "in": "query",
                        "description": "Identificator van het verwerkte object.",
                        "required": false,
                        "type": "string"
                    },
                    {
                        "name": "beginDatum",
                        "in": "query",
                        "description": "Begin datum van een VERWERKINGSACTIE.",
                        "required": false,
                        "type": "string"
                    },
                    {
                        "name": "eindDatum",
                        "in": "query",
                        "description": "Begin datum van een VERWERKINGSACTIE.",
                        "required": false,
                        "type": "string"
                    },
                    {
                        "name": "verwerkingsactiviteitId",
                        "in": "query",
                        "description": "Het ID van het verwerkingsactiviteit gekoppeld aan een VERWERKINGSACTIE.",
                        "required": false,
                        "type": "string"
                    },
                    {
                        "name": "page",
                        "in": "query",
                        "description": "Een pagina binnen de gepagineerde set resultaten.",
                        "required": false,
                        "type": "integer"
                    }
                ],
                "responses": {
                    "200": {
                        "description": "OK",
                        "schema": {
                            "required": [
                                "count",
                                "results"
                            ],
                            "type": "object",
                            "properties": {
                                "count": {
                                    "type": "integer"
                                },
                                "next": {
                                    "type": "string",
                                    "format": "uri",
                                    "x-nullable": true
                                },
                                "previous": {
                                    "type": "string",
                                    "format": "uri",
                                    "x-nullable": true
                                },
                                "results": {
                                    "type": "array",
                                    "items": {
                                        "$ref": "#/definitions/VerwerktObject"
                                    }
                                }
                            }
                        },
                        "headers": {
                            "API-version": {
                                "schema": {
                                    "type": "string"
                                },
                                "description": "Geeft een specifieke API-versie aan in de context van een specifieke aanroep. Voorbeeld: 1.2.1."
                            }
                        }
                    },
                    "400": {
                        "$ref": "#/responses/400"
                    },
                    "401": {
                        "$ref": "#/responses/401"
                    },
                    "403": {
                        "$ref": "#/responses/403"
                    },
                    "406": {
                        "$ref": "#/responses/406"
                    },
                    "409": {
                        "$ref": "#/responses/409"
                    },
                    "410": {
                        "$ref": "#/responses/410"
                    },
                    "415": {
                        "$ref": "#/responses/415"
                    },
                    "429": {
                        "$ref": "#/responses/429"
                    },
                    "500": {
                        "$ref": "#/responses/500"
                    }
                },
                "tags": [
                    "verwerkte-objecten"
                ]
            },
            "parameters": []
        },
        "/verwerkte-objecten/{verwerktObjectId}": {
            "get": {
                "operationId": "verwerktobject_read",
                "description": "",
                "parameters": [
                    {
                        "name": "If-None-Match",
                        "in": "header",
                        "description": "Voer een voorwaardelijk verzoek uit. Deze header moet \u00e9\u00e9n of meerdere ETag-waardes bevatten van resources die de consumer gecached heeft. Indien de waarde van de ETag van de huidige resource voorkomt in deze set, dan antwoordt de provider met een lege HTTP 304 request. Zie [MDN](https://developer.mozilla.org/en-US/docs/Web/HTTP/Headers/If-None-Match) voor meer informatie.",
                        "required": false,
                        "type": "string",
                        "examples": {
                            "oneValue": {
                                "summary": "E\u00e9n ETag-waarde",
                                "value": "\"79054025255fb1a26e4bc422aef54eb4\""
                            },
                            "multipleValues": {
                                "summary": "Meerdere ETag-waardes",
                                "value": "\"79054025255fb1a26e4bc422aef54eb4\", \"e4d909c290d0fb1ca068ffaddf22cbd0\""
                            }
                        }
                    }
                ],
                "responses": {
                    "200": {
                        "description": "OK",
                        "schema": {
                            "$ref": "#/definitions/VerwerktObject"
                        },
                        "headers": {
                            "ETag": {
                                "description": "De ETag berekend op de response body JSON. Indien twee resources exact dezelfde ETag hebben, dan zijn deze resources identiek aan elkaar. Je kan de ETag gebruiken om caching te implementeren.",
                                "type": "string"
                            },
                            "API-version": {
                                "schema": {
                                    "type": "string"
                                },
                                "description": "Geeft een specifieke API-versie aan in de context van een specifieke aanroep. Voorbeeld: 1.2.1."
                            }
                        }
                    },
                    "401": {
                        "$ref": "#/responses/401"
                    },
                    "403": {
                        "$ref": "#/responses/403"
                    },
                    "404": {
                        "$ref": "#/responses/404"
                    },
                    "406": {
                        "$ref": "#/responses/406"
                    },
                    "409": {
                        "$ref": "#/responses/409"
                    },
                    "410": {
                        "$ref": "#/responses/410"
                    },
                    "415": {
                        "$ref": "#/responses/415"
                    },
                    "429": {
                        "$ref": "#/responses/429"
                    },
                    "500": {
                        "$ref": "#/responses/500"
                    }
                },
                "tags": [
                    "verwerkte-objecten"
                ]
            },
            "parameters": [
                {
                    "name": "verwerktObjectId",
                    "in": "path",
                    "description": "Identificator van het verwerkte object. Deze ID wordt automatisch aangemaakt door het log.",
                    "required": true,
                    "type": "string",
                    "format": "uuid"
                }
            ]
        }
    },
    "definitions": {
        "TokenObtainPair": {
            "required": [
                "scopes"
            ],
            "type": "object",
            "properties": {
                "scopes": {
                    "type": "array",
                    "items": {
                        "type": "string",
                        "enum": [
                            "read:normal",
                            "read:confidential",
                            "create:normal",
                            "create:confidential",
                            "update:normal",
                            "update:confidential",
                            "delete:normal",
                            "delete:confidential"
                        ]
                    }
                }
            }
        },
        "TokenRefresh": {
            "required": [
                "refresh"
            ],
            "type": "object",
            "properties": {
                "refresh": {
                    "title": "Refresh",
                    "type": "string",
                    "minLength": 1
                },
                "access": {
                    "title": "Access",
                    "type": "string",
                    "readOnly": true,
                    "minLength": 1
                }
            }
        },
        "VerwerktSoortGegeven": {
            "required": [
                "soortGegeven"
            ],
            "type": "object",
            "properties": {
                "soortGegeven": {
                    "title": "Soortgegeven",
                    "type": "string",
                    "maxLength": 242,
                    "minLength": 1
                }
            }
        },
        "VerwerktObjectPartial": {
            "required": [
                "objecttype",
                "soortObjectId"
            ],
            "type": "object",
            "properties": {
                "objecttype": {
                    "title": "Objecttype",
                    "description": "Soort object dat verwerkt is.",
                    "type": "string",
                    "enum": [
                        "persoon"
                    ]
                },
                "soortObjectId": {
                    "title": "SoortObjectId",
                    "description": "Soort identificator waarmee het object ge\u00efdentificeerd wordt.",
                    "type": "string",
                    "maxLength": 242,
                    "minLength": 1
                },
                "objectId": {
                    "title": "ObjectId",
                    "description": "Identificator van het verwerkte object.",
                    "type": "string",
                    "maxLength": 40,
                    "x-nullable": true
                },
                "betrokkenheid": {
                    "title": "Betrokkenheid",
                    "description": "Geeft aan in welke hoedanigheid de persoon of het object betrokken was bij de verwerkingsactie.",
                    "type": "string",
                    "maxLength": 242,
                    "x-nullable": true
                },
                "verwerkteSoortenGegevens": {
                    "type": "array",
                    "items": {
                        "$ref": "#/definitions/VerwerktSoortGegeven"
                    }
                },
                "verwerktObjectId": {
                    "title": "VerwerktObjectId",
                    "description": "Identificator van het verwerkte object. Deze ID wordt automatisch aangemaakt door het log.",
                    "type": "string",
                    "format": "uuid",
                    "readOnly": true
                },
                "url": {
                    "title": "Url",
                    "description": "URL-referentie naar dit object. Dit is de unieke identificatie en locatie van dit object.",
                    "type": "string",
                    "format": "uri",
                    "readOnly": true,
                    "maxLength": 1000,
                    "minLength": 1
                }
            }
        },
        "Verwerkingsactie": {
            "required": [
                "tijdstip",
                "verwerkteObjecten"
            ],
            "type": "object",
            "properties": {
                "url": {
                    "title": "Url",
                    "description": "URL-referentie naar dit object. Dit is de unieke identificatie en locatie van dit object.",
                    "type": "string",
                    "format": "uri",
                    "readOnly": true,
                    "maxLength": 1000,
                    "minLength": 1
                },
                "actieId": {
                    "title": "ActieId",
                    "type": "string",
                    "format": "uuid",
                    "readOnly": true
                },
                "actieNaam": {
                    "title": "ActieNaam",
                    "type": "string",
                    "maxLength": 242,
                    "x-nullable": true
                },
                "handelingNaam": {
                    "title": "HandelingNaam",
                    "type": "string",
                    "maxLength": 242,
                    "x-nullable": true
                },
                "verwerkingNaam": {
                    "title": "VerwerkingNaam",
                    "type": "string",
                    "maxLength": 242,
                    "x-nullable": true
                },
                "verwerkingId": {
                    "title": "VerwerkingId",
                    "type": "string",
                    "format": "uuid",
                    "x-nullable": true
                },
                "verwerkingsactiviteitId": {
                    "title": "VerwerkingsactiviteitId",
                    "description": "Het ID van het verwerkingsactiviteit.",
                    "type": "string",
                    "format": "uuid",
                    "x-nullable": true
                },
                "verwerkingsactiviteitUrl": {
                    "title": "VerwerkingsactiviteitUrl",
                    "type": "string",
                    "format": "uri",
                    "maxLength": 2042,
                    "x-nullable": true
                },
                "vertrouwelijkheid": {
                    "title": "Vertrouwelijkheid",
                    "type": "string",
                    "enum": [
                        "normaal",
                        "vertrouwelijk",
                        "opgeheven"
                    ]
                },
                "bewaartermijn": {
                    "title": "Bewaartermijn",
                    "type": "string"
                },
                "uitvoerder": {
                    "title": "Uitvoerder",
                    "type": "string",
                    "pattern": "[0-9]{20}",
                    "maxLength": 20,
                    "x-nullable": true
                },
                "systeem": {
                    "title": "Systeem",
                    "type": "string",
                    "maxLength": 242,
                    "x-nullable": true
                },
                "gebruiker": {
                    "title": "Gebruiker",
                    "type": "string",
                    "maxLength": 40,
                    "x-nullable": true
                },
                "gegevensbron": {
                    "title": "Gegevensbron",
                    "type": "string",
                    "maxLength": 242,
                    "x-nullable": true
                },
                "soortAfnemerId": {
                    "title": "SoortAfnemerId",
                    "type": "string",
                    "maxLength": 242,
                    "x-nullable": true
                },
                "afnemerId": {
                    "title": "AfnemerId",
                    "type": "string",
                    "maxLength": 40,
                    "x-nullable": true
                },
                "verwerkingsactiviteitIdAfnemer": {
                    "title": "VerwerkingsactiviteitIdAfnemer",
                    "type": "string",
                    "format": "uuid",
                    "x-nullable": true
                },
                "verwerkingsactiviteitUrlAfnemer": {
                    "title": "VerwerkingsactiviteitUrlAfnemer",
                    "type": "string",
                    "format": "uri",
                    "maxLength": 2042,
                    "x-nullable": true
                },
                "verwerkingIdAfnemer": {
                    "title": "VerwerkingIdAfnemer",
                    "type": "string",
                    "format": "uuid",
                    "x-nullable": true
                },
                "tijdstip": {
                    "title": "Tijdstip",
                    "type": "string",
                    "format": "date-time"
                },
                "tijdstipRegistratie": {
                    "title": "TijdstipRegistratie",
                    "type": "string",
                    "format": "date-time",
                    "readOnly": true
                },
                "verwerkteObjecten": {
                    "type": "array",
                    "items": {
                        "$ref": "#/definitions/VerwerktObjectPartial"
                    }
                }
            }
        },
        "Fout": {
            "required": [
                "code",
                "title",
                "status",
                "detail",
                "instance"
            ],
            "type": "object",
            "properties": {
                "type": {
                    "title": "Type",
                    "description": "URI referentie naar het type fout, bedoeld voor developers",
                    "type": "string"
                },
                "code": {
                    "title": "Code",
                    "description": "Systeemcode die het type fout aangeeft",
                    "type": "string",
                    "minLength": 1
                },
                "title": {
                    "title": "Title",
                    "description": "Generieke titel voor het type fout",
                    "type": "string",
                    "minLength": 1
                },
                "status": {
                    "title": "Status",
                    "description": "De HTTP status code",
                    "type": "integer"
                },
                "detail": {
                    "title": "Detail",
                    "description": "Extra informatie bij de fout, indien beschikbaar",
                    "type": "string",
                    "minLength": 1
                },
                "instance": {
                    "title": "Instance",
                    "description": "URI met referentie naar dit specifiek voorkomen van de fout. Deze kan gebruikt worden in combinatie met server logs, bijvoorbeeld.",
                    "type": "string",
                    "minLength": 1
                }
            }
        },
        "FieldValidationError": {
            "required": [
                "name",
                "code",
                "reason"
            ],
            "type": "object",
            "properties": {
                "name": {
                    "title": "Name",
                    "description": "Naam van het veld met ongeldige gegevens",
                    "type": "string",
                    "minLength": 1
                },
                "code": {
                    "title": "Code",
                    "description": "Systeemcode die het type fout aangeeft",
                    "type": "string",
                    "minLength": 1
                },
                "reason": {
                    "title": "Reason",
                    "description": "Uitleg wat er precies fout is met de gegevens",
                    "type": "string",
                    "minLength": 1
                }
            }
        },
        "ValidatieFout": {
            "required": [
                "code",
                "title",
                "status",
                "detail",
                "instance",
                "invalid_params"
            ],
            "type": "object",
            "properties": {
                "type": {
                    "title": "Type",
                    "description": "URI referentie naar het type fout, bedoeld voor developers",
                    "type": "string"
                },
                "code": {
                    "title": "Code",
                    "description": "Systeemcode die het type fout aangeeft",
                    "type": "string",
                    "minLength": 1
                },
                "title": {
                    "title": "Title",
                    "description": "Generieke titel voor het type fout",
                    "type": "string",
                    "minLength": 1
                },
                "status": {
                    "title": "Status",
                    "description": "De HTTP status code",
                    "type": "integer"
                },
                "detail": {
                    "title": "Detail",
                    "description": "Extra informatie bij de fout, indien beschikbaar",
                    "type": "string",
                    "minLength": 1
                },
                "instance": {
                    "title": "Instance",
                    "description": "URI met referentie naar dit specifiek voorkomen van de fout. Deze kan gebruikt worden in combinatie met server logs, bijvoorbeeld.",
                    "type": "string",
                    "minLength": 1
                },
                "invalid_params": {
                    "type": "array",
                    "items": {
                        "$ref": "#/definitions/FieldValidationError"
                    }
                }
            }
        },
        "VerwerkingsactiePartialUpdate": {
            "type": "object",
            "properties": {
                "bewaartermijn": {
                    "title": "Bewaartermijn",
                    "type": "string"
                },
                "vertrouwelijkheid": {
                    "title": "Vertrouwelijkheid",
                    "type": "string",
                    "enum": [
                        "normaal",
                        "vertrouwelijk",
                        "opgeheven"
                    ]
                }
            }
        },
        "VerwerkingsactiePartial": {
            "required": [
                "tijdstip"
            ],
            "type": "object",
            "properties": {
                "url": {
                    "title": "Url",
                    "description": "URL-referentie naar dit object. Dit is de unieke identificatie en locatie van dit object.",
                    "type": "string",
                    "format": "uri",
                    "readOnly": true,
                    "maxLength": 1000,
                    "minLength": 1
                },
                "actieId": {
                    "title": "ActieId",
                    "type": "string",
                    "format": "uuid",
                    "readOnly": true
                },
                "actieNaam": {
                    "title": "ActieNaam",
                    "type": "string",
                    "maxLength": 242,
                    "x-nullable": true
                },
                "handelingNaam": {
                    "title": "HandelingNaam",
                    "type": "string",
                    "maxLength": 242,
                    "x-nullable": true
                },
                "verwerkingNaam": {
                    "title": "VerwerkingNaam",
                    "type": "string",
                    "maxLength": 242,
                    "x-nullable": true
                },
                "verwerkingId": {
                    "title": "VerwerkingId",
                    "type": "string",
                    "format": "uuid",
                    "x-nullable": true
                },
                "verwerkingsactiviteitId": {
                    "title": "VerwerkingsactiviteitId",
                    "description": "Het ID van het verwerkingsactiviteit.",
                    "type": "string",
                    "format": "uuid",
                    "x-nullable": true
                },
                "verwerkingsactiviteitUrl": {
                    "title": "VerwerkingsactiviteitUrl",
                    "type": "string",
                    "format": "uri",
                    "maxLength": 2042,
                    "x-nullable": true
                },
                "vertrouwelijkheid": {
                    "title": "Vertrouwelijkheid",
                    "type": "string",
                    "enum": [
                        "normaal",
                        "vertrouwelijk",
                        "opgeheven"
                    ]
                },
                "bewaartermijn": {
                    "title": "Bewaartermijn",
                    "type": "string"
                },
                "uitvoerder": {
                    "title": "Uitvoerder",
                    "type": "string",
                    "pattern": "[0-9]{20}",
                    "maxLength": 20,
                    "x-nullable": true
                },
                "soortAfnemerId": {
                    "title": "SoortAfnemerId",
                    "type": "string",
                    "maxLength": 242,
                    "x-nullable": true
                },
                "afnemerId": {
                    "title": "AfnemerId",
                    "type": "string",
                    "maxLength": 40,
                    "x-nullable": true
                },
                "verwerkingsactiviteitIdAfnemer": {
                    "title": "VerwerkingsactiviteitIdAfnemer",
                    "type": "string",
                    "format": "uuid",
                    "x-nullable": true
                },
                "verwerkingsactiviteitUrlAfnemer": {
                    "title": "VerwerkingsactiviteitUrlAfnemer",
                    "type": "string",
                    "format": "uri",
                    "maxLength": 2042,
                    "x-nullable": true
                },
                "verwerkingIdAfnemer": {
                    "title": "VerwerkingIdAfnemer",
                    "type": "string",
                    "format": "uuid",
                    "x-nullable": true
                },
                "tijdstip": {
                    "title": "Tijdstip",
                    "type": "string",
                    "format": "date-time"
                },
                "tijdstipRegistratie": {
                    "title": "TijdstipRegistratie",
                    "type": "string",
                    "format": "date-time",
                    "readOnly": true
                }
            }
        },
        "VerwerktObject": {
            "required": [
                "objecttype",
                "soortObjectId",
                "verwerkingsactie"
            ],
            "type": "object",
            "properties": {
                "objecttype": {
                    "title": "Objecttype",
                    "description": "Soort object dat verwerkt is.",
                    "type": "string",
                    "enum": [
                        "persoon"
                    ]
                },
                "soortObjectId": {
                    "title": "SoortObjectId",
                    "description": "Soort identificator waarmee het object ge\u00efdentificeerd wordt.",
                    "type": "string",
                    "maxLength": 242,
                    "minLength": 1
                },
                "objectId": {
                    "title": "ObjectId",
                    "description": "Identificator van het verwerkte object.",
                    "type": "string",
                    "maxLength": 40,
                    "x-nullable": true
                },
                "betrokkenheid": {
                    "title": "Betrokkenheid",
                    "description": "Geeft aan in welke hoedanigheid de persoon of het object betrokken was bij de verwerkingsactie.",
                    "type": "string",
                    "maxLength": 242,
                    "x-nullable": true
                },
                "verwerkteSoortenGegevens": {
                    "type": "array",
                    "items": {
                        "$ref": "#/definitions/VerwerktSoortGegeven"
                    }
                },
                "verwerktObjectId": {
                    "title": "VerwerktObjectId",
                    "description": "Identificator van het verwerkte object. Deze ID wordt automatisch aangemaakt door het log.",
                    "type": "string",
                    "format": "uuid",
                    "readOnly": true
                },
                "url": {
                    "title": "Url",
                    "description": "URL-referentie naar dit object. Dit is de unieke identificatie en locatie van dit object.",
                    "type": "string",
                    "format": "uri",
                    "readOnly": true,
                    "maxLength": 1000,
                    "minLength": 1
                },
                "verwerkingsactie": {
                    "$ref": "#/definitions/VerwerkingsactiePartial"
                }
            }
        }
    },
    "responses": {
        "400": {
            "description": "Bad request",
            "schema": {
                "$ref": "#/definitions/ValidatieFout"
            },
            "headers": {
                "API-version": {
                    "schema": {
                        "type": "string"
                    },
                    "description": "Geeft een specifieke API-versie aan in de context van een specifieke aanroep. Voorbeeld: 1.2.1."
                }
            }
        },
        "401": {
            "description": "Unauthorized",
            "schema": {
                "$ref": "#/definitions/Fout"
            },
            "headers": {
                "API-version": {
                    "schema": {
                        "type": "string"
                    },
                    "description": "Geeft een specifieke API-versie aan in de context van een specifieke aanroep. Voorbeeld: 1.2.1."
                }
            }
        },
        "403": {
            "description": "Forbidden",
            "schema": {
                "$ref": "#/definitions/Fout"
            },
            "headers": {
                "API-version": {
                    "schema": {
                        "type": "string"
                    },
                    "description": "Geeft een specifieke API-versie aan in de context van een specifieke aanroep. Voorbeeld: 1.2.1."
                }
            }
        },
        "404": {
            "description": "Not found",
            "schema": {
                "$ref": "#/definitions/Fout"
            },
            "headers": {
                "API-version": {
                    "schema": {
                        "type": "string"
                    },
                    "description": "Geeft een specifieke API-versie aan in de context van een specifieke aanroep. Voorbeeld: 1.2.1."
                }
            }
        },
        "406": {
            "description": "Not acceptable",
            "schema": {
                "$ref": "#/definitions/Fout"
            },
            "headers": {
                "API-version": {
                    "schema": {
                        "type": "string"
                    },
                    "description": "Geeft een specifieke API-versie aan in de context van een specifieke aanroep. Voorbeeld: 1.2.1."
                }
            }
        },
        "409": {
            "description": "Conflict",
            "schema": {
                "$ref": "#/definitions/Fout"
            },
            "headers": {
                "API-version": {
                    "schema": {
                        "type": "string"
                    },
                    "description": "Geeft een specifieke API-versie aan in de context van een specifieke aanroep. Voorbeeld: 1.2.1."
                }
            }
        },
        "410": {
            "description": "Gone",
            "schema": {
                "$ref": "#/definitions/Fout"
            },
            "headers": {
                "API-version": {
                    "schema": {
                        "type": "string"
                    },
                    "description": "Geeft een specifieke API-versie aan in de context van een specifieke aanroep. Voorbeeld: 1.2.1."
                }
            }
        },
        "412": {
            "description": "Precondition failed",
            "schema": {
                "$ref": "#/definitions/Fout"
            },
            "headers": {
                "API-version": {
                    "schema": {
                        "type": "string"
                    },
                    "description": "Geeft een specifieke API-versie aan in de context van een specifieke aanroep. Voorbeeld: 1.2.1."
                }
            }
        },
        "415": {
            "description": "Unsupported media type",
            "schema": {
                "$ref": "#/definitions/Fout"
            },
            "headers": {
                "API-version": {
                    "schema": {
                        "type": "string"
                    },
                    "description": "Geeft een specifieke API-versie aan in de context van een specifieke aanroep. Voorbeeld: 1.2.1."
                }
            }
        },
        "429": {
            "description": "Too many requests",
            "schema": {
                "$ref": "#/definitions/Fout"
            },
            "headers": {
                "API-version": {
                    "schema": {
                        "type": "string"
                    },
                    "description": "Geeft een specifieke API-versie aan in de context van een specifieke aanroep. Voorbeeld: 1.2.1."
                }
            }
        },
        "500": {
            "description": "Internal server error",
            "schema": {
                "$ref": "#/definitions/Fout"
            },
            "headers": {
                "API-version": {
                    "schema": {
                        "type": "string"
                    },
                    "description": "Geeft een specifieke API-versie aan in de context van een specifieke aanroep. Voorbeeld: 1.2.1."
                }
            }
        }
    },
    "tags": [
        {
            "name": "",
            "description": ""
        },
        {
            "name": "verwerkingsacties",
            "description": ""
        },
        {
            "name": "verwerkte-objecten",
            "description": ""
        }
    ]
}
