EESchema Schematic File Version 4
LIBS:shield-cache
EELAYER 26 0
EELAYER END
$Descr A4 11693 8268
encoding utf-8
Sheet 3 3
Title "Music Shield"
Date "2020-10-17"
Rev "r1"
Comp "(c) 2020 Andreas Messer"
Comment1 "Radio Receiver"
Comment2 ""
Comment3 ""
Comment4 ""
$EndDescr
$Comp
L Device:L L303
U 1 1 558C8089
P 4100 2700
F 0 "L303" H 4000 2650 50  0000 C CNN
F 1 "22nH" H 4000 2750 50  0000 C CNN
F 2 "Resistors_SMD:R_0402_NoSilk" H 4100 2700 60  0001 C CNN
F 3 "~" H 4100 2700 60  0000 C CNN
	1    4100 2700
	-1   0    0    1   
$EndComp
$Comp
L Device:L L302
U 1 1 558C816A
P 3900 2800
F 0 "L302" H 3900 2350 50  0000 C CNN
F 1 "120nH" H 3900 2450 50  0000 C CNN
F 2 "Resistors_SMD:R_0402_NoSilk" H 3900 2800 60  0001 C CNN
F 3 "~" H 3900 2800 60  0000 C CNN
	1    3900 2800
	-1   0    0    1   
$EndComp
$Comp
L Device:C C?
U 1 1 558C83F6
P 3700 2800
AR Path="/558C83F6" Ref="C?"  Part="1" 
AR Path="/559EC5B3/558C83F6" Ref="C?"  Part="1" 
AR Path="/5F6294E6/558C83F6" Ref="C303"  Part="1" 
F 0 "C303" H 3700 2900 40  0000 R CNN
F 1 "2.7pF" H 3700 2700 40  0000 R CNN
F 2 "Capacitors_SMD:C_0402_NoSilk" H 3738 2650 30  0001 C CNN
F 3 "~" H 3700 2800 60  0000 C CNN
	1    3700 2800
	1    0    0    -1  
$EndComp
$Comp
L Device:L L301
U 1 1 558C8401
P 3500 2500
F 0 "L301" V 3650 2500 50  0000 C CNN
F 1 "18nH" V 3550 2500 50  0000 C CNN
F 2 "Resistors_SMD:R_0402_NoSilk" H 3500 2500 60  0001 C CNN
F 3 "~" H 3500 2500 60  0000 C CNN
	1    3500 2500
	0    -1   -1   0   
$EndComp
$Comp
L Device:C C?
U 1 1 558C856A
P 3150 2500
AR Path="/558C856A" Ref="C?"  Part="1" 
AR Path="/559EC5B3/558C856A" Ref="C?"  Part="1" 
AR Path="/5F6294E6/558C856A" Ref="C302"  Part="1" 
F 0 "C302" H 3150 2600 40  0000 L CNN
F 1 "33pF" H 3156 2415 40  0000 L CNN
F 2 "Capacitors_SMD:C_0402_NoSilk" H 3188 2350 30  0001 C CNN
F 3 "~" H 3150 2500 60  0000 C CNN
	1    3150 2500
	0    -1   -1   0   
$EndComp
Text HLabel 7250 3200 2    60   Input ~ 0
I2S_CLK
Text HLabel 7250 3300 2    60   Input ~ 0
I2S_WS
Text HLabel 7250 3400 2    60   Output ~ 0
I2S_OUT
Wire Wire Line
	3650 2500 3700 2500
Connection ~ 3900 2500
Wire Wire Line
	3700 2500 3700 2650
Connection ~ 3700 2500
Wire Wire Line
	3300 2500 3350 2500
Wire Wire Line
	2650 2500 2950 2500
Connection ~ 2950 2500
Wire Wire Line
	3700 3100 3900 3100
Text Notes 4700 5150 0    50   ~ 0
I2C Addr: 0x64
Wire Wire Line
	3900 2500 3900 2650
Wire Wire Line
	3700 2500 3900 2500
Wire Wire Line
	2950 2500 3000 2500
Wire Wire Line
	4150 2500 4100 2500
Wire Wire Line
	4100 2500 4100 2550
Wire Wire Line
	4100 2850 4100 2900
Wire Wire Line
	4100 2900 4150 2900
Wire Wire Line
	3900 2500 4100 2500
Connection ~ 4100 2500
Wire Wire Line
	4150 3100 4100 3100
Wire Wire Line
	4100 3100 4100 3200
Wire Wire Line
	4150 3300 4100 3300
Connection ~ 4100 3300
Wire Wire Line
	4100 3300 4100 3400
Wire Wire Line
	4150 3200 4100 3200
Connection ~ 4100 3200
Wire Wire Line
	4100 3200 4100 3300
$Comp
L Power_Protection:CM1213A-01SO D301
U 1 1 5F73B3BA
P 2950 2750
F 0 "D301" H 3050 2550 50  0000 C CNN
F 1 "CM1213A-01SO" H 2850 2900 50  0000 C CNN
F 2 "TO_SOT_Packages_SMD:SOT-23" H 3000 2580 50  0001 L CNN
F 3 "http://www.onsemi.com/pub_link/Collateral/CM1213A-D.PDF" V 2875 2830 50  0001 C CNN
	1    2950 2750
	-1   0    0    1   
$EndComp
Wire Wire Line
	2950 2500 2950 2550
Wire Wire Line
	3900 3100 4100 3100
Connection ~ 3900 3100
Connection ~ 4100 3100
$Comp
L Device:Ferrite_Bead_Small FB301
U 1 1 5F7C1618
P 3950 3600
F 0 "FB301" V 3713 3600 50  0000 C CNN
F 1 "1kOhm@100Mhz" V 3804 3600 50  0000 C CNN
F 2 "Resistors_SMD:R_0402" V 3880 3600 50  0001 C CNN
F 3 "~" H 3950 3600 50  0001 C CNN
F 4 "BLM15HG102SN1D" H 3950 3600 50  0001 C CNN "MPN"
F 5 "Murata" H 0   0   50  0001 C CNN "Manufacturer"
	1    3950 3600
	0    1    1    0   
$EndComp
$Comp
L Device:C C305
U 1 1 5F7C1D27
P 4100 3800
F 0 "C305" H 4100 3900 50  0000 L CNN
F 1 "100nF LESL" H 3900 3550 50  0000 L CNN
F 2 "ProjectFootprints:C_0204" H 4138 3650 50  0001 C CNN
F 3 "~" H 4100 3800 50  0001 C CNN
F 4 "LWK105C7104MP-F" H 4100 3800 50  0001 C CNN "MPN"
	1    4100 3800
	1    0    0    -1  
$EndComp
Wire Wire Line
	4150 3600 4100 3600
Wire Wire Line
	4100 3600 4100 3650
Connection ~ 4100 3600
Wire Wire Line
	4100 3600 4050 3600
Wire Wire Line
	4100 3950 4100 4000
Wire Wire Line
	4100 4000 4150 4000
$Comp
L Device:C C304
U 1 1 5F7E0233
P 3800 3800
F 0 "C304" H 3800 3900 50  0000 R CNN
F 1 "100nF LESL" H 3350 3650 50  0000 L CNN
F 2 "ProjectFootprints:C_0204" H 3838 3650 50  0001 C CNN
F 3 "~" H 3800 3800 50  0001 C CNN
F 4 "LWK105C7104MP-F" H 3800 3800 50  0001 C CNN "MPN"
	1    3800 3800
	1    0    0    -1  
$EndComp
Wire Wire Line
	3850 3600 3800 3600
Wire Wire Line
	3800 3600 3800 3650
Wire Wire Line
	3800 4000 3800 3950
Wire Wire Line
	4150 5000 4100 5000
Wire Wire Line
	4100 5000 4100 4900
Wire Wire Line
	4100 4900 4150 4900
Connection ~ 4100 5000
Wire Wire Line
	4100 5000 4100 5050
Wire Wire Line
	4100 4900 4100 4800
Wire Wire Line
	4100 4800 4150 4800
Connection ~ 4100 4900
Wire Wire Line
	4100 4800 4100 4700
Wire Wire Line
	4100 4700 4150 4700
Connection ~ 4100 4800
Wire Wire Line
	4100 4700 4100 4600
Wire Wire Line
	4100 4600 4150 4600
Connection ~ 4100 4700
Wire Wire Line
	3550 3600 3800 3600
Connection ~ 3800 3600
$Comp
L Device:Crystal_GND24 Y301
U 1 1 5F85EE57
P 3900 4500
F 0 "Y301" H 3450 4550 50  0000 L CNN
F 1 "19.2Mhz" H 3450 4450 50  0000 L CNN
F 2 "Crystals:Crystal_SMD_3225-4pin_3.2x2.5mm" H 3900 4500 50  0001 C CNN
F 3 "~" H 3900 4500 50  0001 C CNN
F 4 "<12pF Load, ESR <250Ohm" H 3900 4500 50  0001 C CNN "Comment"
	1    3900 4500
	1    0    0    -1  
$EndComp
Connection ~ 4100 4600
Wire Wire Line
	4050 4500 4150 4500
Wire Wire Line
	3750 4500 3700 4500
Wire Wire Line
	3700 4500 3700 4200
Wire Wire Line
	3700 4200 4150 4200
Wire Wire Line
	3900 4700 3900 4800
Wire Wire Line
	3900 4800 4100 4800
Wire Wire Line
	3900 4300 3900 4250
Wire Wire Line
	3900 4250 4100 4250
Wire Wire Line
	4100 4250 4100 4600
$Comp
L ProjectSymbols:SI4688-A10-GM U301
U 1 1 5F6E6E7F
P 5000 3700
F 0 "U301" H 5000 5000 60  0000 C CNN
F 1 "SI4688-A10-GM" H 5000 2400 60  0000 C CNN
F 2 "Housings_DFN_QFN:QFN-48-1EP_7x7mm_Pitch0.5mm" H 5000 3700 60  0001 C CNN
F 3 "" H 5000 3350 60  0000 C CNN
F 4 "Si4688-A10-GM" H 0   0   50  0001 C CNN "MPN"
F 5 "Silicon Labs" H 0   0   50  0001 C CNN "Manufacturer"
	1    5000 3700
	1    0    0    -1  
$EndComp
$Comp
L ProjectSymbols:SerialFlash_SOIC U302
U 1 1 5F986F0E
P 6700 2700
F 0 "U302" H 6725 3165 50  0000 C CNN
F 1 "SST26WF016B-104I/SN" H 6725 3074 50  0000 C CNN
F 2 "Housings_SOIC:SOIC-8_3.9x4.9mm_Pitch1.27mm" H 6700 2700 50  0001 C CNN
F 3 "" H 6700 2700 50  0001 C CNN
F 4 "SST26WF016B-104I/SN" H 0   0   50  0001 C CNN "MPN"
F 5 "Microchip" H 0   0   50  0001 C CNN "Manufacturer"
	1    6700 2700
	1    0    0    -1  
$EndComp
Wire Wire Line
	7300 2800 7350 2800
Wire Wire Line
	7350 2800 7350 3000
Wire Wire Line
	7350 3000 6000 3000
Wire Wire Line
	6000 2700 5850 2700
Wire Wire Line
	6000 3000 6000 2700
Wire Wire Line
	7300 2700 7400 2700
Wire Wire Line
	7400 2700 7400 3050
Wire Wire Line
	7400 3050 5950 3050
Wire Wire Line
	5950 3050 5950 2800
Wire Wire Line
	5950 2800 5850 2800
Wire Wire Line
	6150 2700 6100 2700
Wire Wire Line
	6100 2700 6100 2150
Wire Wire Line
	6100 2150 7350 2150
Wire Wire Line
	7350 2150 7350 2500
Wire Wire Line
	7350 2500 7300 2500
Wire Wire Line
	7350 2500 7350 2600
Wire Wire Line
	7350 2600 7300 2600
Connection ~ 7350 2500
Wire Wire Line
	5850 2500 6150 2500
Wire Wire Line
	5850 2600 6150 2600
NoConn ~ 5850 3000
NoConn ~ 5850 3100
NoConn ~ 5850 3200
$Comp
L Device:C C306
U 1 1 5FA8C178
P 6000 4800
F 0 "C306" H 6000 4900 50  0000 L CNN
F 1 "100nF LESL" H 5800 4500 50  0000 L CNN
F 2 "ProjectFootprints:C_0204" H 6038 4650 50  0001 C CNN
F 3 "~" H 6000 4800 50  0001 C CNN
F 4 "LWK105C7104MP-F" H 6000 4800 50  0001 C CNN "MPN"
	1    6000 4800
	1    0    0    -1  
$EndComp
$Comp
L Device:C C308
U 1 1 5FA8C5FC
P 6650 4700
F 0 "C308" H 6650 4800 50  0000 L CNN
F 1 "100nF LESL" H 6450 4300 50  0000 L CNN
F 2 "ProjectFootprints:C_0204" H 6688 4550 50  0001 C CNN
F 3 "~" H 6650 4700 50  0001 C CNN
F 4 "LWK105C7104MP-F" H 6650 4700 50  0001 C CNN "MPN"
	1    6650 4700
	1    0    0    -1  
$EndComp
Wire Wire Line
	5850 5000 6000 5000
Wire Wire Line
	6000 5000 6000 4950
Connection ~ 6000 5000
Wire Wire Line
	6300 5000 6300 4950
Wire Wire Line
	6000 4600 6000 4650
Connection ~ 6000 4600
$Comp
L Device:C C?
U 1 1 5FB46B93
P 6300 4800
AR Path="/5FB46B93" Ref="C?"  Part="1" 
AR Path="/559EC5B3/5FB46B93" Ref="C?"  Part="1" 
AR Path="/5F6294E6/5FB46B93" Ref="C307"  Part="1" 
F 0 "C307" H 6300 4900 40  0000 L CNN
F 1 "1uF" H 6306 4715 40  0000 L CNN
F 2 "Capacitors_SMD:C_0603" H 6338 4650 30  0001 C CNN
F 3 "~" H 6300 4800 60  0000 C CNN
	1    6300 4800
	1    0    0    -1  
$EndComp
Wire Wire Line
	6650 5000 6650 4850
Wire Wire Line
	7350 2500 7550 2500
$Comp
L power:+1V8 #PWR0303
U 1 1 5F6EC9B2
P 3550 3600
F 0 "#PWR0303" H 3550 3450 50  0001 C CNN
F 1 "+1V8" V 3565 3728 50  0000 L CNN
F 2 "" H 3550 3600 50  0001 C CNN
F 3 "" H 3550 3600 50  0001 C CNN
	1    3550 3600
	0    -1   -1   0   
$EndComp
$Comp
L power:+1V8 #PWR0313
U 1 1 5F6ECB66
P 7600 2500
F 0 "#PWR0313" H 7600 2350 50  0001 C CNN
F 1 "+1V8" V 7615 2628 50  0000 L CNN
F 2 "" H 7600 2500 50  0001 C CNN
F 3 "" H 7600 2500 50  0001 C CNN
	1    7600 2500
	0    1    1    0   
$EndComp
$Comp
L power:+1V8 #PWR0311
U 1 1 5F6ECD2B
P 7300 4500
F 0 "#PWR0311" H 7300 4350 50  0001 C CNN
F 1 "+1V8" V 7315 4628 50  0000 L CNN
F 2 "" H 7300 4500 50  0001 C CNN
F 3 "" H 7300 4500 50  0001 C CNN
	1    7300 4500
	0    1    1    0   
$EndComp
$Comp
L power:GND #PWR0308
U 1 1 5F6ECF91
P 6100 2850
F 0 "#PWR0308" H 6100 2600 50  0001 C CNN
F 1 "GND" H 6105 2677 50  0001 C CNN
F 2 "" H 6100 2850 50  0001 C CNN
F 3 "" H 6100 2850 50  0001 C CNN
	1    6100 2850
	1    0    0    -1  
$EndComp
Wire Wire Line
	6100 2800 6100 2850
$Comp
L power:GND #PWR0310
U 1 1 5F7075B7
P 6950 4900
F 0 "#PWR0310" H 6950 4650 50  0001 C CNN
F 1 "GND" H 6955 4727 50  0001 C CNN
F 2 "" H 6950 4900 50  0001 C CNN
F 3 "" H 6950 4900 50  0001 C CNN
	1    6950 4900
	1    0    0    -1  
$EndComp
$Comp
L power:GND #PWR0306
U 1 1 5F7075F2
P 4100 5050
F 0 "#PWR0306" H 4100 4800 50  0001 C CNN
F 1 "GND" H 4105 4877 50  0001 C CNN
F 2 "" H 4100 5050 50  0001 C CNN
F 3 "" H 4100 5050 50  0001 C CNN
	1    4100 5050
	1    0    0    -1  
$EndComp
$Comp
L power:GND #PWR0304
U 1 1 5F70FD3B
P 3800 4000
F 0 "#PWR0304" H 3800 3750 50  0001 C CNN
F 1 "GND" H 3805 3827 50  0001 C CNN
F 2 "" H 3800 4000 50  0001 C CNN
F 3 "" H 3800 4000 50  0001 C CNN
	1    3800 4000
	1    0    0    -1  
$EndComp
$Comp
L power:GND #PWR0305
U 1 1 5F70FF78
P 3900 3150
F 0 "#PWR0305" H 3900 2900 50  0001 C CNN
F 1 "GND" H 3905 2977 50  0001 C CNN
F 2 "" H 3900 3150 50  0001 C CNN
F 3 "" H 3900 3150 50  0001 C CNN
	1    3900 3150
	1    0    0    -1  
$EndComp
Wire Wire Line
	3900 3100 3900 3150
$Comp
L power:GND #PWR0302
U 1 1 5F739C25
P 2700 2900
F 0 "#PWR0302" H 2700 2650 50  0001 C CNN
F 1 "GND" H 2705 2727 50  0001 C CNN
F 2 "" H 2700 2900 50  0001 C CNN
F 3 "" H 2700 2900 50  0001 C CNN
	1    2700 2900
	1    0    0    -1  
$EndComp
Wire Wire Line
	5850 4600 5900 4600
Connection ~ 6650 4500
Wire Wire Line
	5850 4700 5900 4700
Wire Wire Line
	5900 4700 5900 4600
Connection ~ 5900 4600
Wire Wire Line
	5900 4600 6000 4600
Wire Wire Line
	5850 4500 6000 4500
Wire Wire Line
	6300 4650 6300 4600
Connection ~ 6300 4500
Wire Wire Line
	6300 4500 6650 4500
$Comp
L Device:C C?
U 1 1 5F70E347
P 6950 4700
AR Path="/5F70E347" Ref="C?"  Part="1" 
AR Path="/559EC5B3/5F70E347" Ref="C?"  Part="1" 
AR Path="/5F6294E6/5F70E347" Ref="C309"  Part="1" 
F 0 "C309" H 6950 4800 40  0000 L CNN
F 1 "1uF" H 6956 4615 40  0000 L CNN
F 2 "Capacitors_SMD:C_0603" H 6988 4550 30  0001 C CNN
F 3 "~" H 6950 4700 60  0000 C CNN
	1    6950 4700
	1    0    0    -1  
$EndComp
Wire Wire Line
	6650 5000 6300 5000
Connection ~ 6300 5000
Wire Wire Line
	7300 4500 6950 4500
Wire Wire Line
	6950 4550 6950 4500
Connection ~ 6950 4500
Wire Wire Line
	6950 4500 6650 4500
Connection ~ 6300 4600
Wire Wire Line
	6300 4600 6300 4500
Wire Wire Line
	6650 4500 6650 4550
Wire Wire Line
	6950 4850 6950 4900
Wire Wire Line
	5850 3900 6000 3900
Wire Wire Line
	6000 3900 6000 4500
Connection ~ 6000 4500
Wire Wire Line
	6000 4500 6300 4500
$Comp
L power:GND #PWR0307
U 1 1 5F76E7A5
P 5900 4350
F 0 "#PWR0307" H 5900 4100 50  0001 C CNN
F 1 "GND" H 5905 4177 50  0001 C CNN
F 2 "" H 5900 4350 50  0001 C CNN
F 3 "" H 5900 4350 50  0001 C CNN
	1    5900 4350
	1    0    0    -1  
$EndComp
Wire Wire Line
	5850 4000 5900 4000
Wire Wire Line
	5900 4000 5900 4300
Wire Wire Line
	5850 4300 5900 4300
Connection ~ 5900 4300
Wire Wire Line
	5900 4300 5900 4350
$Comp
L Device:R R302
U 1 1 5F7C0C1A
P 6200 3850
F 0 "R302" H 6050 3850 40  0000 C CNN
F 1 "10k" V 6207 3851 40  0000 C CNN
F 2 "Resistors_SMD:R_0603" V 6130 3850 30  0001 C CNN
F 3 "~" H 6200 3850 30  0000 C CNN
	1    6200 3850
	1    0    0    -1  
$EndComp
$Comp
L power:GND #PWR0309
U 1 1 5F7C0D98
P 6200 4350
F 0 "#PWR0309" H 6200 4100 50  0001 C CNN
F 1 "GND" H 6205 4177 50  0001 C CNN
F 2 "" H 6200 4350 50  0001 C CNN
F 3 "" H 6200 4350 50  0001 C CNN
	1    6200 4350
	1    0    0    -1  
$EndComp
Wire Wire Line
	6200 4000 6200 4350
Wire Wire Line
	6200 3600 6200 3700
Wire Wire Line
	5850 4200 6350 4200
Wire Wire Line
	6350 4200 6350 4300
Text HLabel 7250 4100 2    50   BiDi ~ 0
I2C_SCL
Text HLabel 7250 4300 2    50   BiDi ~ 0
I2C_SDA
Text HLabel 7250 3600 2    50   Input ~ 0
RESET
Text HLabel 7250 3500 2    50   BiDi ~ 0
~INT~
$Comp
L Connector:Conn_Coaxial J?
U 1 1 5F8AB6CA
P 2450 2500
AR Path="/5F8AB6CA" Ref="J?"  Part="1" 
AR Path="/5F6294E6/5F8AB6CA" Ref="J301"  Part="1" 
F 0 "J301" H 2550 2550 50  0000 L CNN
F 1 "SMA" H 2550 2450 50  0000 L CNN
F 2 "ProjectFootprints:MOLEX_SMA_JACK_73251" H 2450 2500 50  0001 C CNN
F 3 " ~" H 2450 2500 50  0001 C CNN
F 4 "73251" H 0   0   50  0001 C CNN "MPN"
F 5 "Molex" H 0   0   50  0001 C CNN "Manufacturer"
	1    2450 2500
	-1   0    0    -1  
$EndComp
$Comp
L Device:R R301
U 1 1 5F8B4F55
P 2550 2950
F 0 "R301" H 2600 3100 50  0000 L CNN
F 1 "1M" V 2550 2950 50  0000 C CNN
F 2 "Resistors_SMD:R_0603" V 2480 2950 50  0001 C CNN
F 3 "~" H 2550 2950 50  0001 C CNN
	1    2550 2950
	1    0    0    1   
$EndComp
Wire Wire Line
	2350 2800 2350 2750
Wire Wire Line
	2350 2750 2450 2750
Wire Wire Line
	2550 2750 2550 2800
Wire Wire Line
	2450 2700 2450 2750
Connection ~ 2450 2750
Wire Wire Line
	2450 2750 2550 2750
Wire Wire Line
	2350 3100 2350 3150
Wire Wire Line
	2350 3150 2450 3150
Wire Wire Line
	2550 3150 2550 3100
$Comp
L power:GND #PWR0301
U 1 1 5F91C730
P 2450 3200
F 0 "#PWR0301" H 2450 2950 50  0001 C CNN
F 1 "GND" H 2455 3027 50  0001 C CNN
F 2 "" H 2450 3200 50  0001 C CNN
F 3 "" H 2450 3200 50  0001 C CNN
	1    2450 3200
	1    0    0    -1  
$EndComp
Wire Wire Line
	2450 3150 2450 3200
Connection ~ 2450 3150
Wire Wire Line
	2450 3150 2550 3150
$Comp
L Device:C C?
U 1 1 5F922935
P 2350 2950
AR Path="/5F922935" Ref="C?"  Part="1" 
AR Path="/559EC5B3/5F922935" Ref="C?"  Part="1" 
AR Path="/5F6294E6/5F922935" Ref="C301"  Part="1" 
F 0 "C301" H 2350 3050 40  0000 L CNN
F 1 "10nF" H 2356 2865 40  0000 L CNN
F 2 "Capacitors_SMD:C_0603" H 2388 2800 30  0001 C CNN
F 3 "~" H 2350 2950 60  0000 C CNN
	1    2350 2950
	-1   0    0    -1  
$EndComp
Wire Wire Line
	2750 2750 2700 2750
Wire Wire Line
	3200 2750 3150 2750
Wire Wire Line
	6350 3650 6350 3600
Wire Wire Line
	5850 4100 6450 4100
Wire Wire Line
	6350 3600 6450 3600
Wire Wire Line
	6450 3650 6450 3600
Wire Wire Line
	6350 4050 6350 4200
Connection ~ 6350 4200
Wire Wire Line
	6450 4050 6450 4100
Connection ~ 6450 4100
Wire Wire Line
	6450 4100 6500 4100
Wire Wire Line
	6350 4300 6750 4300
Wire Wire Line
	6900 4100 7250 4100
Wire Wire Line
	7150 4300 7250 4300
Wire Wire Line
	6700 3800 6700 3700
Wire Wire Line
	6700 3700 6950 3700
Wire Wire Line
	6950 3700 6950 4000
Wire Wire Line
	5850 3400 5950 3400
Wire Wire Line
	5950 3400 5950 3300
Wire Wire Line
	5950 3300 6600 3300
Wire Wire Line
	5850 3300 5900 3300
Wire Wire Line
	5900 3300 5900 3200
Wire Wire Line
	6050 3700 5850 3700
Wire Wire Line
	5850 3800 6100 3800
Wire Wire Line
	6100 3800 6100 3600
Wire Wire Line
	6100 3600 6200 3600
Wire Wire Line
	6050 3500 7250 3500
Wire Wire Line
	5850 3500 6000 3500
Wire Wire Line
	6000 3500 6000 3400
Wire Wire Line
	6050 3500 6050 3700
Text HLabel 7250 3700 2    50   Input ~ 0
I2C_EN
Wire Wire Line
	7250 3700 6950 3700
Connection ~ 6950 3700
Wire Wire Line
	6200 3600 6350 3600
Connection ~ 6200 3600
Connection ~ 6350 3600
Connection ~ 6450 3600
Wire Notes Line
	7150 3100 7850 3100
Wire Notes Line
	7850 3100 7850 3850
Wire Notes Line
	7850 3850 7150 3850
Wire Notes Line
	7150 3850 7150 3100
Text Notes 7250 3850 0    50   ~ 0
1.8V Domain
Wire Notes Line
	7150 3900 7850 3900
Wire Notes Line
	7850 3900 7850 4400
Wire Notes Line
	7850 4400 7150 4400
Wire Notes Line
	7150 4400 7150 3900
Text Notes 7250 4000 0    50   ~ 0
I2C 1.8-6V
Wire Wire Line
	6000 3400 6600 3400
Wire Wire Line
	6000 4600 6300 4600
Wire Wire Line
	6000 5000 6300 5000
$Comp
L Device:R_Pack02 RN?
U 1 1 5F809914
P 6450 3850
AR Path="/5F809914" Ref="RN?"  Part="1" 
AR Path="/5F6294E6/5F809914" Ref="RN301"  Part="1" 
F 0 "RN301" H 6500 3900 50  0000 L CNN
F 1 "3.3k" H 6500 3800 50  0000 L CNN
F 2 "Resistors_SMD:R_Array_Convex_2x0402" V 6625 3850 50  0001 C CNN
F 3 "~" H 6450 3850 50  0001 C CNN
	1    6450 3850
	1    0    0    -1  
$EndComp
Wire Wire Line
	6450 3600 7250 3600
$Comp
L Device:R R303
U 1 1 5F8E2150
P 6750 3200
AR Path="/5F6294E6/5F8E2150" Ref="R303"  Part="1" 
AR Path="/5F622C8F/5F8E2150" Ref="R?"  Part="1" 
F 0 "R303" V 6700 3050 40  0000 R CNN
F 1 "22" V 6750 3200 40  0000 C CNN
F 2 "Resistors_SMD:R_0402_NoSilk" V 6680 3200 30  0001 C CNN
F 3 "~" H 6750 3200 30  0000 C CNN
	1    6750 3200
	0    1    1    0   
$EndComp
$Comp
L Device:R R304
U 1 1 5F8E8030
P 6750 3300
AR Path="/5F6294E6/5F8E8030" Ref="R304"  Part="1" 
AR Path="/5F622C8F/5F8E8030" Ref="R?"  Part="1" 
F 0 "R304" V 6700 3150 40  0000 R CNN
F 1 "22" V 6750 3300 40  0000 C CNN
F 2 "Resistors_SMD:R_0402_NoSilk" V 6680 3300 30  0001 C CNN
F 3 "~" H 6750 3300 30  0000 C CNN
	1    6750 3300
	0    1    1    0   
$EndComp
Wire Wire Line
	6900 3300 7250 3300
$Comp
L Device:R R305
U 1 1 5F8E807A
P 6750 3400
AR Path="/5F6294E6/5F8E807A" Ref="R305"  Part="1" 
AR Path="/5F622C8F/5F8E807A" Ref="R?"  Part="1" 
F 0 "R305" V 6700 3250 40  0000 R CNN
F 1 "22" V 6750 3400 40  0000 C CNN
F 2 "Resistors_SMD:R_0402_NoSilk" V 6680 3400 30  0001 C CNN
F 3 "~" H 6750 3400 30  0000 C CNN
	1    6750 3400
	0    1    1    0   
$EndComp
Wire Wire Line
	6900 3400 7250 3400
Wire Wire Line
	7250 3200 6900 3200
Wire Wire Line
	6600 3200 5900 3200
$Comp
L ProjectSymbols:Q_DUAL_NMOS_S1G1D2S2G2D1 Q301
U 1 1 5F8236A2
P 6700 4000
F 0 "Q301" V 6950 4000 50  0000 C CNN
F 1 "EM6K34" V 7050 3950 50  0000 C CNN
F 2 "ProjectFootprints:SOT-563" H 6900 4000 50  0001 C CNN
F 3 "~" H 6900 4000 50  0001 C CNN
F 4 "EM6K34" H 6700 4000 50  0001 C CNN "MPN"
F 5 "Rohm" H 0   0   50  0001 C CNN "Manufacturer"
	1    6700 4000
	0    1    1    0   
$EndComp
$Comp
L ProjectSymbols:Q_DUAL_NMOS_S1G1D2S2G2D1 Q301
U 2 1 5F8238E8
P 6950 4200
F 0 "Q301" V 7200 4200 50  0000 C CNN
F 1 "EM6K34" V 7291 4200 50  0001 C CNN
F 2 "ProjectFootprints:SOT-563" H 7150 4200 50  0001 C CNN
F 3 "~" H 7150 4200 50  0001 C CNN
F 4 "EM6K34" H 0   0   50  0001 C CNN "MPN"
F 5 "Rohm" H 0   0   50  0001 C CNN "Manufacturer"
	2    6950 4200
	0    1    1    0   
$EndComp
Text Label 2450 2750 0    10   ~ 0
ANT_SHIELD
$Comp
L Device:C C?
U 1 1 5F852AD9
P 7550 2700
AR Path="/5F852AD9" Ref="C?"  Part="1" 
AR Path="/55AE8620/5F852AD9" Ref="C?"  Part="1" 
AR Path="/5F622C8F/5F852AD9" Ref="C?"  Part="1" 
AR Path="/5F6294E6/5F852AD9" Ref="C310"  Part="1" 
F 0 "C310" H 7550 2800 40  0000 L CNN
F 1 "100nF" H 7556 2615 40  0000 L CNN
F 2 "Capacitors_SMD:C_0603" H 7588 2550 30  0001 C CNN
F 3 "~" H 7550 2700 60  0000 C CNN
	1    7550 2700
	1    0    0    -1  
$EndComp
Wire Wire Line
	7550 2500 7550 2550
Connection ~ 7550 2500
Wire Wire Line
	7550 2500 7600 2500
$Comp
L power:GND #PWR0312
U 1 1 5F86513A
P 7550 2900
F 0 "#PWR0312" H 7550 2650 50  0001 C CNN
F 1 "GND" H 7555 2727 50  0001 C CNN
F 2 "" H 7550 2900 50  0001 C CNN
F 3 "" H 7550 2900 50  0001 C CNN
	1    7550 2900
	1    0    0    -1  
$EndComp
Wire Wire Line
	7550 2850 7550 2900
Wire Wire Line
	2700 2750 2700 2850
Wire Wire Line
	2700 2850 3200 2850
Wire Wire Line
	3200 2850 3200 2750
Connection ~ 2700 2850
Wire Wire Line
	2700 2850 2700 2900
Text Label 5850 5000 0    10   ~ 0
DBYP
Text Label 4100 4000 0    10   ~ 0
ABYP
Wire Wire Line
	4100 3400 4150 3400
Wire Wire Line
	3900 3100 3900 2950
Wire Wire Line
	3700 3100 3700 2950
Wire Wire Line
	6100 2800 6150 2800
Text Label 2650 2500 0    10   ~ 0
ANT
$EndSCHEMATC
