EESchema Schematic File Version 4
LIBS:dabradio-cache
EELAYER 26 0
EELAYER END
$Descr A4 11693 8268
encoding utf-8
Sheet 1 3
Title "Si4688 based DAB/FM Radio"
Date "2019-03-26"
Rev "2"
Comp "Copyright (c) 2019 Andreas Messer"
Comment1 ""
Comment2 ""
Comment3 ""
Comment4 ""
$EndDescr
$Comp
L dabradio:ATSAM4S8B U101
U 1 1 55AE85FB
P 3250 3050
F 0 "U101" H 4050 1000 60  0000 C CNN
F 1 "ATSAM4S8B" H 3850 1100 60  0000 C CNN
F 2 "Housings_QFP:TQFP-64-1EP_10x10mm_Pitch0.5mm" H 2850 2900 60  0001 C CNN
F 3 "~" H 2850 2900 60  0000 C CNN
	1    3250 3050
	1    0    0    -1  
$EndComp
$Comp
L Device:C C102
U 1 1 55AE85FC
P 1000 1950
F 0 "C102" H 1000 2050 40  0000 L CNN
F 1 "4u7" H 1006 1865 40  0000 L CNN
F 2 "Capacitors_SMD:C_0805_HandSoldering" H 1038 1800 30  0001 C CNN
F 3 "~" H 1000 1950 60  0000 C CNN
	1    1000 1950
	1    0    0    -1  
$EndComp
$Comp
L Device:C C111
U 1 1 55AE85FD
P 1800 1200
F 0 "C111" H 1800 1300 40  0000 L CNN
F 1 "100n" H 1806 1115 40  0000 L CNN
F 2 "Capacitors_SMD:C_0603_HandSoldering" H 1838 1050 30  0001 C CNN
F 3 "~" H 1800 1200 60  0000 C CNN
	1    1800 1200
	0    1    1    0   
$EndComp
$Comp
L Device:C C112
U 1 1 55AE85FE
P 1800 1450
F 0 "C112" H 1800 1550 40  0000 L CNN
F 1 "100n" H 1806 1365 40  0000 L CNN
F 2 "Capacitors_SMD:C_0603_HandSoldering" H 1838 1300 30  0001 C CNN
F 3 "~" H 1800 1450 60  0000 C CNN
	1    1800 1450
	0    -1   -1   0   
$EndComp
$Comp
L Device:C C105
U 1 1 55AE85FF
P 1200 1950
F 0 "C105" H 1200 2050 40  0000 L CNN
F 1 "100n" H 1206 1865 40  0000 L CNN
F 2 "Capacitors_SMD:C_0603_HandSoldering" H 1238 1800 30  0001 C CNN
F 3 "~" H 1200 1950 60  0000 C CNN
	1    1200 1950
	-1   0    0    1   
$EndComp
$Comp
L Device:C C115
U 1 1 55AE8600
P 1800 2450
F 0 "C115" H 1800 2550 40  0000 L CNN
F 1 "100n" H 1806 2365 40  0000 L CNN
F 2 "Capacitors_SMD:C_0603_HandSoldering" H 1838 2300 30  0001 C CNN
F 3 "~" H 1800 2450 60  0000 C CNN
	1    1800 2450
	0    -1   -1   0   
$EndComp
$Comp
L Device:C C103
U 1 1 55AE8601
P 1150 2650
F 0 "C103" H 1150 2750 40  0000 L CNN
F 1 "100n" H 1156 2565 40  0000 L CNN
F 2 "Capacitors_SMD:C_0603_HandSoldering" H 1188 2500 30  0001 C CNN
F 3 "~" H 1150 2650 60  0000 C CNN
	1    1150 2650
	0    -1   -1   0   
$EndComp
$Comp
L Device:C C104
U 1 1 55AE8602
P 1150 2850
F 0 "C104" H 1150 2950 40  0000 L CNN
F 1 "4u7" H 1156 2765 40  0000 L CNN
F 2 "Capacitors_SMD:C_0805_HandSoldering" H 1188 2700 30  0001 C CNN
F 3 "~" H 1150 2850 60  0000 C CNN
	1    1150 2850
	0    -1   -1   0   
$EndComp
$Comp
L Device:R R101
U 1 1 55AE8603
P 1500 2850
F 0 "R101" V 1580 2850 40  0000 C CNN
F 1 "1" V 1507 2851 40  0000 C CNN
F 2 "Resistors_SMD:R_0603_HandSoldering" V 1430 2850 30  0001 C CNN
F 3 "~" H 1500 2850 30  0000 C CNN
	1    1500 2850
	0    1    1    0   
$EndComp
$Comp
L Device:L L101
U 1 1 55AE8604
P 1400 2200
F 0 "L101" H 1400 2300 50  0000 C CNN
F 1 "10u" H 1400 2150 50  0000 C CNN
F 2 "Resistors_SMD:R_0805" H 1400 2200 60  0001 C CNN
F 3 "~" H 1400 2200 60  0000 C CNN
	1    1400 2200
	1    0    0    -1  
$EndComp
Wire Wire Line
	1350 2850 1300 2850
$Comp
L power:GND #PWR01
U 1 1 55AE8605
P 950 2900
F 0 "#PWR01" H 950 2900 30  0001 C CNN
F 1 "GND" H 950 2830 30  0001 C CNN
F 2 "" H 950 2900 60  0001 C CNN
F 3 "" H 950 2900 60  0000 C CNN
	1    950  2900
	1    0    0    -1  
$EndComp
Wire Wire Line
	1000 2850 950  2850
$Comp
L power:GND #PWR02
U 1 1 55AE8606
P 1600 2500
F 0 "#PWR02" H 1600 2500 30  0001 C CNN
F 1 "GND" H 1600 2430 30  0001 C CNN
F 2 "" H 1600 2500 60  0001 C CNN
F 3 "" H 1600 2500 60  0000 C CNN
	1    1600 2500
	1    0    0    -1  
$EndComp
Wire Wire Line
	1950 2450 2000 2450
Connection ~ 2000 2050
Connection ~ 2000 2450
Wire Wire Line
	1950 2250 2000 2250
Connection ~ 2000 2250
Wire Wire Line
	1950 2050 2000 2050
$Comp
L Device:C C114
U 1 1 55AE8607
P 1800 2250
F 0 "C114" H 1800 2350 40  0000 L CNN
F 1 "100n" H 1806 2165 40  0000 L CNN
F 2 "Capacitors_SMD:C_0603_HandSoldering" H 1838 2100 30  0001 C CNN
F 3 "~" H 1800 2250 60  0000 C CNN
	1    1800 2250
	0    -1   -1   0   
$EndComp
$Comp
L Device:C C113
U 1 1 55AE8608
P 1800 2050
F 0 "C113" H 1800 2150 40  0000 L CNN
F 1 "100n" H 1806 1965 40  0000 L CNN
F 2 "Capacitors_SMD:C_0603_HandSoldering" H 1838 1900 30  0001 C CNN
F 3 "~" H 1800 2050 60  0000 C CNN
	1    1800 2050
	0    -1   -1   0   
$EndComp
Wire Wire Line
	1600 2450 1650 2450
Wire Wire Line
	1600 2250 1650 2250
Connection ~ 1600 2450
Wire Wire Line
	1600 2050 1650 2050
Connection ~ 1600 2250
Wire Wire Line
	1000 1750 1200 1750
Connection ~ 2000 1750
Wire Wire Line
	1600 2050 1600 2250
Wire Wire Line
	1200 1750 1200 1800
Wire Wire Line
	2000 1750 2000 2050
Wire Wire Line
	1000 1750 1000 1800
Connection ~ 1200 1750
$Comp
L power:GND #PWR03
U 1 1 55AE8609
P 1100 2200
F 0 "#PWR03" H 1100 2200 30  0001 C CNN
F 1 "GND" H 1100 2130 30  0001 C CNN
F 2 "" H 1100 2200 60  0001 C CNN
F 3 "" H 1100 2200 60  0000 C CNN
	1    1100 2200
	1    0    0    -1  
$EndComp
Wire Wire Line
	1000 2100 1000 2150
Wire Wire Line
	1000 2150 1100 2150
Wire Wire Line
	1200 2150 1200 2100
Wire Wire Line
	1100 2150 1100 2200
Connection ~ 1100 2150
Wire Wire Line
	1300 2650 1400 2650
Wire Wire Line
	1650 2850 1700 2850
Wire Wire Line
	1700 2850 1700 2650
Connection ~ 1700 2650
Wire Wire Line
	1400 2050 1400 1750
Connection ~ 1400 1750
Wire Wire Line
	1400 2350 1400 2650
Connection ~ 1400 2650
Wire Wire Line
	950  2650 950  2850
Wire Wire Line
	950  2650 1000 2650
Connection ~ 950  2850
$Comp
L Device:C C110
U 1 1 55AE860A
P 1800 1000
F 0 "C110" H 1800 1100 40  0000 L CNN
F 1 "100n" H 1806 915 40  0000 L CNN
F 2 "Capacitors_SMD:C_0603_HandSoldering" H 1838 850 30  0001 C CNN
F 3 "~" H 1800 1000 60  0000 C CNN
	1    1800 1000
	0    1    1    0   
$EndComp
$Comp
L Device:C C109
U 1 1 55AE860B
P 1800 800
F 0 "C109" H 1800 900 40  0000 L CNN
F 1 "100n" H 1806 715 40  0000 L CNN
F 2 "Capacitors_SMD:C_0603_HandSoldering" H 1838 650 30  0001 C CNN
F 3 "~" H 1800 800 60  0000 C CNN
	1    1800 800 
	0    1    1    0   
$EndComp
Wire Wire Line
	1650 800  1600 800 
Wire Wire Line
	1600 800  1600 1000
Wire Wire Line
	1600 1450 1650 1450
$Comp
L power:GND #PWR04
U 1 1 55AE860C
P 1600 1500
F 0 "#PWR04" H 1600 1500 30  0001 C CNN
F 1 "GND" H 1600 1430 30  0001 C CNN
F 2 "" H 1600 1500 60  0001 C CNN
F 3 "" H 1600 1500 60  0000 C CNN
	1    1600 1500
	1    0    0    -1  
$EndComp
Connection ~ 1600 1450
Wire Wire Line
	1650 1000 1600 1000
Connection ~ 1600 1000
Wire Wire Line
	1650 1200 1600 1200
Connection ~ 1600 1200
Wire Wire Line
	1950 1450 2000 1450
Wire Wire Line
	1950 1200 2000 1200
Wire Wire Line
	1950 1000 2000 1000
Wire Wire Line
	2000 650  2000 800 
Connection ~ 2000 1200
Connection ~ 2000 1000
Connection ~ 2000 1450
Wire Wire Line
	1950 800  2000 800 
Connection ~ 2000 800 
Wire Wire Line
	1450 650  1450 700 
Wire Wire Line
	1100 650  1450 650 
$Comp
L power:GND #PWR05
U 1 1 55AE860D
P 1450 1050
F 0 "#PWR05" H 1450 1050 30  0001 C CNN
F 1 "GND" H 1450 980 30  0001 C CNN
F 2 "" H 1450 1050 60  0001 C CNN
F 3 "" H 1450 1050 60  0000 C CNN
	1    1450 1050
	1    0    0    -1  
$EndComp
Wire Wire Line
	1450 1000 1450 1050
$Comp
L Device:C C107
U 1 1 55AE860E
P 1450 850
F 0 "C107" H 1450 950 40  0000 L CNN
F 1 "10u" H 1456 765 40  0000 L CNN
F 2 "Capacitors_SMD:C_0805_HandSoldering" H 1488 700 30  0001 C CNN
F 3 "~" H 1450 850 60  0000 C CNN
	1    1450 850 
	-1   0    0    1   
$EndComp
Connection ~ 1450 650 
$Comp
L power:GND #PWR06
U 1 1 55AE8611
P 3250 5550
F 0 "#PWR06" H 3250 5550 30  0001 C CNN
F 1 "GND" H 3250 5480 30  0001 C CNN
F 2 "" H 3250 5550 60  0001 C CNN
F 3 "" H 3250 5550 60  0000 C CNN
	1    3250 5550
	1    0    0    -1  
$EndComp
Wire Wire Line
	3050 5450 3050 5500
Wire Wire Line
	3050 5500 3150 5500
Wire Wire Line
	3450 5500 3450 5450
Wire Wire Line
	3150 5450 3150 5500
Connection ~ 3150 5500
Wire Wire Line
	3250 5450 3250 5500
Connection ~ 3250 5500
Wire Wire Line
	3350 5450 3350 5500
Connection ~ 3350 5500
$Comp
L Device:Crystal X101
U 1 1 55AE8612
P 1150 4200
F 0 "X101" H 1150 4350 60  0000 C CNN
F 1 "12.000 MHz" H 1150 4050 60  0000 C CNN
F 2 "" H 1150 4200 60  0001 C CNN
F 3 "~" H 1150 4200 60  0000 C CNN
	1    1150 4200
	1    0    0    -1  
$EndComp
$Comp
L Device:C C101
U 1 1 55AE8613
P 950 4400
F 0 "C101" H 950 4500 40  0000 L CNN
F 1 "10p" H 956 4315 40  0000 L CNN
F 2 "Capacitors_SMD:C_0603_HandSoldering" H 988 4250 30  0001 C CNN
F 3 "~" H 950 4400 60  0000 C CNN
	1    950  4400
	-1   0    0    1   
$EndComp
$Comp
L Device:C C108
U 1 1 55AE8614
P 1350 4400
F 0 "C108" H 1350 4500 40  0000 L CNN
F 1 "10p" H 1356 4315 40  0000 L CNN
F 2 "Capacitors_SMD:C_0603_HandSoldering" H 1388 4250 30  0001 C CNN
F 3 "~" H 1350 4400 60  0000 C CNN
	1    1350 4400
	-1   0    0    1   
$EndComp
Wire Wire Line
	2050 4150 1350 4150
Wire Wire Line
	1350 4150 1350 4200
Wire Wire Line
	2050 4050 950  4050
Wire Wire Line
	950  4050 950  4200
Wire Wire Line
	1000 4200 950  4200
Connection ~ 950  4200
Wire Wire Line
	1300 4200 1350 4200
Connection ~ 1350 4200
$Comp
L power:GND #PWR07
U 1 1 55AE8615
P 950 4600
F 0 "#PWR07" H 950 4600 30  0001 C CNN
F 1 "GND" H 950 4530 30  0001 C CNN
F 2 "" H 950 4600 60  0001 C CNN
F 3 "" H 950 4600 60  0000 C CNN
	1    950  4600
	1    0    0    -1  
$EndComp
$Comp
L power:GND #PWR08
U 1 1 55AE8616
P 1350 4600
F 0 "#PWR08" H 1350 4600 30  0001 C CNN
F 1 "GND" H 1350 4530 30  0001 C CNN
F 2 "" H 1350 4600 60  0001 C CNN
F 3 "" H 1350 4600 60  0000 C CNN
	1    1350 4600
	1    0    0    -1  
$EndComp
Wire Wire Line
	1350 4550 1350 4600
Wire Wire Line
	950  4550 950  4600
$Comp
L Device:R R104
U 1 1 55AE8617
P 1800 4850
F 0 "R104" V 1880 4850 40  0000 C CNN
F 1 "100k" V 1807 4851 40  0000 C CNN
F 2 "Resistors_SMD:R_0603_HandSoldering" V 1730 4850 30  0001 C CNN
F 3 "~" H 1800 4850 30  0000 C CNN
	1    1800 4850
	0    1    1    0   
$EndComp
Wire Wire Line
	1600 4850 1650 4850
Text Label 1100 650  0    60   ~ 0
+3.3V
Wire Wire Line
	1950 4850 2000 4850
Text Label 1750 4750 2    60   ~ 0
RESET
Wire Wire Line
	2000 4850 2000 4750
Wire Wire Line
	2000 4750 1750 4750
Connection ~ 2000 4850
Text Label 1750 3650 2    60   ~ 0
TDI
Text Label 1750 3750 2    60   ~ 0
TDO
Text Label 1750 3850 2    60   ~ 0
TMS
Text Label 1750 3950 2    60   ~ 0
TCK
Wire Wire Line
	2050 3650 1750 3650
Wire Wire Line
	1750 3750 2050 3750
Wire Wire Line
	2050 3850 1750 3850
Wire Wire Line
	1750 3950 2050 3950
$Comp
L Connector_Generic:Conn_02x05_Odd_Even P102
U 1 1 55AE8618
P 1500 6550
F 0 "P102" H 1500 6850 60  0000 C CNN
F 1 "CONN_5X2" V 1500 6550 50  0000 C CNN
F 2 "Socket_Strips:Socket_Strip_Straight_2x05_Pitch2.54mm" H 1500 6550 60  0001 C CNN
F 3 "" H 1500 6550 60  0000 C CNN
	1    1500 6550
	1    0    0    -1  
$EndComp
$Comp
L power:GND #PWR09
U 1 1 55AE8619
P 900 6750
F 0 "#PWR09" H 900 6750 30  0001 C CNN
F 1 "GND" H 900 6680 30  0001 C CNN
F 2 "" H 900 6750 60  0001 C CNN
F 3 "" H 900 6750 60  0000 C CNN
	1    900  6750
	1    0    0    -1  
$EndComp
Wire Wire Line
	1200 6750 1250 6750
Wire Wire Line
	1300 6650 900  6650
Wire Wire Line
	900  6650 900  6750
Text Label 1200 6350 2    60   ~ 0
RESET
Text Label 1200 6450 2    60   ~ 0
TCK
Text Label 1200 6550 2    60   ~ 0
TMS
Wire Wire Line
	1200 6350 1300 6350
Wire Wire Line
	1300 6450 1200 6450
Wire Wire Line
	1200 6550 1300 6550
Text Label 1900 6350 0    60   ~ 0
TDO
Wire Wire Line
	1900 6350 1800 6350
Text Label 1900 6550 0    60   ~ 0
TDI
Wire Wire Line
	1900 6550 1800 6550
$Comp
L Device:R R102
U 1 1 55AE861A
P 1550 6900
F 0 "R102" V 1630 6900 40  0000 C CNN
F 1 "100k" V 1557 6901 40  0000 C CNN
F 2 "Resistors_SMD:R_0603_HandSoldering" V 1480 6900 30  0001 C CNN
F 3 "~" H 1550 6900 30  0000 C CNN
	1    1550 6900
	0    1    1    0   
$EndComp
Wire Wire Line
	1250 6750 1250 6900
Wire Wire Line
	1250 6900 1400 6900
Connection ~ 1250 6750
Wire Wire Line
	1700 6900 2100 6900
Wire Wire Line
	2100 6900 2100 6450
Wire Wire Line
	2100 6450 1800 6450
NoConn ~ 2050 4950
$Sheet
S 7400 650  1100 950 
U 559EC5B3
F0 "Dab-Receiver" 50
F1 "si4688.sch" 50
F2 "ANT" I R 8500 750 60 
F3 "GND" I R 8500 1100 60 
F4 "+3.3V" I R 8500 900 60 
F5 "+1.8V" I R 8500 1000 60 
F6 "I2S_OUT" O R 8500 1500 60 
F7 "RESET" I L 7400 750 60 
F8 "#SPI/I2C" I L 7400 900 60 
F9 "SCLK/SCL" I L 7400 1100 60 
F10 "SI/SDA" I L 7400 1200 60 
F11 "SO/A0" O L 7400 1400 60 
F12 "CS/A1" I L 7400 1500 60 
F13 "IRQ" O L 7400 1000 60 
F14 "I2S_CLK" I R 8500 1400 60 
F15 "I2S_WS" I R 8500 1300 60 
$EndSheet
$Comp
L Regulator_Linear:TPS79318-EP U104
U 1 1 55AE82F0
P 9850 1000
F 0 "U104" H 9600 1300 40  0000 C CNN
F 1 "TPS79318DBVR" H 10000 1300 40  0000 C CNN
F 2 "TO_SOT_Packages_SMD:SOT-23-5" H 9850 1150 30  0001 C CIN
F 3 "" H 9850 1000 60  0000 C CNN
	1    9850 1000
	1    0    0    -1  
$EndComp
$Comp
L Device:C C133
U 1 1 55AE82FC
P 9500 1200
F 0 "C133" H 9500 1300 40  0000 L CNN
F 1 "1u" H 9506 1115 40  0000 L CNN
F 2 "Capacitors_SMD:C_0603_HandSoldering" H 9538 1050 30  0001 C CNN
F 3 "~" H 9500 1200 60  0000 C CNN
	1    9500 1200
	-1   0    0    1   
$EndComp
Wire Wire Line
	10150 1000 10200 1000
Wire Wire Line
	9850 1700 9850 1300
Wire Wire Line
	9500 1700 9500 1350
Wire Wire Line
	8500 900  8950 900 
Connection ~ 9500 1000
$Comp
L Device:C C135
U 1 1 55AE830F
P 10200 1200
F 0 "C135" H 10200 1300 40  0000 L CNN
F 1 "10u" H 10206 1115 40  0000 L CNN
F 2 "Capacitors_SMD:C_0805_HandSoldering" H 10238 1050 30  0001 C CNN
F 3 "~" H 10200 1200 60  0000 C CNN
	1    10200 1200
	-1   0    0    1   
$EndComp
$Comp
L Device:C C137
U 1 1 55AE831B
P 10500 1200
F 0 "C137" H 10500 1300 40  0000 L CNN
F 1 "10u" H 10506 1115 40  0000 L CNN
F 2 "Capacitors_SMD:C_0805_HandSoldering" H 10538 1050 30  0001 C CNN
F 3 "~" H 10500 1200 60  0000 C CNN
	1    10500 1200
	-1   0    0    1   
$EndComp
Wire Wire Line
	10500 1700 10500 1350
Wire Wire Line
	10200 1700 10200 1350
Wire Wire Line
	10200 1000 10200 1050
Wire Wire Line
	10500 650  10500 900 
Wire Wire Line
	9500 900  9500 1000
Connection ~ 10500 900 
NoConn ~ 8500 2600
Wire Wire Line
	8950 2000 8500 2000
Wire Wire Line
	8950 550  8950 900 
Wire Wire Line
	7400 900  7300 900 
Wire Wire Line
	7300 900  7300 550 
Wire Wire Line
	6350 550  6450 550 
Connection ~ 8950 900 
Wire Wire Line
	8500 1100 8850 1100
Wire Wire Line
	8500 2200 8850 2200
Wire Wire Line
	7400 1400 7350 1400
Wire Wire Line
	7350 1400 7350 1500
Wire Wire Line
	7400 1500 7350 1500
Connection ~ 7350 1500
Wire Wire Line
	10150 900  10500 900 
Wire Wire Line
	8500 1000 8900 1000
Wire Wire Line
	8900 2100 8500 2100
Connection ~ 8900 1000
Connection ~ 9500 900 
Connection ~ 9500 1700
Connection ~ 9850 1700
Connection ~ 10200 1700
Wire Wire Line
	10500 650  8900 650 
Wire Wire Line
	8900 650  8900 1000
Wire Wire Line
	9550 1000 9500 1000
Wire Wire Line
	8850 1100 8850 1700
Connection ~ 8850 1700
Wire Wire Line
	8550 2400 8500 2400
Wire Wire Line
	8550 1300 8550 2400
Wire Wire Line
	8550 1300 8500 1300
Wire Wire Line
	8600 2500 8500 2500
Wire Wire Line
	8600 1400 8500 1400
Wire Wire Line
	8600 1400 8600 2500
Wire Wire Line
	8500 2700 8650 2700
Wire Wire Line
	8650 2700 8650 1500
Wire Wire Line
	8650 1500 8500 1500
$Comp
L Connector_Generic:Conn_01x04 P108
U 1 1 55B23110
P 9550 3000
F 0 "P108" V 9500 3000 50  0000 C CNN
F 1 "CONN_4" V 9600 3000 50  0000 C CNN
F 2 "Socket_Strips:Socket_Strip_Straight_1x04_Pitch2.54mm" H 9550 3000 60  0001 C CNN
F 3 "" H 9550 3000 60  0000 C CNN
	1    9550 3000
	1    0    0    -1  
$EndComp
$Comp
L Connector_Generic:Conn_01x03 K101
U 1 1 55B2311F
P 9550 3500
F 0 "K101" V 9500 3500 50  0000 C CNN
F 1 "CONN_3" V 9600 3500 40  0000 C CNN
F 2 "Pin_Headers:Pin_Header_Straight_1x03_Pitch2.54mm" H 9550 3500 60  0001 C CNN
F 3 "" H 9550 3500 60  0000 C CNN
	1    9550 3500
	1    0    0    -1  
$EndComp
Wire Wire Line
	8500 2900 9350 2900
Wire Wire Line
	9350 3000 8500 3000
Wire Wire Line
	8500 3100 9350 3100
Wire Wire Line
	9350 3200 8500 3200
Wire Wire Line
	8500 3400 9350 3400
Wire Wire Line
	9350 3500 8500 3500
Wire Wire Line
	8850 3600 9350 3600
Connection ~ 8850 2200
Wire Wire Line
	8500 750  9200 750 
$Comp
L Connector_Generic:Conn_01x02 P107
U 1 1 55B23E32
P 9700 2100
F 0 "P107" V 9650 2100 40  0000 C CNN
F 1 "CONN_2" V 9750 2100 40  0000 C CNN
F 2 "Connectors_Molex:Molex_SMA_Jack_Edge_Mount" H 9700 2100 60  0001 C CNN
F 3 "" H 9700 2100 60  0000 C CNN
	1    9700 2100
	1    0    0    -1  
$EndComp
$Comp
L Device:C C131
U 1 1 55B244E4
P 9050 2200
F 0 "C131" H 9050 2300 40  0000 L CNN
F 1 "100n" H 9056 2115 40  0000 L CNN
F 2 "Capacitors_SMD:C_0603_HandSoldering" H 9088 2050 30  0001 C CNN
F 3 "~" H 9050 2200 60  0000 C CNN
	1    9050 2200
	0    1    1    0   
$EndComp
Wire Wire Line
	9200 2200 9250 2200
Wire Wire Line
	9200 750  9200 2100
Wire Wire Line
	9200 2100 9500 2100
Connection ~ 7350 1700
Connection ~ 7300 550 
Wire Wire Line
	6550 750  6650 750 
Wire Wire Line
	6700 1000 7400 1000
$Comp
L Connector_Generic:Conn_01x11 P105
U 1 1 55B27606
P 6400 2100
F 0 "P105" V 6500 2100 60  0000 C CNN
F 1 "CONN_11" V 6600 2100 60  0001 C CNN
F 2 "Socket_Strips:Socket_Strip_Straight_1x11_Pitch2.54mm" H 6400 2100 60  0001 C CNN
F 3 "" H 6400 2100 60  0000 C CNN
	1    6400 2100
	-1   0    0    1   
$EndComp
Wire Wire Line
	7400 2400 7150 2400
Wire Wire Line
	7100 2500 7400 2500
Wire Wire Line
	7400 2600 7050 2600
Wire Wire Line
	7050 2500 6600 2500
Wire Wire Line
	6600 2600 7000 2600
Wire Wire Line
	7000 2700 7400 2700
Wire Wire Line
	7100 2400 6600 2400
Wire Wire Line
	6600 2300 7150 2300
Wire Wire Line
	6950 1700 7350 1700
Wire Wire Line
	7200 1800 6600 1800
Wire Wire Line
	7150 1900 6600 1900
Wire Wire Line
	6900 2000 6900 550 
Wire Wire Line
	6650 1600 6600 1600
Wire Wire Line
	6650 750  6650 1600
Wire Wire Line
	6600 1700 6700 1700
Wire Wire Line
	6700 1700 6700 1000
Wire Wire Line
	7200 2100 7400 2100
Wire Wire Line
	7200 1100 7200 1400
Wire Wire Line
	7200 1100 7400 1100
Connection ~ 7200 1800
Wire Wire Line
	7150 1200 7150 1350
Wire Wire Line
	7150 2200 7400 2200
Connection ~ 7150 1900
Wire Wire Line
	7000 2600 7000 2700
Wire Wire Line
	7050 2600 7050 2500
Wire Wire Line
	7150 2300 7150 2400
Wire Wire Line
	7100 2500 7100 2400
Text Label 1200 6750 2    60   ~ 0
+3.3V
Text Label 1600 4850 2    60   ~ 0
+3.3V
Text Label 5600 2000 2    60   ~ 0
+3.3V
$Comp
L Connector_Generic:Conn_01x11 P103
U 1 1 55B2C563
P 5850 2100
F 0 "P103" V 5950 2100 60  0000 C CNN
F 1 "CONN_11" V 6050 2100 60  0001 C CNN
F 2 "Socket_Strips:Socket_Strip_Straight_1x11_Pitch2.54mm" H 5850 2100 60  0001 C CNN
F 3 "" H 5850 2100 60  0000 C CNN
	1    5850 2100
	1    0    0    1   
$EndComp
$Comp
L power:GND #PWR010
U 1 1 55B2C807
P 5150 2150
F 0 "#PWR010" H 5150 2150 30  0001 C CNN
F 1 "GND" H 5150 2080 30  0001 C CNN
F 2 "" H 5150 2150 60  0001 C CNN
F 3 "" H 5150 2150 60  0000 C CNN
	1    5150 2150
	1    0    0    -1  
$EndComp
Wire Wire Line
	5650 2100 5150 2100
Wire Wire Line
	5150 2100 5150 2150
Text Label 5600 1800 2    60   ~ 0
SCL
Wire Wire Line
	5600 1800 5650 1800
Text Label 5600 1900 2    60   ~ 0
SDA
Wire Wire Line
	5600 1900 5650 1900
Text Label 5600 2300 2    60   ~ 0
I2S_CLK
Text Label 5600 2600 2    60   ~ 0
I2S_WS
Text Label 5600 2400 2    60   ~ 0
I2S_IN
Text Label 5600 2500 2    60   ~ 0
I2S_OUT
Wire Wire Line
	5600 2300 5650 2300
Wire Wire Line
	5650 2400 5600 2400
Wire Wire Line
	5600 2500 5650 2500
Wire Wire Line
	5650 2600 5600 2600
Text Label 4550 3450 0    60   ~ 0
I2S_CLK
Text Label 4550 3550 0    60   ~ 0
I2S_WS
Text Label 4550 3350 0    60   ~ 0
I2S_IN
Text Label 4550 3250 0    60   ~ 0
I2S_OUT
Wire Wire Line
	4550 3250 4450 3250
Wire Wire Line
	4450 3350 4550 3350
Wire Wire Line
	4550 3450 4450 3450
Wire Wire Line
	4450 3550 4550 3550
Text Label 4550 1950 0    60   ~ 0
SCL
Text Label 4550 1850 0    60   ~ 0
SDA
Wire Wire Line
	4550 1850 4450 1850
Wire Wire Line
	4450 1950 4550 1950
Text Label 9300 3800 2    60   ~ 0
UI_RESET
Text Label 9300 4100 2    60   ~ 0
#LCD_CS
Text Label 9300 4300 2    60   ~ 0
UI_SI
Text Label 9300 4400 2    60   ~ 0
UI_SCK
Text Label 9300 4500 2    60   ~ 0
LCD_D/C
Text Label 9300 4600 2    60   ~ 0
+3.3V
$Comp
L power:GND #PWR011
U 1 1 55B31C6A
P 9300 4750
F 0 "#PWR011" H 9300 4750 30  0001 C CNN
F 1 "GND" H 9300 4680 30  0001 C CNN
F 2 "" H 9300 4750 60  0001 C CNN
F 3 "" H 9300 4750 60  0000 C CNN
	1    9300 4750
	1    0    0    -1  
$EndComp
Wire Wire Line
	9400 4700 9300 4700
Wire Wire Line
	9300 4700 9300 4750
Wire Wire Line
	9400 4600 9300 4600
Wire Wire Line
	9300 4500 9400 4500
Wire Wire Line
	9400 4400 9300 4400
Wire Wire Line
	9300 4300 9400 4300
Wire Wire Line
	9400 4200 9300 4200
Wire Wire Line
	9300 4100 9400 4100
$Comp
L dabradio:MICROSD P106
U 1 1 55B32F06
P 8450 5650
F 0 "P106" H 8700 5000 60  0000 C CNN
F 1 "MICROSD" V 8700 5650 60  0000 C CNN
F 2 "" H 8450 5850 60  0001 C CNN
F 3 "~" H 8450 5850 60  0000 C CNN
	1    8450 5650
	1    0    0    -1  
$EndComp
$Comp
L Device:Q_PMOS_GSD Q101
U 1 1 55B33E39
P 7350 4400
F 0 "Q101" H 7350 4590 60  0000 R CNN
F 1 "MOS_P" H 7350 4220 60  0000 R CNN
F 2 "TO_SOT_Packages_SMD:SOT-23" H 7350 4400 60  0001 C CNN
F 3 "~" H 7350 4400 60  0000 C CNN
	1    7350 4400
	0    1    1    0   
$EndComp
$Comp
L Device:R R121
U 1 1 55B33EAE
P 7850 4850
F 0 "R121" V 7930 4850 40  0000 C CNN
F 1 "68k" V 7857 4851 40  0000 C CNN
F 2 "Resistors_SMD:R_0603_HandSoldering" V 7780 4850 30  0001 C CNN
F 3 "~" H 7850 4850 30  0000 C CNN
	1    7850 4850
	1    0    0    -1  
$EndComp
$Comp
L Device:R R120
U 1 1 55B33EBB
P 7750 4850
F 0 "R120" V 7830 4850 40  0000 C CNN
F 1 "68k" V 7757 4851 40  0000 C CNN
F 2 "Resistors_SMD:R_0603_HandSoldering" V 7680 4850 30  0001 C CNN
F 3 "~" H 7750 4850 30  0000 C CNN
	1    7750 4850
	1    0    0    -1  
$EndComp
$Comp
L Device:R R119
U 1 1 55B33EC1
P 7650 4850
F 0 "R119" V 7730 4850 40  0000 C CNN
F 1 "68k" V 7657 4851 40  0000 C CNN
F 2 "Resistors_SMD:R_0603_HandSoldering" V 7580 4850 30  0001 C CNN
F 3 "~" H 7650 4850 30  0000 C CNN
	1    7650 4850
	1    0    0    -1  
$EndComp
$Comp
L Device:R R118
U 1 1 55B33EC7
P 7550 4850
F 0 "R118" V 7630 4850 40  0000 C CNN
F 1 "68k" V 7557 4851 40  0000 C CNN
F 2 "Resistors_SMD:R_0603_HandSoldering" V 7480 4850 30  0001 C CNN
F 3 "~" H 7550 4850 30  0000 C CNN
	1    7550 4850
	1    0    0    -1  
$EndComp
Wire Wire Line
	6950 5150 7750 5150
Wire Wire Line
	7750 5150 7750 5000
Wire Wire Line
	6950 5050 7850 5050
Wire Wire Line
	7850 5050 7850 5000
Wire Wire Line
	7650 5000 7650 5650
Wire Wire Line
	6950 5650 7650 5650
Wire Wire Line
	6950 5750 7550 5750
Wire Wire Line
	7550 5750 7550 5000
$Comp
L Device:R R117
U 1 1 55B348FB
P 7350 4850
F 0 "R117" V 7430 4850 40  0000 C CNN
F 1 "10k" V 7357 4851 40  0000 C CNN
F 2 "Resistors_SMD:R_0603_HandSoldering" V 7280 4850 30  0001 C CNN
F 3 "~" H 7350 4850 30  0000 C CNN
	1    7350 4850
	1    0    0    -1  
$EndComp
Wire Wire Line
	6950 5250 7350 5250
Wire Wire Line
	7350 5250 7350 5000
Wire Wire Line
	7850 4650 7850 4700
Wire Wire Line
	7750 4650 7750 4700
Connection ~ 7750 4650
Wire Wire Line
	7650 4500 7650 4650
Connection ~ 7650 4650
Wire Wire Line
	7550 4700 7550 4650
Connection ~ 7550 4650
Wire Wire Line
	7350 4700 7350 4650
Wire Wire Line
	8000 4650 8000 5350
Wire Wire Line
	8000 5350 8050 5350
Connection ~ 7850 4650
$Comp
L Device:C C129
U 1 1 55B352EE
P 7100 4700
F 0 "C129" H 7100 4800 40  0000 L CNN
F 1 "10u" H 7106 4615 40  0000 L CNN
F 2 "Capacitors_SMD:C_0805_HandSoldering" H 7138 4550 30  0001 C CNN
F 3 "~" H 7100 4700 60  0000 C CNN
	1    7100 4700
	-1   0    0    1   
$EndComp
$Comp
L Device:C C132
U 1 1 55B352F4
P 8200 4650
F 0 "C132" H 8200 4750 40  0000 L CNN
F 1 "100n" H 8206 4565 40  0000 L CNN
F 2 "Capacitors_SMD:C_0603_HandSoldering" H 8238 4500 30  0001 C CNN
F 3 "~" H 8200 4650 60  0000 C CNN
	1    8200 4650
	0    1    1    0   
$EndComp
Connection ~ 8000 4650
$Comp
L power:GND #PWR012
U 1 1 55B3559B
P 8400 4700
F 0 "#PWR012" H 8400 4700 30  0001 C CNN
F 1 "GND" H 8400 4630 30  0001 C CNN
F 2 "" H 8400 4700 60  0001 C CNN
F 3 "" H 8400 4700 60  0000 C CNN
	1    8400 4700
	1    0    0    -1  
$EndComp
Wire Wire Line
	8350 4650 8400 4650
Wire Wire Line
	8400 4650 8400 4700
Wire Wire Line
	7100 4300 7100 4500
Connection ~ 7100 4500
$Comp
L power:GND #PWR013
U 1 1 55B35DEB
P 8000 5850
F 0 "#PWR013" H 8000 5850 30  0001 C CNN
F 1 "GND" H 8000 5780 30  0001 C CNN
F 2 "" H 8000 5850 60  0001 C CNN
F 3 "" H 8000 5850 60  0000 C CNN
	1    8000 5850
	1    0    0    -1  
$EndComp
Wire Wire Line
	8050 5550 8000 5550
Wire Wire Line
	8000 5550 8000 5850
$Comp
L Device:C C130
U 1 1 55B360C5
P 7850 6200
F 0 "C130" H 7850 6300 40  0000 L CNN
F 1 "100n" H 7856 6115 40  0000 L CNN
F 2 "Capacitors_SMD:C_0603_HandSoldering" H 7888 6050 30  0001 C CNN
F 3 "~" H 7850 6200 60  0000 C CNN
	1    7850 6200
	0    1    1    0   
$EndComp
$Comp
L power:GND #PWR014
U 1 1 55B360CB
P 7650 6250
F 0 "#PWR014" H 7650 6250 30  0001 C CNN
F 1 "GND" H 7650 6180 30  0001 C CNN
F 2 "" H 7650 6250 60  0001 C CNN
F 3 "" H 7650 6250 60  0000 C CNN
	1    7650 6250
	1    0    0    -1  
$EndComp
Wire Wire Line
	7650 6050 7650 6200
Wire Wire Line
	7650 6200 7700 6200
Wire Wire Line
	8000 6200 8050 6200
$Comp
L Device:R R115
U 1 1 55B36624
P 6900 4300
F 0 "R115" V 6980 4300 40  0000 C CNN
F 1 "10k" V 6907 4301 40  0000 C CNN
F 2 "Resistors_SMD:R_0603_HandSoldering" V 6830 4300 30  0001 C CNN
F 3 "~" H 6900 4300 30  0000 C CNN
	1    6900 4300
	0    -1   -1   0   
$EndComp
Wire Wire Line
	7050 4150 7350 4150
$Comp
L power:GND #PWR015
U 1 1 55B37316
P 7100 4900
F 0 "#PWR015" H 7100 4900 30  0001 C CNN
F 1 "GND" H 7100 4830 30  0001 C CNN
F 2 "" H 7100 4900 60  0001 C CNN
F 3 "" H 7100 4900 60  0000 C CNN
	1    7100 4900
	1    0    0    -1  
$EndComp
$Comp
L Device:R R110
U 1 1 55B375C4
P 6800 5250
F 0 "R110" V 6880 5250 40  0000 C CNN
F 1 "10" V 6807 5251 40  0000 C CNN
F 2 "Resistors_SMD:R_0603_HandSoldering" V 6730 5250 30  0001 C CNN
F 3 "~" H 6800 5250 30  0000 C CNN
	1    6800 5250
	0    -1   -1   0   
$EndComp
$Comp
L Device:R R109
U 1 1 55B377CD
P 6800 5150
F 0 "R109" V 6880 5150 40  0000 C CNN
F 1 "10" V 6807 5151 40  0000 C CNN
F 2 "Resistors_SMD:R_0603_HandSoldering" V 6730 5150 30  0001 C CNN
F 3 "~" H 6800 5150 30  0000 C CNN
	1    6800 5150
	0    -1   -1   0   
$EndComp
$Comp
L Device:R R108
U 1 1 55B377D3
P 6800 5050
F 0 "R108" V 6880 5050 40  0000 C CNN
F 1 "10" V 6807 5051 40  0000 C CNN
F 2 "Resistors_SMD:R_0603_HandSoldering" V 6730 5050 30  0001 C CNN
F 3 "~" H 6800 5050 30  0000 C CNN
	1    6800 5050
	0    -1   -1   0   
$EndComp
$Comp
L Device:R R111
U 1 1 55B377D9
P 6800 5450
F 0 "R111" V 6880 5450 40  0000 C CNN
F 1 "10" V 6807 5451 40  0000 C CNN
F 2 "Resistors_SMD:R_0603_HandSoldering" V 6730 5450 30  0001 C CNN
F 3 "~" H 6800 5450 30  0000 C CNN
	1    6800 5450
	0    -1   -1   0   
$EndComp
$Comp
L Device:R R112
U 1 1 55B37847
P 6800 5650
F 0 "R112" V 6880 5650 40  0000 C CNN
F 1 "10" V 6807 5651 40  0000 C CNN
F 2 "Resistors_SMD:R_0603_HandSoldering" V 6730 5650 30  0001 C CNN
F 3 "~" H 6800 5650 30  0000 C CNN
	1    6800 5650
	0    -1   -1   0   
$EndComp
$Comp
L Device:R R113
U 1 1 55B3784D
P 6800 5750
F 0 "R113" V 6880 5750 40  0000 C CNN
F 1 "10" V 6807 5751 40  0000 C CNN
F 2 "Resistors_SMD:R_0603_HandSoldering" V 6730 5750 30  0001 C CNN
F 3 "~" H 6800 5750 30  0000 C CNN
	1    6800 5750
	0    -1   -1   0   
$EndComp
Connection ~ 7550 5750
Connection ~ 7650 5650
Connection ~ 7850 5050
Connection ~ 7750 5150
Connection ~ 7350 5250
Wire Wire Line
	8050 5450 6950 5450
Wire Wire Line
	7350 4150 7350 4200
Wire Wire Line
	7550 4500 7650 4500
Wire Wire Line
	7350 4650 7550 4650
Wire Wire Line
	6700 4500 7100 4500
Text Label 6700 4500 0    60   ~ 0
+3.3V
$Comp
L Device:R R116
U 1 1 55B34901
P 7300 5950
F 0 "R116" V 7380 5950 40  0000 C CNN
F 1 "10k" V 7307 5951 40  0000 C CNN
F 2 "Resistors_SMD:R_0603_HandSoldering" V 7230 5950 30  0001 C CNN
F 3 "~" H 7300 5950 30  0000 C CNN
	1    7300 5950
	0    -1   -1   0   
$EndComp
$Comp
L Device:R R114
U 1 1 55B39D4D
P 6900 4150
F 0 "R114" V 6980 4150 40  0000 C CNN
F 1 "100" V 6907 4151 40  0000 C CNN
F 2 "Resistors_SMD:R_0603_HandSoldering" V 6830 4150 30  0001 C CNN
F 3 "~" H 6900 4150 30  0000 C CNN
	1    6900 4150
	0    -1   -1   0   
$EndComp
Wire Wire Line
	6400 4150 6700 4150
Wire Wire Line
	8050 6050 7650 6050
Connection ~ 7650 6200
Wire Wire Line
	7450 5950 7550 5950
Text Label 7100 5950 2    60   ~ 0
+3.3V
Wire Wire Line
	7100 5950 7150 5950
Text Label 7600 5900 0    60   ~ 0
SD_CD
Wire Wire Line
	7600 5900 7550 5900
Wire Wire Line
	7550 5900 7550 5950
Connection ~ 7550 5950
Text Label 6600 5050 2    60   ~ 0
SD_DAT2
Text Label 6600 5150 2    60   ~ 0
SD_DAT3
Text Label 6600 5250 2    60   ~ 0
SD_CMD
Text Label 6600 5450 2    60   ~ 0
SD_CLK
Text Label 6600 5650 2    60   ~ 0
SD_DAT0
Text Label 6600 5750 2    60   ~ 0
SD_DAT1
Text Label 6400 4150 0    60   ~ 0
SD_PE
Connection ~ 6700 4150
Wire Wire Line
	6600 5050 6650 5050
Wire Wire Line
	6650 5150 6600 5150
Wire Wire Line
	6600 5250 6650 5250
Wire Wire Line
	6650 5450 6600 5450
Wire Wire Line
	6600 5650 6650 5650
Wire Wire Line
	6650 5750 6600 5750
Text Label 4500 4150 0    60   ~ 0
SD_DAT2
Text Label 4500 4250 0    60   ~ 0
SD_DAT3
Text Label 4500 4350 0    60   ~ 0
SD_CMD
Text Label 4500 4450 0    60   ~ 0
SD_CLK
Text Label 4500 4550 0    60   ~ 0
SD_DAT0
Text Label 4500 4650 0    60   ~ 0
SD_DAT1
Wire Wire Line
	4500 4650 4450 4650
Wire Wire Line
	4500 4550 4450 4550
Wire Wire Line
	4500 4450 4450 4450
Wire Wire Line
	4450 4350 4500 4350
Wire Wire Line
	4500 4250 4450 4250
Wire Wire Line
	4450 4150 4500 4150
Text Label 4550 2150 0    60   ~ 0
SD_CD
Wire Wire Line
	4550 2150 4450 2150
Text Label 4550 2050 0    60   ~ 0
SD_PE
Wire Wire Line
	4550 2050 4450 2050
Text Label 4550 2850 0    60   ~ 0
UI_SI
Text Label 4550 2950 0    60   ~ 0
UI_SCK
Text Label 4550 2650 0    60   ~ 0
#LCD_CS
Wire Wire Line
	4550 2650 4450 2650
Wire Wire Line
	4450 2850 4550 2850
Wire Wire Line
	4550 2950 4450 2950
Text Label 4550 3050 0    60   ~ 0
UI_RESET
Text Label 4550 3150 0    60   ~ 0
LCD_D/C
Wire Wire Line
	4550 3050 4450 3050
Wire Wire Line
	4450 3150 4550 3150
Text Label 5600 1600 2    60   ~ 0
DAB_RESET
Text Label 5600 1700 2    60   ~ 0
DAB_IRQ
Text Label 5600 2200 2    60   ~ 0
AC_IRQ
Wire Wire Line
	5600 1600 5650 1600
Wire Wire Line
	5650 1700 5600 1700
Wire Wire Line
	5600 2000 5650 2000
Text Label 4550 1750 0    60   ~ 0
DAB_RESET
Text Label 4550 1650 0    60   ~ 0
DAB_IRQ
Text Label 4550 1550 0    60   ~ 0
AC_IRQ
Wire Wire Line
	4550 1550 4450 1550
Wire Wire Line
	4450 1650 4550 1650
Wire Wire Line
	4550 1750 4450 1750
$Comp
L Connector_Generic:Conn_01x10 P109
U 1 1 55BA7821
P 9600 4200
F 0 "P109" V 9550 4200 60  0000 C CNN
F 1 "CONN_10" V 9650 4200 60  0000 C CNN
F 2 "Socket_Strips:Socket_Strip_Angled_1x10_Pitch2.54mm" H 9600 4200 60  0001 C CNN
F 3 "" H 9600 4200 60  0000 C CNN
	1    9600 4200
	1    0    0    -1  
$EndComp
Wire Wire Line
	9300 3800 9400 3800
Text Label 9300 4200 2    60   ~ 0
UI_SO
Text Label 9300 4000 2    60   ~ 0
#UI_CS1
Wire Wire Line
	9300 4000 9400 4000
Text Label 9300 3900 2    60   ~ 0
#UI_CS2
Wire Wire Line
	9300 3900 9400 3900
Text Label 4550 2750 0    60   ~ 0
UI_SO
Wire Wire Line
	4550 2750 4450 2750
Text Label 4550 2450 0    60   ~ 0
#UI_CS1
Text Label 4550 2550 0    60   ~ 0
#UI_CS2
Wire Wire Line
	4450 2550 4550 2550
Wire Wire Line
	4550 2450 4450 2450
$Comp
L dabradio:MCP16311 U102
U 1 1 55BA9C52
P 4150 6900
F 0 "U102" H 4250 6900 60  0000 C CNN
F 1 "MCP16311" H 4250 6800 60  0000 C CNN
F 2 "Housings_SSOP:MSOP-8_3x3mm_Pitch0.65mm" H 4150 7300 60  0001 C CNN
F 3 "~" H 4150 7300 60  0000 C CNN
	1    4150 6900
	1    0    0    -1  
$EndComp
$Comp
L Device:C C121
U 1 1 55BA9F29
P 4400 6300
F 0 "C121" H 4400 6400 40  0000 L CNN
F 1 "100n" H 4406 6215 40  0000 L CNN
F 2 "Capacitors_SMD:C_0603_HandSoldering" H 4438 6150 30  0001 C CNN
F 3 "~" H 4400 6300 60  0000 C CNN
	1    4400 6300
	0    1    1    0   
$EndComp
$Comp
L Device:C C120
U 1 1 55BA9FFD
P 3350 7250
F 0 "C120" H 3350 7350 40  0000 L CNN
F 1 "1u" H 3356 7165 40  0000 L CNN
F 2 "Capacitors_SMD:C_0603_HandSoldering" H 3388 7100 30  0001 C CNN
F 3 "~" H 3350 7250 60  0000 C CNN
	1    3350 7250
	0    -1   -1   0   
$EndComp
$Comp
L Device:R R105
U 1 1 55BAA20F
P 3350 7000
F 0 "R105" V 3430 7000 40  0000 C CNN
F 1 "1M" V 3357 7001 40  0000 C CNN
F 2 "Resistors_SMD:R_0603_HandSoldering" V 3280 7000 30  0001 C CNN
F 3 "~" H 3350 7000 30  0000 C CNN
	1    3350 7000
	0    -1   -1   0   
$EndComp
Wire Wire Line
	3500 7000 3550 7000
Wire Wire Line
	3550 7250 3500 7250
Wire Wire Line
	2650 6750 2800 6750
Wire Wire Line
	3150 6750 3150 7000
Wire Wire Line
	3150 7000 3200 7000
$Comp
L Device:C C118
U 1 1 55BAA9E4
P 3000 7000
F 0 "C118" H 3000 7100 40  0000 L CNN
F 1 "10u 35V" H 3006 6915 40  0000 L CNN
F 2 "Capacitors_SMD:C_1210_HandSoldering" H 3038 6850 30  0001 C CNN
F 3 "~" H 3000 7000 60  0000 C CNN
	1    3000 7000
	-1   0    0    1   
$EndComp
$Comp
L Device:C C117
U 1 1 55BAABE8
P 2800 7000
F 0 "C117" H 2800 7100 40  0000 L CNN
F 1 "10u 35V" H 2806 6915 40  0000 L CNN
F 2 "Capacitors_SMD:C_1210_HandSoldering" H 2838 6850 30  0001 C CNN
F 3 "~" H 2800 7000 60  0000 C CNN
	1    2800 7000
	-1   0    0    1   
$EndComp
Wire Wire Line
	3000 7150 3000 7250
Wire Wire Line
	2800 7250 2800 7150
Connection ~ 3000 7250
$Comp
L power:GND #PWR016
U 1 1 55BAB2A0
P 3000 7300
F 0 "#PWR016" H 3000 7300 30  0001 C CNN
F 1 "GND" H 3000 7230 30  0001 C CNN
F 2 "" H 3000 7300 60  0001 C CNN
F 3 "" H 3000 7300 60  0000 C CNN
	1    3000 7300
	1    0    0    -1  
$EndComp
Connection ~ 3150 6750
Wire Wire Line
	3000 6750 3000 6850
Wire Wire Line
	2800 6750 2800 6850
Connection ~ 3000 6750
Connection ~ 2800 6750
$Comp
L Device:L L103
U 1 1 55BABF2F
P 5000 6650
F 0 "L103" H 5000 6750 50  0000 C CNN
F 1 "15u" H 5000 6600 50  0000 C CNN
F 2 "Inductors:Inductor_Taiyo-Yuden_NR-60xx_HandSoldering" H 5000 6650 60  0001 C CNN
F 3 "~" H 5000 6650 60  0000 C CNN
	1    5000 6650
	0    -1   -1   0   
$EndComp
Wire Wire Line
	4750 6650 4800 6650
Wire Wire Line
	4800 6650 4800 6300
Wire Wire Line
	4800 6300 4550 6300
Connection ~ 4800 6650
Wire Wire Line
	4250 6300 4050 6300
Wire Wire Line
	4050 6300 4050 6350
$Comp
L Device:R R106
U 1 1 55BAC54E
P 5200 6950
F 0 "R106" V 5280 6950 40  0000 C CNN
F 1 "31k2 0.1%" V 5207 6951 40  0000 C CNN
F 2 "Resistors_SMD:R_0603_HandSoldering" V 5130 6950 30  0001 C CNN
F 3 "~" H 5200 6950 30  0000 C CNN
	1    5200 6950
	1    0    0    -1  
$EndComp
$Comp
L Device:R R107
U 1 1 55BAC55B
P 5200 7450
F 0 "R107" V 5280 7450 40  0000 C CNN
F 1 "10k 0.1%" V 5207 7451 40  0000 C CNN
F 2 "Resistors_SMD:R_0603_HandSoldering" V 5130 7450 30  0001 C CNN
F 3 "~" H 5200 7450 30  0000 C CNN
	1    5200 7450
	1    0    0    -1  
$EndComp
Wire Wire Line
	4750 7250 5200 7250
Wire Wire Line
	5200 7100 5200 7250
Connection ~ 5200 7250
Wire Wire Line
	5150 6650 5200 6650
Wire Wire Line
	5200 6650 5200 6800
$Comp
L Device:C C123
U 1 1 55BACB7C
P 5400 6950
F 0 "C123" H 5400 7050 40  0000 L CNN
F 1 "10u" H 5406 6865 40  0000 L CNN
F 2 "Capacitors_SMD:C_0805_HandSoldering" H 5438 6800 30  0001 C CNN
F 3 "~" H 5400 6950 60  0000 C CNN
	1    5400 6950
	-1   0    0    1   
$EndComp
$Comp
L Device:C C125
U 1 1 55BACB82
P 5600 6950
F 0 "C125" H 5600 7050 40  0000 L CNN
F 1 "10u" H 5606 6865 40  0000 L CNN
F 2 "Capacitors_SMD:C_0805_HandSoldering" H 5638 6800 30  0001 C CNN
F 3 "~" H 5600 6950 60  0000 C CNN
	1    5600 6950
	-1   0    0    1   
$EndComp
Wire Wire Line
	5600 7200 5600 7100
Wire Wire Line
	5400 7100 5400 7200
Connection ~ 5200 6650
Wire Wire Line
	5600 6800 5600 6650
Connection ~ 5600 6650
Wire Wire Line
	5400 6800 5400 6650
Connection ~ 5400 6650
Wire Wire Line
	5200 7600 5200 7650
$Comp
L power:GND #PWR017
U 1 1 55BAE51F
P 5200 7650
F 0 "#PWR017" H 5200 7650 30  0001 C CNN
F 1 "GND" H 5200 7580 30  0001 C CNN
F 2 "" H 5200 7650 60  0001 C CNN
F 3 "" H 5200 7650 60  0000 C CNN
	1    5200 7650
	1    0    0    -1  
$EndComp
$Comp
L power:GND #PWR018
U 1 1 55BAE52F
P 5500 7250
F 0 "#PWR018" H 5500 7250 30  0001 C CNN
F 1 "GND" H 5500 7180 30  0001 C CNN
F 2 "" H 5500 7250 60  0001 C CNN
F 3 "" H 5500 7250 60  0000 C CNN
	1    5500 7250
	1    0    0    -1  
$EndComp
$Comp
L power:GND #PWR019
U 1 1 55BAE535
P 4250 7600
F 0 "#PWR019" H 4250 7600 30  0001 C CNN
F 1 "GND" H 4250 7530 30  0001 C CNN
F 2 "" H 4250 7600 60  0001 C CNN
F 3 "" H 4250 7600 60  0000 C CNN
	1    4250 7600
	1    0    0    -1  
$EndComp
$Comp
L power:GND #PWR020
U 1 1 55BAE53B
P 4050 7600
F 0 "#PWR020" H 4050 7600 30  0001 C CNN
F 1 "GND" H 4050 7530 30  0001 C CNN
F 2 "" H 4050 7600 60  0001 C CNN
F 3 "" H 4050 7600 60  0000 C CNN
	1    4050 7600
	1    0    0    -1  
$EndComp
Wire Wire Line
	4050 7550 4050 7600
Wire Wire Line
	4250 7550 4250 7600
Wire Wire Line
	5500 7200 5500 7250
Connection ~ 5500 7200
Text Label 5850 6650 2    60   ~ 0
+3.3V
Text Label 2650 6750 0    60   ~ 0
Vcc
$Comp
L Connector_Generic:Conn_01x02 P101
U 1 1 55BAFEA3
P 850 7300
F 0 "P101" V 800 7300 40  0000 C CNN
F 1 "CONN_2" V 900 7300 40  0000 C CNN
F 2 "Sockets_MOLEX_KK-System:Socket_MOLEX-KK-RM2-54mm_Lock_2pin_straight" H 850 7300 60  0001 C CNN
F 3 "" H 850 7300 60  0000 C CNN
	1    850  7300
	-1   0    0    -1  
$EndComp
$Comp
L Device:D D101
U 1 1 55BB0710
P 1650 7200
F 0 "D101" H 1650 7300 40  0000 C CNN
F 1 "DIODE" H 1650 7100 40  0000 C CNN
F 2 "Diodes_SMD:D_SMA_Handsoldering" H 1650 7200 60  0001 C CNN
F 3 "~" H 1650 7200 60  0000 C CNN
	1    1650 7200
	-1   0    0    1   
$EndComp
$Comp
L Device:D_TVS D102
U 1 1 55BB08B7
P 1850 7400
F 0 "D102" H 1850 7500 50  0000 C CNN
F 1 "ZENER" H 1850 7300 40  0000 C CNN
F 2 "Diodes_SMD:D_SMA_Handsoldering" H 1850 7400 60  0001 C CNN
F 3 "~" H 1850 7400 60  0000 C CNN
	1    1850 7400
	0    1    1    0   
$EndComp
$Comp
L Device:R R103
U 1 1 55BB08D0
P 1300 7200
F 0 "R103" V 1380 7200 40  0000 C CNN
F 1 "R" V 1307 7201 40  0000 C CNN
F 2 "Resistors_SMD:R_0603_HandSoldering" V 1230 7200 30  0001 C CNN
F 3 "~" H 1300 7200 30  0000 C CNN
	1    1300 7200
	0    -1   -1   0   
$EndComp
Wire Wire Line
	1100 7600 1850 7600
Wire Wire Line
	1100 7600 1100 7400
Wire Wire Line
	1100 7400 1050 7400
Wire Wire Line
	1050 7300 1100 7300
Wire Wire Line
	1100 7300 1100 7200
Wire Wire Line
	1100 7200 1150 7200
Wire Wire Line
	1450 7200 1500 7200
Wire Wire Line
	1800 7200 1850 7200
$Comp
L Device:L L102
U 1 1 55BB1CFD
P 2050 7200
F 0 "L102" H 2050 7300 50  0000 C CNN
F 1 "47u" V 2050 7150 50  0000 C CNN
F 2 "Resistors_SMD:R_0805" H 2050 7200 60  0001 C CNN
F 3 "~" H 2050 7200 60  0000 C CNN
	1    2050 7200
	0    -1   -1   0   
$EndComp
Text Label 2250 7200 0    60   ~ 0
Vcc
Wire Wire Line
	2250 7200 2200 7200
Wire Wire Line
	1850 7250 1850 7200
Connection ~ 1850 7200
$Comp
L power:GND #PWR021
U 1 1 55BB26A5
P 1850 7650
F 0 "#PWR021" H 1850 7650 30  0001 C CNN
F 1 "GND" H 1850 7580 30  0001 C CNN
F 2 "" H 1850 7650 60  0001 C CNN
F 3 "" H 1850 7650 60  0000 C CNN
	1    1850 7650
	1    0    0    -1  
$EndComp
Wire Wire Line
	1850 7550 1850 7600
Connection ~ 1850 7600
Wire Wire Line
	7050 4300 7100 4300
Wire Wire Line
	6750 4300 6700 4300
Wire Wire Line
	6700 4300 6700 4150
Wire Wire Line
	7100 4850 7100 4900
Text Label 1900 6650 0    60   ~ 0
UTX
Text Label 1900 6750 0    60   ~ 0
URX
Wire Wire Line
	1800 6650 1900 6650
Wire Wire Line
	1900 6750 1800 6750
Text Label 1950 3450 2    60   ~ 0
URX
Text Label 1950 3550 2    60   ~ 0
UTX
Wire Wire Line
	2050 3450 1950 3450
Wire Wire Line
	1950 3550 2050 3550
$Comp
L Connector_Generic:Conn_01x10 P104
U 1 1 55BB9A5E
P 6000 3650
F 0 "P104" V 5950 3650 60  0000 C CNN
F 1 "CONN_10" V 6050 3650 60  0000 C CNN
F 2 "Socket_Strips:Socket_Strip_Straight_2x05_Pitch2.54mm" H 6000 3650 60  0001 C CNN
F 3 "" H 6000 3650 60  0000 C CNN
	1    6000 3650
	1    0    0    -1  
$EndComp
Wire Wire Line
	4450 3650 5800 3650
Wire Wire Line
	5800 3750 4450 3750
Wire Wire Line
	4450 3850 5800 3850
Wire Wire Line
	5800 3950 4450 3950
$Comp
L power:GND #PWR022
U 1 1 55BBA3DB
P 5700 4200
F 0 "#PWR022" H 5700 4200 30  0001 C CNN
F 1 "GND" H 5700 4130 30  0001 C CNN
F 2 "" H 5700 4200 60  0001 C CNN
F 3 "" H 5700 4200 60  0000 C CNN
	1    5700 4200
	1    0    0    -1  
$EndComp
Text Label 5700 4050 2    60   ~ 0
+3.3V
Wire Wire Line
	5700 4050 5800 4050
Wire Wire Line
	5800 4150 5700 4150
Wire Wire Line
	5700 4150 5700 4200
Text Label 1950 4250 2    60   ~ 0
USB-
Text Label 1950 4350 2    60   ~ 0
USB+
Wire Wire Line
	1950 4350 2050 4350
Wire Wire Line
	1950 4250 2050 4250
Text Label 5700 3250 2    60   ~ 0
USB-
Text Label 5700 3350 2    60   ~ 0
USB+
Wire Wire Line
	5700 3250 5800 3250
Wire Wire Line
	5800 3350 5700 3350
Text Label 1950 3250 2    60   ~ 0
AD4
Text Label 1950 3350 2    60   ~ 0
AD5
Wire Wire Line
	1950 3250 2050 3250
Wire Wire Line
	2050 3350 1950 3350
Text Label 5700 3450 2    60   ~ 0
AD4
Text Label 5700 3550 2    60   ~ 0
AD5
Wire Wire Line
	5700 3450 5800 3450
Wire Wire Line
	5800 3550 5700 3550
$Comp
L dabradio:LM4120 U103
U 1 1 55BBDB1D
P 4950 5400
F 0 "U103" H 4750 5700 60  0000 C CNN
F 1 "LM4132-2.500" H 5150 5050 60  0000 C CNN
F 2 "TO_SOT_Packages_SMD:SOT-23-5_HandSoldering" H 4950 5400 60  0001 C CNN
F 3 "" H 4950 5400 60  0000 C CNN
	1    4950 5400
	1    0    0    -1  
$EndComp
$Comp
L Device:C C126
U 1 1 55BBDE64
P 5450 5650
F 0 "C126" H 5450 5750 40  0000 L CNN
F 1 "22n" H 5456 5565 40  0000 L CNN
F 2 "Capacitors_SMD:C_0603_HandSoldering" H 5488 5500 30  0001 C CNN
F 3 "~" H 5450 5650 60  0000 C CNN
	1    5450 5650
	1    0    0    -1  
$EndComp
Wire Wire Line
	4950 5900 4950 5950
Wire Wire Line
	4950 5950 5450 5950
Wire Wire Line
	5450 5950 5450 5800
Wire Wire Line
	5400 5400 5450 5400
Wire Wire Line
	5450 5400 5450 5500
$Comp
L power:GND #PWR023
U 1 1 55BBE39D
P 4950 6000
F 0 "#PWR023" H 4950 6000 30  0001 C CNN
F 1 "GND" H 4950 5930 30  0001 C CNN
F 2 "" H 4950 6000 60  0001 C CNN
F 3 "" H 4950 6000 60  0000 C CNN
	1    4950 6000
	1    0    0    -1  
$EndComp
Connection ~ 4950 5950
NoConn ~ 4500 5400
$Comp
L Device:C C124
U 1 1 55BBE5A4
P 5250 4900
F 0 "C124" H 5250 5000 40  0000 L CNN
F 1 "100n" H 5256 4815 40  0000 L CNN
F 2 "Capacitors_SMD:C_0603_HandSoldering" H 5288 4750 30  0001 C CNN
F 3 "~" H 5250 4900 60  0000 C CNN
	1    5250 4900
	0    1    1    0   
$EndComp
$Comp
L power:GND #PWR024
U 1 1 55BBE5AA
P 5450 4950
F 0 "#PWR024" H 5450 4950 30  0001 C CNN
F 1 "GND" H 5450 4880 30  0001 C CNN
F 2 "" H 5450 4950 60  0001 C CNN
F 3 "" H 5450 4950 60  0000 C CNN
	1    5450 4950
	1    0    0    -1  
$EndComp
Wire Wire Line
	4800 4900 4850 4900
Wire Wire Line
	5050 4900 5050 4950
Wire Wire Line
	4850 4900 4850 4950
Connection ~ 5050 4900
Wire Wire Line
	5400 4900 5450 4900
Wire Wire Line
	5450 4900 5450 4950
Text Label 4800 4900 2    60   ~ 0
+3.3V
Connection ~ 4850 4900
Text Label 5500 5400 0    60   ~ 0
+2.5V REF
Connection ~ 5450 5400
Text Label 1750 3100 2    60   ~ 0
+2.5V REF
Wire Wire Line
	2050 2850 1950 2850
Wire Wire Line
	1950 2850 1950 3100
Wire Wire Line
	1950 3100 1750 3100
Wire Wire Line
	5400 7200 5500 7200
Wire Wire Line
	2800 7250 3000 7250
Wire Wire Line
	6900 2000 6600 2000
Wire Wire Line
	6950 1450 6950 1700
Wire Wire Line
	6950 2100 6600 2100
Wire Wire Line
	7400 2000 7050 2000
Wire Wire Line
	7050 2000 7050 2200
Wire Wire Line
	7050 2200 6600 2200
Wire Wire Line
	5600 2200 5650 2200
$Comp
L Device:R R124
U 1 1 560D7793
P 6550 950
F 0 "R124" V 6630 950 40  0000 C CNN
F 1 "100k" V 6557 951 40  0000 C CNN
F 2 "Resistors_SMD:R_0603_HandSoldering" V 6480 950 30  0001 C CNN
F 3 "~" H 6550 950 30  0000 C CNN
	1    6550 950 
	1    0    0    -1  
$EndComp
$Comp
L Device:R R123
U 1 1 560D7A04
P 6450 950
F 0 "R123" V 6530 950 40  0000 C CNN
F 1 "3k3" V 6457 951 40  0000 C CNN
F 2 "Resistors_SMD:R_0603_HandSoldering" V 6380 950 30  0001 C CNN
F 3 "~" H 6450 950 30  0000 C CNN
	1    6450 950 
	-1   0    0    1   
$EndComp
$Comp
L Device:R R122
U 1 1 560D7A0A
P 6350 950
F 0 "R122" V 6430 950 40  0000 C CNN
F 1 "3k3" V 6357 951 40  0000 C CNN
F 2 "Resistors_SMD:R_0603_HandSoldering" V 6280 950 30  0001 C CNN
F 3 "~" H 6350 950 30  0000 C CNN
	1    6350 950 
	-1   0    0    1   
$EndComp
Wire Wire Line
	6450 1100 6450 1350
Wire Wire Line
	6350 1100 6350 1400
Connection ~ 6900 550 
Wire Wire Line
	6450 800  6450 550 
Wire Wire Line
	6350 800  6350 550 
Connection ~ 6450 550 
$Comp
L Device:R R125
U 1 1 560D8D3D
P 9050 2400
F 0 "R125" V 9130 2400 40  0000 C CNN
F 1 "1M" V 9057 2401 40  0000 C CNN
F 2 "Resistors_SMD:R_0603_HandSoldering" V 8980 2400 30  0001 C CNN
F 3 "~" H 9050 2400 30  0000 C CNN
	1    9050 2400
	0    1    1    0   
$EndComp
Wire Wire Line
	8900 2400 8850 2400
Connection ~ 8850 2400
Wire Wire Line
	9200 2400 9250 2400
Wire Wire Line
	9250 2400 9250 2200
Connection ~ 9250 2200
$Sheet
S 7400 1900 1100 1700
U 55AE8620
F0 "Audio Codec" 50
F1 "max98089.sch" 50
F2 "I2S1_OUT" O R 8500 2600 60 
F3 "I2S1_IN" I R 8500 2700 60 
F4 "I2S1_WS" O R 8500 2400 60 
F5 "I2S1_CLK" O R 8500 2500 60 
F6 "SCL" B L 7400 2100 60 
F7 "SDA" B L 7400 2200 60 
F8 "#IRQ" O L 7400 2000 60 
F9 "+3.3V" I R 8500 2000 60 
F10 "I2S2_CLK" O L 7400 2400 60 
F11 "I2S2_WS" O L 7400 2700 60 
F12 "I2S2_IN" I L 7400 2600 60 
F13 "I2S2_OUT" O L 7400 2500 60 
F14 "SPKL+" O R 8500 2900 60 
F15 "SPKL-" O R 8500 3000 60 
F16 "SPKR+" O R 8500 3100 60 
F17 "SPKR-" O R 8500 3200 60 
F18 "+1.8V" I R 8500 2100 60 
F19 "LINEL" O R 8500 3400 60 
F20 "LINER" O R 8500 3500 60 
F21 "GND" I R 8500 2200 60 
$EndSheet
Wire Wire Line
	6550 1100 6550 1450
Wire Wire Line
	6550 1450 6950 1450
Connection ~ 6950 1700
Wire Wire Line
	6350 1400 7200 1400
Connection ~ 7200 1400
Wire Wire Line
	7150 1200 7400 1200
Wire Wire Line
	6450 1350 7150 1350
Connection ~ 7150 1350
Wire Wire Line
	6550 800  6550 750 
Connection ~ 6650 750 
Wire Wire Line
	2000 2050 2050 2050
Wire Wire Line
	2000 2050 2000 2250
Wire Wire Line
	2000 2450 2050 2450
Wire Wire Line
	2000 2250 2050 2250
Wire Wire Line
	2000 2250 2000 2450
Wire Wire Line
	1600 2450 1600 2500
Wire Wire Line
	1600 2250 1600 2450
Wire Wire Line
	2000 1750 2050 1750
Wire Wire Line
	1200 1750 1400 1750
Wire Wire Line
	1100 2150 1200 2150
Wire Wire Line
	1700 2650 2050 2650
Wire Wire Line
	1400 1750 2000 1750
Wire Wire Line
	1400 2650 1700 2650
Wire Wire Line
	950  2850 950  2900
Wire Wire Line
	1600 1450 1600 1500
Wire Wire Line
	1600 1000 1600 1200
Wire Wire Line
	1600 1200 1600 1450
Wire Wire Line
	2000 1200 2050 1200
Wire Wire Line
	2000 1200 2000 1450
Wire Wire Line
	2000 1000 2050 1000
Wire Wire Line
	2000 1000 2000 1200
Wire Wire Line
	2000 1450 2050 1450
Wire Wire Line
	2000 800  2000 1000
Wire Wire Line
	2000 800  2050 800 
Wire Wire Line
	1450 650  2000 650 
Wire Wire Line
	3150 5500 3250 5500
Wire Wire Line
	3250 5500 3250 5550
Wire Wire Line
	3250 5500 3350 5500
Wire Wire Line
	3350 5500 3450 5500
Wire Wire Line
	950  4200 950  4250
Wire Wire Line
	1350 4200 1350 4250
Wire Wire Line
	2000 4850 2050 4850
Wire Wire Line
	1250 6750 1300 6750
Wire Wire Line
	9500 1000 9500 1050
Wire Wire Line
	10500 900  10500 1050
Wire Wire Line
	8950 900  9500 900 
Wire Wire Line
	8950 900  8950 2000
Wire Wire Line
	7350 1500 7350 1700
Wire Wire Line
	8900 1000 8900 2100
Wire Wire Line
	9500 900  9550 900 
Wire Wire Line
	9500 1700 9850 1700
Wire Wire Line
	9850 1700 10200 1700
Wire Wire Line
	10200 1700 10500 1700
Wire Wire Line
	8850 1700 8850 2200
Wire Wire Line
	8850 1700 9500 1700
Wire Wire Line
	8850 2200 8900 2200
Wire Wire Line
	8850 2200 8850 2400
Wire Wire Line
	7350 1700 8850 1700
Wire Wire Line
	7300 550  8950 550 
Wire Wire Line
	7200 1800 7200 2100
Wire Wire Line
	7150 1900 7150 2200
Wire Wire Line
	7750 4650 7850 4650
Wire Wire Line
	7650 4650 7650 4700
Wire Wire Line
	7650 4650 7750 4650
Wire Wire Line
	7550 4650 7650 4650
Wire Wire Line
	7850 4650 8000 4650
Wire Wire Line
	8000 4650 8050 4650
Wire Wire Line
	7100 4500 7100 4550
Wire Wire Line
	7100 4500 7150 4500
Wire Wire Line
	7550 5750 8050 5750
Wire Wire Line
	7650 5650 8050 5650
Wire Wire Line
	7850 5050 8050 5050
Wire Wire Line
	7750 5150 8050 5150
Wire Wire Line
	7350 5250 8050 5250
Wire Wire Line
	7650 6200 7650 6250
Wire Wire Line
	7550 5950 8050 5950
Wire Wire Line
	6700 4150 6750 4150
Wire Wire Line
	3000 7250 3000 7300
Wire Wire Line
	3000 7250 3200 7250
Wire Wire Line
	3150 6750 3550 6750
Wire Wire Line
	3000 6750 3150 6750
Wire Wire Line
	2800 6750 3000 6750
Wire Wire Line
	4800 6650 4850 6650
Wire Wire Line
	5200 7250 5200 7300
Wire Wire Line
	5200 6650 5400 6650
Wire Wire Line
	5600 6650 5850 6650
Wire Wire Line
	5400 6650 5600 6650
Wire Wire Line
	5500 7200 5600 7200
Wire Wire Line
	1850 7200 1900 7200
Wire Wire Line
	1850 7600 1850 7650
Wire Wire Line
	4950 5950 4950 6000
Wire Wire Line
	5050 4900 5100 4900
Wire Wire Line
	4850 4900 5050 4900
Wire Wire Line
	5450 5400 5500 5400
Wire Wire Line
	6900 550  7300 550 
Wire Wire Line
	6450 550  6900 550 
Wire Wire Line
	8850 2400 8850 3600
Wire Wire Line
	9250 2200 9500 2200
Wire Wire Line
	6950 1700 6950 2100
Wire Wire Line
	7200 1400 7200 1800
Wire Wire Line
	7150 1350 7150 1900
Wire Wire Line
	6650 750  7400 750 
$EndSCHEMATC
