*----------------------------------------------------------------------
* SPICE Model generated by Murata Manufacturing Co., Ltd.
* Copyright(C) Murata Manufacturing Co., Ltd.
* Description :1608M(0603)/X7R/2200pF/50V
* Murata P/N :GCM188R71H222KA37
* Property : C = 2200[pF]
* Data Generated on Nov 6, 2018
*----------------------------------------------------------------------
* Applicable Conditions:
*   Frequency Range = 100Hz-6GHz
*   Temperature = 25 degC
*   DC Bias Voltage = 2.5V
*   Small Signal Operation
*----------------------------------------------------------------------
.SUBCKT GCM188R71H222KA37 port1 port2
C1 port1 11 2.28e-9
L2 11 12 1.70e-10
R3 12 13 1.50e-1
C4 13 14 2.19e-7
R4 13 14 7.28e+3
C5 14 15 3.00e-7
R5 14 15 410
C6 15 16 2.77e-7
R6 15 16 42.9
C7 16 17 2.07e-7
R7 16 17 6.44
C8 17 18 1.38e-7
R8 17 18 1.22
C9 18 19 7.47e-8
R9 18 19 3.04e-1
C10 19 20 3.43e-8
R10 19 20 1.01e-1
C11 20 21 1.04e-8
L11 20 21 1.49e-11
R11 20 21 7.82e-2
C12 21 22 2.61e-9
L12 21 22 2.71e-11
R12 21 22 1.75e-1
C13 22 23 1.88e-11
L13 22 23 1.38e-10
R13 22 23 2.45
C14 23 port2 1.76e-12
L14 23 port2 1.76e-10
R14 23 port2 19.2
R100 port1 11 1.00e+10
.ENDS GCM188R71H222KA37