*----------------------------------------------------------------------
* SPICE Model generated by Murata Manufacturing Co., Ltd.
* Copyright(C) Murata Manufacturing Co., Ltd.
* Description :1220M(0508)/X7R/0.47uF/10V
* Murata P/N :LLL219R71A474MA01
* Property : C = 0.47[uF]
* Data Generated on Nov 6, 2018
*----------------------------------------------------------------------
* Applicable Conditions:
*   Frequency Range = 100Hz-6GHz
*   Temperature = 25 degC
*   DC Bias Voltage = 0V
*   Small Signal Operation
*----------------------------------------------------------------------
.SUBCKT LLL219R71A474MA01 port1 port2
C1 port1 11 4.91e-7
L2 11 12 5.84e-11
R3 12 13 3.71e-3
C4 13 14 5.43e-5
R4 13 14 73.3
C5 14 15 8.20e-5
R5 14 15 8.81
C6 15 16 5.74e-5
R6 15 16 1.97
C7 16 17 6.40e-5
R7 16 17 2.99e-1
C8 17 18 5.04e-5
R8 17 18 4.16e-2
C9 18 19 3.73e-5
R9 18 19 6.50e-3
L10 19 20 8.70e-11
R10 19 20 3.20e-2
L11 20 21 5.15e-12
R11 20 21 2.15e-2
C12 21 22 1.11e-6
L12 21 22 2.89e-11
R12 21 22 2.79e-2
C13 22 23 4.25e-7
L13 22 23 2.87e-11
R13 22 23 2.30e-2
C14 23 port2 5.43e-12
L14 23 port2 8.68e-11
R14 23 port2 11.0
R100 port1 11 1.06e+9
.ENDS LLL219R71A474MA01