EESchema Schematic File Version 4
LIBS:shield-cache
EELAYER 26 0
EELAYER END
$Descr A4 11693 8268
encoding utf-8
Sheet 2 3
Title "Music Shield"
Date "2020-10-17"
Rev "r1"
Comp "(c) 2020 Andreas Messer"
Comment1 "Audio codec"
Comment2 ""
Comment3 ""
Comment4 ""
$EndDescr
Text HLabel 3950 3050 0    60   Input ~ 0
I2S_SI_IN
Text HLabel 3950 2950 0    60   Output ~ 0
I2S_SI_LRCLK
Text HLabel 3950 2850 0    60   Output ~ 0
I2S_SI_BCLK
Text HLabel 4150 3350 0    60   BiDi ~ 0
SCL
Text HLabel 4150 3450 0    60   BiDi ~ 0
SDA
Text HLabel 4150 3550 0    60   Output ~ 0
#IRQ
$Comp
L Device:C C?
U 1 1 5FF2275F
P 3100 2950
AR Path="/5FF2275F" Ref="C?"  Part="1" 
AR Path="/55AE8620/5FF2275F" Ref="C?"  Part="1" 
AR Path="/5F622C8F/5FF2275F" Ref="C202"  Part="1" 
AR Path="/5F6294E6/5FF2275F" Ref="C?"  Part="1" 
F 0 "C202" H 3100 3050 40  0000 L CNN
F 1 "1uF" H 3106 2865 40  0000 L CNN
F 2 "Capacitors_SMD:C_0603" H 3138 2800 30  0001 C CNN
F 3 "~" H 3100 2950 60  0000 C CNN
	1    3100 2950
	1    0    0    -1  
$EndComp
$Comp
L Device:C C?
U 1 1 5FF22766
P 6300 2150
AR Path="/5FF22766" Ref="C?"  Part="1" 
AR Path="/55AE8620/5FF22766" Ref="C?"  Part="1" 
AR Path="/5F622C8F/5FF22766" Ref="C207"  Part="1" 
AR Path="/5F6294E6/5FF22766" Ref="C?"  Part="1" 
F 0 "C207" H 6300 2250 40  0000 L CNN
F 1 "1uF" H 6306 2065 40  0000 L CNN
F 2 "Capacitors_SMD:C_0603" H 6338 2000 30  0001 C CNN
F 3 "~" H 6300 2150 60  0000 C CNN
	1    6300 2150
	1    0    0    -1  
$EndComp
$Comp
L Device:C C?
U 1 1 5FF2276D
P 3100 2350
AR Path="/5FF2276D" Ref="C?"  Part="1" 
AR Path="/55AE8620/5FF2276D" Ref="C?"  Part="1" 
AR Path="/5F622C8F/5FF2276D" Ref="C201"  Part="1" 
AR Path="/5F6294E6/5FF2276D" Ref="C?"  Part="1" 
F 0 "C201" H 3100 2450 40  0000 L CNN
F 1 "1uF" H 3106 2265 40  0000 L CNN
F 2 "Capacitors_SMD:C_0603" H 3138 2200 30  0001 C CNN
F 3 "~" H 3100 2350 60  0000 C CNN
	1    3100 2350
	1    0    0    -1  
$EndComp
Text HLabel 3950 2250 0    60   Input ~ 0
I2S_MC_BCLK
Text HLabel 3950 2350 0    60   Input ~ 0
I2S_MC_LRCLK
Text HLabel 3950 2450 0    60   Input ~ 0
I2S_MC_IN
Text HLabel 3950 2550 0    60   Output ~ 0
I2S_MC_OUT
$Comp
L power:GND #PWR0202
U 1 1 5FF22783
P 3100 2550
AR Path="/5F622C8F/5FF22783" Ref="#PWR0202"  Part="1" 
AR Path="/5F6294E6/5FF22783" Ref="#PWR?"  Part="1" 
F 0 "#PWR0202" H 3100 2300 50  0001 C CNN
F 1 "GND" H 3105 2377 50  0001 C CNN
F 2 "" H 3100 2550 50  0001 C CNN
F 3 "" H 3100 2550 50  0001 C CNN
	1    3100 2550
	1    0    0    -1  
$EndComp
Wire Wire Line
	3100 2500 3100 2550
$Comp
L power:+1V8 #PWR0201
U 1 1 5FF2278A
P 3000 2750
AR Path="/5F622C8F/5FF2278A" Ref="#PWR0201"  Part="1" 
AR Path="/5F6294E6/5FF2278A" Ref="#PWR?"  Part="1" 
F 0 "#PWR0201" H 3000 2600 50  0001 C CNN
F 1 "+1V8" V 3015 2878 50  0000 L CNN
F 2 "" H 3000 2750 50  0001 C CNN
F 3 "" H 3000 2750 50  0001 C CNN
	1    3000 2750
	0    -1   -1   0   
$EndComp
Wire Wire Line
	3950 2450 4550 2450
Wire Wire Line
	3950 2350 4550 2350
Wire Wire Line
	3950 2250 4550 2250
Wire Wire Line
	4550 2750 4500 2750
Wire Wire Line
	3100 2750 3100 2800
$Comp
L power:GND #PWR0203
U 1 1 5FF227AE
P 3100 3150
AR Path="/5F622C8F/5FF227AE" Ref="#PWR0203"  Part="1" 
AR Path="/5F6294E6/5FF227AE" Ref="#PWR?"  Part="1" 
F 0 "#PWR0203" H 3100 2900 50  0001 C CNN
F 1 "GND" H 3105 2977 50  0001 C CNN
F 2 "" H 3100 3150 50  0001 C CNN
F 3 "" H 3100 3150 50  0001 C CNN
	1    3100 3150
	1    0    0    -1  
$EndComp
Wire Wire Line
	3100 3100 3100 3150
Text HLabel 3050 2150 0    50   Input ~ 0
V_I2S_MC
Wire Wire Line
	3000 2750 3100 2750
Connection ~ 3100 2750
Wire Wire Line
	4500 1950 4550 1950
Wire Wire Line
	4550 3350 4150 3350
Wire Wire Line
	4150 3450 4550 3450
Wire Wire Line
	4550 3550 4150 3550
$Comp
L Oscillator:SG-210SCD X201
U 1 1 5FF227BF
P 4200 4050
AR Path="/5F622C8F/5FF227BF" Ref="X201"  Part="1" 
AR Path="/5F6294E6/5FF227BF" Ref="X?"  Part="1" 
F 0 "X201" H 4250 4400 50  0000 L CNN
F 1 "12.288Mhz" H 4250 4300 50  0000 L CNN
F 2 "Oscillators:Oscillator_SMD_SeikoEpson_SG210-4pin_2.5x2.0mm" H 4650 3700 50  0001 C CNN
F 3 "https://support.epson.biz/td/api/doc_check.php?mode=dl&lang=en&Parts=SG-210SED" H 4100 4050 50  0001 C CNN
F 4 "SG-210STF 12.2880ML" H 4200 4050 50  0001 C CNN "MPN"
F 5 "Epson Timing" H 0   0   50  0001 C CNN "Manufacturer"
	1    4200 4050
	1    0    0    -1  
$EndComp
$Comp
L power:+1V8 #PWR0205
U 1 1 5FF227C6
P 4050 4750
AR Path="/5F622C8F/5FF227C6" Ref="#PWR0205"  Part="1" 
AR Path="/5F6294E6/5FF227C6" Ref="#PWR?"  Part="1" 
F 0 "#PWR0205" H 4050 4600 50  0001 C CNN
F 1 "+1V8" V 4065 4878 50  0000 L CNN
F 2 "" H 4050 4750 50  0001 C CNN
F 3 "" H 4050 4750 50  0001 C CNN
	1    4050 4750
	0    -1   -1   0   
$EndComp
Wire Wire Line
	4200 3750 4200 3700
$Comp
L power:GND #PWR0207
U 1 1 5FF227DC
P 4200 4400
AR Path="/5F622C8F/5FF227DC" Ref="#PWR0207"  Part="1" 
AR Path="/5F6294E6/5FF227DC" Ref="#PWR?"  Part="1" 
F 0 "#PWR0207" H 4200 4150 50  0001 C CNN
F 1 "GND" H 4205 4227 50  0001 C CNN
F 2 "" H 4200 4400 50  0001 C CNN
F 3 "" H 4200 4400 50  0001 C CNN
	1    4200 4400
	1    0    0    -1  
$EndComp
Wire Wire Line
	4500 4050 4550 4050
Wire Wire Line
	4050 4750 4100 4750
$Comp
L power:GND #PWR0208
U 1 1 5FF227E5
P 4500 5600
AR Path="/5F622C8F/5FF227E5" Ref="#PWR0208"  Part="1" 
AR Path="/5F6294E6/5FF227E5" Ref="#PWR?"  Part="1" 
F 0 "#PWR0208" H 4500 5350 50  0001 C CNN
F 1 "GND" H 4505 5427 50  0001 C CNN
F 2 "" H 4500 5600 50  0001 C CNN
F 3 "" H 4500 5600 50  0001 C CNN
	1    4500 5600
	1    0    0    -1  
$EndComp
Wire Wire Line
	4500 5600 4500 5550
Wire Wire Line
	4500 5550 4550 5550
Wire Wire Line
	4500 5550 4500 5450
Wire Wire Line
	4500 5450 4550 5450
Connection ~ 4500 5550
Wire Wire Line
	4500 5350 4550 5350
$Comp
L Device:C C?
U 1 1 5FF227F1
P 6300 4750
AR Path="/5FF227F1" Ref="C?"  Part="1" 
AR Path="/55AE8620/5FF227F1" Ref="C?"  Part="1" 
AR Path="/5F622C8F/5FF227F1" Ref="C209"  Part="1" 
AR Path="/5F6294E6/5FF227F1" Ref="C?"  Part="1" 
F 0 "C209" H 6300 4850 40  0000 L CNN
F 1 "1uF" H 6306 4665 40  0000 L CNN
F 2 "Capacitors_SMD:C_0603" H 6338 4600 30  0001 C CNN
F 3 "~" H 6300 4750 60  0000 C CNN
	1    6300 4750
	1    0    0    -1  
$EndComp
Wire Wire Line
	6150 4650 6200 4650
Wire Wire Line
	6200 4650 6200 4550
Wire Wire Line
	6200 4550 6150 4550
Wire Wire Line
	6150 4850 6200 4850
Wire Wire Line
	6200 4850 6200 4950
Wire Wire Line
	6200 4950 6150 4950
Wire Wire Line
	6200 4550 6300 4550
Wire Wire Line
	6300 4550 6300 4600
Connection ~ 6200 4550
$Comp
L power:GND #PWR0209
U 1 1 5FF22801
P 6200 5000
AR Path="/5F622C8F/5FF22801" Ref="#PWR0209"  Part="1" 
AR Path="/5F6294E6/5FF22801" Ref="#PWR?"  Part="1" 
F 0 "#PWR0209" H 6200 4750 50  0001 C CNN
F 1 "GND" H 6205 4827 50  0001 C CNN
F 2 "" H 6200 5000 50  0001 C CNN
F 3 "" H 6200 5000 50  0001 C CNN
	1    6200 5000
	1    0    0    -1  
$EndComp
Wire Wire Line
	6200 5000 6200 4950
Connection ~ 6200 4950
$Comp
L Device:C C?
U 1 1 5FF22809
P 6500 4750
AR Path="/5FF22809" Ref="C?"  Part="1" 
AR Path="/55AE8620/5FF22809" Ref="C?"  Part="1" 
AR Path="/5F622C8F/5FF22809" Ref="C212"  Part="1" 
AR Path="/5F6294E6/5FF22809" Ref="C?"  Part="1" 
F 0 "C212" H 6500 4850 40  0000 L CNN
F 1 "1uF" H 6506 4665 40  0000 L CNN
F 2 "Capacitors_SMD:C_0603" H 6538 4600 30  0001 C CNN
F 3 "~" H 6500 4750 60  0000 C CNN
	1    6500 4750
	1    0    0    -1  
$EndComp
Wire Wire Line
	6300 4550 6500 4550
Wire Wire Line
	6500 4550 6500 4600
Connection ~ 6300 4550
Wire Wire Line
	6300 4900 6300 4950
Wire Wire Line
	6500 4900 6500 4950
$Comp
L Device:CP C218
U 1 1 5FF22815
P 6900 4750
AR Path="/5F622C8F/5FF22815" Ref="C218"  Part="1" 
AR Path="/5F6294E6/5FF22815" Ref="C?"  Part="1" 
F 0 "C218" H 6950 4850 50  0000 L CNN
F 1 "470µF" H 6950 4650 50  0000 L CNN
F 2 "Capacitors_ThroughHole:CP_Radial_D6.3mm_P2.50mm" H 6938 4600 50  0001 C CNN
F 3 "~" H 6900 4750 50  0001 C CNN
	1    6900 4750
	1    0    0    -1  
$EndComp
Wire Wire Line
	6500 4550 6700 4550
Wire Wire Line
	6900 4550 6900 4600
Connection ~ 6500 4550
Wire Wire Line
	6900 4900 6900 4950
Text HLabel 6950 4550 2    50   Input ~ 0
VSP
Wire Wire Line
	6950 4550 6900 4550
Connection ~ 6900 4550
$Comp
L power:+1V8 #PWR0204
U 1 1 5FF22823
P 3550 3700
AR Path="/5F622C8F/5FF22823" Ref="#PWR0204"  Part="1" 
AR Path="/5F6294E6/5FF22823" Ref="#PWR?"  Part="1" 
F 0 "#PWR0204" H 3550 3550 50  0001 C CNN
F 1 "+1V8" V 3565 3828 50  0000 L CNN
F 2 "" H 3550 3700 50  0001 C CNN
F 3 "" H 3550 3700 50  0001 C CNN
	1    3550 3700
	0    -1   -1   0   
$EndComp
$Comp
L Device:C C?
U 1 1 5FF22829
P 4500 4450
AR Path="/5FF22829" Ref="C?"  Part="1" 
AR Path="/55AE8620/5FF22829" Ref="C?"  Part="1" 
AR Path="/5F622C8F/5FF22829" Ref="C205"  Part="1" 
AR Path="/5F6294E6/5FF22829" Ref="C?"  Part="1" 
F 0 "C205" H 4500 4550 40  0000 L CNN
F 1 "1uF" H 4506 4365 40  0000 L CNN
F 2 "Capacitors_SMD:C_0603" H 4538 4300 30  0001 C CNN
F 3 "~" H 4500 4450 60  0000 C CNN
	1    4500 4450
	1    0    0    -1  
$EndComp
Wire Wire Line
	4550 4250 4500 4250
Wire Wire Line
	4500 4250 4500 4300
Wire Wire Line
	4500 4600 4500 4650
Wire Wire Line
	4500 4650 4550 4650
$Comp
L Device:C C?
U 1 1 5FF22834
P 4500 5150
AR Path="/5FF22834" Ref="C?"  Part="1" 
AR Path="/55AE8620/5FF22834" Ref="C?"  Part="1" 
AR Path="/5F622C8F/5FF22834" Ref="C206"  Part="1" 
AR Path="/5F6294E6/5FF22834" Ref="C?"  Part="1" 
F 0 "C206" H 4500 5250 40  0000 L CNN
F 1 "1uF" H 4506 5065 40  0000 L CNN
F 2 "Capacitors_SMD:C_0603" H 4538 5000 30  0001 C CNN
F 3 "~" H 4500 5150 60  0000 C CNN
	1    4500 5150
	1    0    0    -1  
$EndComp
$Comp
L Device:C C?
U 1 1 5FF2283B
P 4300 5150
AR Path="/5FF2283B" Ref="C?"  Part="1" 
AR Path="/55AE8620/5FF2283B" Ref="C?"  Part="1" 
AR Path="/5F622C8F/5FF2283B" Ref="C204"  Part="1" 
AR Path="/5F6294E6/5FF2283B" Ref="C?"  Part="1" 
F 0 "C204" H 4300 5250 40  0000 L CNN
F 1 "1uF" H 4306 5065 40  0000 L CNN
F 2 "Capacitors_SMD:C_0603" H 4338 5000 30  0001 C CNN
F 3 "~" H 4300 5150 60  0000 C CNN
	1    4300 5150
	1    0    0    -1  
$EndComp
Wire Wire Line
	4550 4950 4500 4950
Wire Wire Line
	4500 4950 4500 5000
Wire Wire Line
	4550 4850 4300 4850
Wire Wire Line
	4300 4850 4300 5000
Wire Wire Line
	4500 5350 4500 5300
Wire Wire Line
	4500 5350 4300 5350
Wire Wire Line
	4300 5350 4300 5300
Connection ~ 4500 5350
$Comp
L Device:C C?
U 1 1 5FF2284A
P 4100 5150
AR Path="/5FF2284A" Ref="C?"  Part="1" 
AR Path="/55AE8620/5FF2284A" Ref="C?"  Part="1" 
AR Path="/5F622C8F/5FF2284A" Ref="C203"  Part="1" 
AR Path="/5F6294E6/5FF2284A" Ref="C?"  Part="1" 
F 0 "C203" H 4100 5250 40  0000 L CNN
F 1 "10uF" H 4106 5065 40  0000 L CNN
F 2 "Capacitors_SMD:C_0805" H 4138 5000 30  0001 C CNN
F 3 "~" H 4100 5150 60  0000 C CNN
	1    4100 5150
	1    0    0    -1  
$EndComp
Wire Wire Line
	4100 4750 4100 5000
Connection ~ 4100 4750
Wire Wire Line
	4100 4750 4550 4750
Wire Wire Line
	4100 5300 4100 5350
Wire Wire Line
	4100 5350 4300 5350
Connection ~ 4300 5350
$Comp
L power:GND #PWR0206
U 1 1 5FF22857
P 4100 5400
AR Path="/5F622C8F/5FF22857" Ref="#PWR0206"  Part="1" 
AR Path="/5F6294E6/5FF22857" Ref="#PWR?"  Part="1" 
F 0 "#PWR0206" H 4100 5150 50  0001 C CNN
F 1 "GND" H 4105 5227 50  0001 C CNN
F 2 "" H 4100 5400 50  0001 C CNN
F 3 "" H 4100 5400 50  0001 C CNN
	1    4100 5400
	1    0    0    -1  
$EndComp
Wire Wire Line
	4100 5400 4100 5350
Connection ~ 4100 5350
$Comp
L Device:R R?
U 1 1 5FF2285F
P 6500 3050
AR Path="/5F6294E6/5FF2285F" Ref="R?"  Part="1" 
AR Path="/5F622C8F/5FF2285F" Ref="R202"  Part="1" 
F 0 "R202" V 6600 3050 40  0000 C CNN
F 1 "2.2k" V 6500 3050 40  0000 C CNN
F 2 "Resistors_SMD:R_0603" V 6430 3050 30  0001 C CNN
F 3 "~" H 6500 3050 30  0000 C CNN
	1    6500 3050
	0    1    1    0   
$EndComp
$Comp
L Device:C C214
U 1 1 5FF22868
P 6700 3350
AR Path="/5F622C8F/5FF22868" Ref="C214"  Part="1" 
AR Path="/5F6294E6/5FF22868" Ref="C?"  Part="1" 
F 0 "C214" V 6550 3350 50  0000 C CNN
F 1 "1uF" V 6750 3400 50  0000 L CNN
F 2 "Capacitors_SMD:C_1210" H 6738 3200 50  0001 C CNN
F 3 "~" H 6700 3350 50  0001 C CNN
F 4 "ECP-U1C105MA5" H 6700 3350 50  0001 C CNN "MPN"
F 5 "film capacitor" H 6700 3350 50  0001 C CNN "Comment"
	1    6700 3350
	0    1    1    0   
$EndComp
$Comp
L Device:C C?
U 1 1 5FF2286F
P 6300 3550
AR Path="/5FF2286F" Ref="C?"  Part="1" 
AR Path="/55AE8620/5FF2286F" Ref="C?"  Part="1" 
AR Path="/5F622C8F/5FF2286F" Ref="C208"  Part="1" 
AR Path="/5F6294E6/5FF2286F" Ref="C?"  Part="1" 
F 0 "C208" H 6300 3650 40  0000 L CNN
F 1 "1uF" H 6306 3465 40  0000 L CNN
F 2 "Capacitors_SMD:C_0603" H 6338 3400 30  0001 C CNN
F 3 "~" H 6300 3550 60  0000 C CNN
	1    6300 3550
	1    0    0    -1  
$EndComp
$Comp
L power:GND #PWR0211
U 1 1 5FF22876
P 6300 3750
AR Path="/5F622C8F/5FF22876" Ref="#PWR0211"  Part="1" 
AR Path="/5F6294E6/5FF22876" Ref="#PWR?"  Part="1" 
F 0 "#PWR0211" H 6300 3500 50  0001 C CNN
F 1 "GND" H 6305 3577 50  0001 C CNN
F 2 "" H 6300 3750 50  0001 C CNN
F 3 "" H 6300 3750 50  0001 C CNN
	1    6300 3750
	1    0    0    -1  
$EndComp
Wire Wire Line
	6300 3700 6300 3750
$Comp
L Device:C C?
U 1 1 5FF2287D
P 6300 5450
AR Path="/5FF2287D" Ref="C?"  Part="1" 
AR Path="/55AE8620/5FF2287D" Ref="C?"  Part="1" 
AR Path="/5F622C8F/5FF2287D" Ref="C210"  Part="1" 
AR Path="/5F6294E6/5FF2287D" Ref="C?"  Part="1" 
F 0 "C210" H 6300 5550 40  0000 L CNN
F 1 "2.2uF" H 6306 5365 40  0000 L CNN
F 2 "Capacitors_SMD:C_0603" H 6338 5300 30  0001 C CNN
F 3 "~" H 6300 5450 60  0000 C CNN
	1    6300 5450
	1    0    0    -1  
$EndComp
$Comp
L Device:C C?
U 1 1 5FF2288B
P 6500 5450
AR Path="/5FF2288B" Ref="C?"  Part="1" 
AR Path="/55AE8620/5FF2288B" Ref="C?"  Part="1" 
AR Path="/5F622C8F/5FF2288B" Ref="C213"  Part="1" 
AR Path="/5F6294E6/5FF2288B" Ref="C?"  Part="1" 
F 0 "C213" H 6500 5550 40  0000 L CNN
F 1 "1uF" H 6506 5365 40  0000 L CNN
F 2 "Capacitors_SMD:C_0603" H 6538 5300 30  0001 C CNN
F 3 "~" H 6500 5450 60  0000 C CNN
	1    6500 5450
	1    0    0    -1  
$EndComp
Wire Wire Line
	6150 5250 6300 5250
Wire Wire Line
	6300 5250 6300 5300
Wire Wire Line
	6150 5150 6500 5150
Wire Wire Line
	6500 5150 6500 5300
$Comp
L power:GND #PWR0212
U 1 1 5FF22899
P 6300 5700
AR Path="/5F622C8F/5FF22899" Ref="#PWR0212"  Part="1" 
AR Path="/5F6294E6/5FF22899" Ref="#PWR?"  Part="1" 
F 0 "#PWR0212" H 6300 5450 50  0001 C CNN
F 1 "GND" H 6305 5527 50  0001 C CNN
F 2 "" H 6300 5700 50  0001 C CNN
F 3 "" H 6300 5700 50  0001 C CNN
	1    6300 5700
	1    0    0    -1  
$EndComp
Wire Wire Line
	6150 5550 6200 5550
Wire Wire Line
	6200 5550 6200 5650
Wire Wire Line
	6300 5600 6300 5650
Wire Wire Line
	6500 5600 6500 5650
Wire Wire Line
	6200 5650 6300 5650
Connection ~ 6300 5650
Wire Wire Line
	6200 4950 6300 4950
Wire Wire Line
	6300 4950 6500 4950
Connection ~ 6300 4950
Wire Wire Line
	6500 4950 6700 4950
Connection ~ 6500 4950
NoConn ~ 6150 3450
NoConn ~ 6150 3550
NoConn ~ 6150 3650
$Comp
L power:GND #PWR0215
U 1 1 5FF228BA
P 7050 3100
AR Path="/5F622C8F/5FF228BA" Ref="#PWR0215"  Part="1" 
AR Path="/5F6294E6/5FF228BA" Ref="#PWR?"  Part="1" 
F 0 "#PWR0215" H 7050 2850 50  0001 C CNN
F 1 "GND" H 7055 2927 50  0001 C CNN
F 2 "" H 7050 3100 50  0001 C CNN
F 3 "" H 7050 3100 50  0001 C CNN
	1    7050 3100
	1    0    0    -1  
$EndComp
Wire Wire Line
	6300 3050 6300 3400
Connection ~ 6300 3050
Wire Wire Line
	6300 3050 6350 3050
$Comp
L power:+1V8 #PWR0213
U 1 1 5FF228C5
P 6400 1950
AR Path="/5F622C8F/5FF228C5" Ref="#PWR0213"  Part="1" 
AR Path="/5F6294E6/5FF228C5" Ref="#PWR?"  Part="1" 
F 0 "#PWR0213" H 6400 1800 50  0001 C CNN
F 1 "+1V8" V 6415 2078 50  0000 L CNN
F 2 "" H 6400 1950 50  0001 C CNN
F 3 "" H 6400 1950 50  0001 C CNN
	1    6400 1950
	0    1    1    0   
$EndComp
$Comp
L ProjectSymbols:MAX98089 U201
U 1 1 5FF228CB
P 5350 3850
AR Path="/5F622C8F/5FF228CB" Ref="U201"  Part="1" 
AR Path="/5F6294E6/5FF228CB" Ref="U?"  Part="1" 
F 0 "U201" H 5350 5900 60  0000 C CNN
F 1 "MAX98089" H 5350 5800 60  0000 C CNN
F 2 "Housings_DFN_QFN:QFN-56-1EP_7x7mm_Pitch0.4mm" H 5350 3850 60  0001 C CNN
F 3 "" H 5350 3850 60  0000 C CNN
F 4 "MAX98089ETN+" H 0   0   50  0001 C CNN "MPN"
F 5 "Maxim" H 0   0   50  0001 C CNN "Manufacturer"
	1    5350 3850
	1    0    0    -1  
$EndComp
$Comp
L power:GND #PWR0210
U 1 1 5FF228D2
P 6300 2350
AR Path="/5F622C8F/5FF228D2" Ref="#PWR0210"  Part="1" 
AR Path="/5F6294E6/5FF228D2" Ref="#PWR?"  Part="1" 
F 0 "#PWR0210" H 6300 2100 50  0001 C CNN
F 1 "GND" H 6305 2177 50  0001 C CNN
F 2 "" H 6300 2350 50  0001 C CNN
F 3 "" H 6300 2350 50  0001 C CNN
	1    6300 2350
	1    0    0    -1  
$EndComp
Wire Wire Line
	6300 2300 6300 2350
Wire Wire Line
	6150 1950 6300 1950
Wire Wire Line
	6300 1950 6300 2000
Wire Wire Line
	6400 1950 6300 1950
Connection ~ 6300 1950
NoConn ~ 6150 2250
NoConn ~ 6150 2350
NoConn ~ 6150 2450
NoConn ~ 6150 2150
NoConn ~ 6150 3850
NoConn ~ 6150 3950
$Comp
L Device:Ferrite_Bead_Small FB203
U 1 1 5FF228E4
P 6900 3200
F 0 "FB203" H 6800 3250 50  0000 R CNN
F 1 "1kOhm@100Mhz" H 6550 3400 50  0000 C CNN
F 2 "Resistors_SMD:R_0402" V 6830 3200 50  0001 C CNN
F 3 "~" H 6900 3200 50  0001 C CNN
F 4 "BLM15HG102SN1D" H 6900 3200 50  0001 C CNN "MPN"
F 5 "Murata" H 0   0   50  0001 C CNN "Manufacturer"
	1    6900 3200
	-1   0    0    1   
$EndComp
Wire Wire Line
	6900 3050 6900 3100
Connection ~ 6900 3050
Wire Wire Line
	6900 3050 7500 3050
$Comp
L Device:C C?
U 1 1 5FF228F0
P 6500 3550
AR Path="/5FF228F0" Ref="C?"  Part="1" 
AR Path="/559EC5B3/5FF228F0" Ref="C?"  Part="1" 
AR Path="/5F6294E6/5FF228F0" Ref="C?"  Part="1" 
AR Path="/5F622C8F/5FF228F0" Ref="C211"  Part="1" 
F 0 "C211" H 6500 3650 40  0000 L CNN
F 1 "10pF" H 6506 3465 40  0000 L CNN
F 2 "Capacitors_SMD:C_0402_NoSilk" H 6538 3400 30  0001 C CNN
F 3 "~" H 6500 3550 60  0000 C CNN
	1    6500 3550
	1    0    0    -1  
$EndComp
Wire Wire Line
	6500 3400 6500 3350
Connection ~ 6500 3350
Wire Wire Line
	6500 3350 6550 3350
Wire Wire Line
	6150 3050 6300 3050
Wire Wire Line
	6150 3350 6500 3350
Wire Wire Line
	6150 2950 6900 2950
Wire Wire Line
	6900 2950 6900 3050
Wire Wire Line
	6650 3050 6900 3050
$Comp
L Device:Ferrite_Bead_Small FB202
U 1 1 5FF2290A
P 6900 2750
F 0 "FB202" V 6950 2650 50  0000 R CNN
F 1 "1kOhm@100Mhz" H 6550 2950 50  0000 C CNN
F 2 "Resistors_SMD:R_0402" V 6830 2750 50  0001 C CNN
F 3 "~" H 6900 2750 50  0001 C CNN
F 4 "BLM15HG102SN1D" H 6900 2750 50  0001 C CNN "MPN"
F 5 "Murata" H 0   0   50  0001 C CNN "Manufacturer"
	1    6900 2750
	0    -1   -1   0   
$EndComp
$Comp
L Device:Ferrite_Bead_Small FB201
U 1 1 5FF22912
P 6750 2850
F 0 "FB201" V 6800 2600 50  0000 R CNN
F 1 "1kOhm@100Mhz" H 6400 3050 50  0000 C CNN
F 2 "Resistors_SMD:R_0402" V 6680 2850 50  0001 C CNN
F 3 "~" H 6750 2850 50  0001 C CNN
F 4 "BLM15HG102SN1D" H 6750 2850 50  0001 C CNN "MPN"
F 5 "Murata" H 0   0   50  0001 C CNN "Manufacturer"
	1    6750 2850
	0    -1   -1   0   
$EndComp
Wire Wire Line
	7500 2750 7000 2750
Wire Wire Line
	7500 2850 6850 2850
Wire Wire Line
	6800 2750 6700 2750
Wire Wire Line
	6150 2850 6600 2850
$Comp
L Device:C C?
U 1 1 5FF2291D
P 6900 2500
AR Path="/5FF2291D" Ref="C?"  Part="1" 
AR Path="/559EC5B3/5FF2291D" Ref="C?"  Part="1" 
AR Path="/5F6294E6/5FF2291D" Ref="C?"  Part="1" 
AR Path="/5F622C8F/5FF2291D" Ref="C217"  Part="1" 
F 0 "C217" V 6850 2450 40  0000 R CNN
F 1 "10pF" V 6850 2550 40  0000 L CNN
F 2 "Capacitors_SMD:C_0402_NoSilk" H 6938 2350 30  0001 C CNN
F 3 "~" H 6900 2500 60  0000 C CNN
	1    6900 2500
	0    1    1    0   
$EndComp
$Comp
L Device:C C?
U 1 1 5FF22924
P 6900 2300
AR Path="/5FF22924" Ref="C?"  Part="1" 
AR Path="/559EC5B3/5FF22924" Ref="C?"  Part="1" 
AR Path="/5F6294E6/5FF22924" Ref="C?"  Part="1" 
AR Path="/5F622C8F/5FF22924" Ref="C216"  Part="1" 
F 0 "C216" V 6850 2250 40  0000 R CNN
F 1 "10pF" V 6850 2350 40  0000 L CNN
F 2 "Capacitors_SMD:C_0402_NoSilk" H 6938 2150 30  0001 C CNN
F 3 "~" H 6900 2300 60  0000 C CNN
	1    6900 2300
	0    1    1    0   
$EndComp
Wire Wire Line
	6600 2850 6600 2300
Wire Wire Line
	6600 2300 6750 2300
Connection ~ 6600 2850
Wire Wire Line
	6600 2850 6650 2850
Wire Wire Line
	6700 2750 6700 2500
Wire Wire Line
	6700 2500 6750 2500
Connection ~ 6700 2750
Wire Wire Line
	6700 2750 6150 2750
Wire Wire Line
	7050 2300 7100 2300
Wire Wire Line
	7100 2300 7100 2500
Wire Wire Line
	7050 2500 7100 2500
Wire Wire Line
	3050 2150 3100 2150
Wire Wire Line
	3100 2150 3100 2200
Wire Wire Line
	7600 3350 7650 3350
Wire Wire Line
	7650 3350 7650 3400
$Comp
L power:GND #PWR0217
U 1 1 5FF60649
P 7250 3900
AR Path="/5F622C8F/5FF60649" Ref="#PWR0217"  Part="1" 
AR Path="/5F6294E6/5FF60649" Ref="#PWR?"  Part="1" 
F 0 "#PWR0217" H 7250 3650 50  0001 C CNN
F 1 "GND" H 7255 3727 50  0001 C CNN
F 2 "" H 7250 3900 50  0001 C CNN
F 3 "" H 7250 3900 50  0001 C CNN
	1    7250 3900
	1    0    0    -1  
$EndComp
Wire Wire Line
	7150 4450 7150 5250
Connection ~ 7650 3350
Text Label 7300 2750 0    50   ~ 0
HPL
Text Label 7300 2850 0    50   ~ 0
HPR
Text Label 6900 3050 0    50   ~ 0
MIC
$Comp
L ProjectSymbols:AudioJack J201
U 1 1 603C2A39
P 7700 2950
AR Path="/5F622C8F/603C2A39" Ref="J201"  Part="1" 
AR Path="/603C2A39" Ref="J?"  Part="1" 
F 0 "J201" H 7370 2833 50  0000 R CNN
F 1 "AudioJack" H 7370 2924 50  0000 R CNN
F 2 "ProjectFootprints:CUI_SJ-4351x" H 7700 2950 50  0001 C CNN
F 3 "~" H 7700 2950 50  0001 C CNN
	1    7700 2950
	-1   0    0    1   
$EndComp
Wire Wire Line
	6300 5650 6500 5650
Text Notes 2900 4500 0    50   ~ 0
Decoupling capacitor \nomitted since \nRegulator capacitor\nis nearby
Wire Notes Line
	2850 4150 3700 4150
Wire Notes Line
	3700 4150 3700 4550
Wire Notes Line
	3700 4550 2850 4550
Wire Notes Line
	2850 4550 2850 4150
Wire Wire Line
	3950 2850 4550 2850
Wire Wire Line
	3950 2950 4550 2950
Wire Wire Line
	3950 3050 4550 3050
Wire Wire Line
	6900 3300 6900 3350
Wire Wire Line
	6900 3350 6850 3350
$Comp
L Device:C C?
U 1 1 5F7F5D65
P 7650 3550
AR Path="/5F7F5D65" Ref="C?"  Part="1" 
AR Path="/55AE8620/5F7F5D65" Ref="C?"  Part="1" 
AR Path="/5F622C8F/5F7F5D65" Ref="C219"  Part="1" 
AR Path="/5F6294E6/5F7F5D65" Ref="C?"  Part="1" 
F 0 "C219" H 7650 3650 40  0000 L CNN
F 1 "1uF" H 7656 3465 40  0000 L CNN
F 2 "Capacitors_SMD:C_0603" H 7688 3400 30  0001 C CNN
F 3 "~" H 7650 3550 60  0000 C CNN
	1    7650 3550
	1    0    0    -1  
$EndComp
$Comp
L Device:L_Core_Ferrite_Small L201
U 1 1 5F7FB10C
P 7500 3350
F 0 "L201" V 7600 3350 50  0000 C CNN
F 1 "4.7uH" V 7450 3350 50  0000 C CNN
F 2 "ProjectFootprints:L_Murata_LQH3N" H 7500 3350 50  0001 C CNN
F 3 "~" H 7500 3350 50  0001 C CNN
F 4 "LQH3NPH4R7MME" H 7500 3350 50  0001 C CNN "MPN"
F 5 "Murata" H 0   0   50  0001 C CNN "Manufacturer"
	1    7500 3350
	0    -1   -1   0   
$EndComp
$Comp
L Device:R R?
U 1 1 5F8006F2
P 7450 3750
AR Path="/5F6294E6/5F8006F2" Ref="R?"  Part="1" 
AR Path="/5F622C8F/5F8006F2" Ref="R203"  Part="1" 
F 0 "R203" V 7550 3750 40  0000 C CNN
F 1 "2.2" V 7450 3750 40  0000 C CNN
F 2 "Resistors_SMD:R_0603" V 7380 3750 30  0001 C CNN
F 3 "~" H 7450 3750 30  0000 C CNN
	1    7450 3750
	0    -1   -1   0   
$EndComp
$Comp
L Device:R R?
U 1 1 5F805DFE
P 7450 3850
AR Path="/5F6294E6/5F805DFE" Ref="R?"  Part="1" 
AR Path="/5F622C8F/5F805DFE" Ref="R204"  Part="1" 
F 0 "R204" V 7350 3850 40  0000 C CNN
F 1 "2.2" V 7450 3850 40  0000 C CNN
F 2 "Resistors_SMD:R_0603" V 7380 3850 30  0001 C CNN
F 3 "~" H 7450 3850 30  0000 C CNN
	1    7450 3850
	0    -1   -1   0   
$EndComp
$Comp
L Device:C C?
U 1 1 5F805E87
P 7650 4050
AR Path="/5F805E87" Ref="C?"  Part="1" 
AR Path="/55AE8620/5F805E87" Ref="C?"  Part="1" 
AR Path="/5F622C8F/5F805E87" Ref="C220"  Part="1" 
AR Path="/5F6294E6/5F805E87" Ref="C?"  Part="1" 
F 0 "C220" H 7650 4150 40  0000 L CNN
F 1 "1uF" H 7656 3965 40  0000 L CNN
F 2 "Capacitors_SMD:C_0603" H 7688 3900 30  0001 C CNN
F 3 "~" H 7650 4050 60  0000 C CNN
	1    7650 4050
	1    0    0    -1  
$EndComp
$Comp
L Device:C C?
U 1 1 5F80B27D
P 7850 3800
AR Path="/5F80B27D" Ref="C?"  Part="1" 
AR Path="/55AE8620/5F80B27D" Ref="C?"  Part="1" 
AR Path="/5F622C8F/5F80B27D" Ref="C223"  Part="1" 
AR Path="/5F6294E6/5F80B27D" Ref="C?"  Part="1" 
F 0 "C223" H 7850 3900 40  0000 L CNN
F 1 "1uF" H 7856 3715 40  0000 L CNN
F 2 "Capacitors_SMD:C_0603" H 7888 3650 30  0001 C CNN
F 3 "~" H 7850 3800 60  0000 C CNN
	1    7850 3800
	1    0    0    -1  
$EndComp
Wire Wire Line
	7650 3700 7650 3750
Wire Wire Line
	7650 3750 7600 3750
Wire Wire Line
	7600 3850 7650 3850
Wire Wire Line
	7650 3850 7650 3900
Wire Wire Line
	7850 3350 7850 3650
Wire Wire Line
	7650 3350 7850 3350
Wire Wire Line
	7850 3950 7850 4250
Wire Wire Line
	7850 4250 7650 4250
Wire Wire Line
	7650 4200 7650 4250
Connection ~ 7650 4250
Wire Wire Line
	7650 4250 7600 4250
Wire Wire Line
	7300 3750 7250 3750
Wire Wire Line
	7250 3750 7250 3850
Wire Wire Line
	7300 3850 7250 3850
Connection ~ 7250 3850
Wire Wire Line
	7250 3850 7250 3900
Wire Wire Line
	7150 3350 7400 3350
Wire Wire Line
	7150 3350 7150 4150
Wire Wire Line
	7600 4350 7650 4350
Wire Wire Line
	7650 4350 7650 4400
$Comp
L power:GND #PWR0218
U 1 1 5F85421D
P 7250 4900
AR Path="/5F622C8F/5F85421D" Ref="#PWR0218"  Part="1" 
AR Path="/5F6294E6/5F85421D" Ref="#PWR?"  Part="1" 
F 0 "#PWR0218" H 7250 4650 50  0001 C CNN
F 1 "GND" H 7255 4727 50  0001 C CNN
F 2 "" H 7250 4900 50  0001 C CNN
F 3 "" H 7250 4900 50  0001 C CNN
	1    7250 4900
	1    0    0    -1  
$EndComp
Connection ~ 7650 4350
$Comp
L Device:C C?
U 1 1 5F854225
P 7650 4550
AR Path="/5F854225" Ref="C?"  Part="1" 
AR Path="/55AE8620/5F854225" Ref="C?"  Part="1" 
AR Path="/5F622C8F/5F854225" Ref="C221"  Part="1" 
AR Path="/5F6294E6/5F854225" Ref="C?"  Part="1" 
F 0 "C221" H 7650 4650 40  0000 L CNN
F 1 "1uF" H 7656 4465 40  0000 L CNN
F 2 "Capacitors_SMD:C_0603" H 7688 4400 30  0001 C CNN
F 3 "~" H 7650 4550 60  0000 C CNN
	1    7650 4550
	1    0    0    -1  
$EndComp
$Comp
L Device:R R?
U 1 1 5F854234
P 7450 4750
AR Path="/5F6294E6/5F854234" Ref="R?"  Part="1" 
AR Path="/5F622C8F/5F854234" Ref="R205"  Part="1" 
F 0 "R205" V 7550 4750 40  0000 C CNN
F 1 "2.2" V 7450 4750 40  0000 C CNN
F 2 "Resistors_SMD:R_0603" V 7380 4750 30  0001 C CNN
F 3 "~" H 7450 4750 30  0000 C CNN
	1    7450 4750
	0    -1   -1   0   
$EndComp
$Comp
L Device:R R?
U 1 1 5F85423B
P 7450 4850
AR Path="/5F6294E6/5F85423B" Ref="R?"  Part="1" 
AR Path="/5F622C8F/5F85423B" Ref="R206"  Part="1" 
F 0 "R206" V 7350 4850 40  0000 C CNN
F 1 "2.2" V 7450 4850 40  0000 C CNN
F 2 "Resistors_SMD:R_0603" V 7380 4850 30  0001 C CNN
F 3 "~" H 7450 4850 30  0000 C CNN
	1    7450 4850
	0    -1   -1   0   
$EndComp
$Comp
L Device:C C?
U 1 1 5F854242
P 7650 5050
AR Path="/5F854242" Ref="C?"  Part="1" 
AR Path="/55AE8620/5F854242" Ref="C?"  Part="1" 
AR Path="/5F622C8F/5F854242" Ref="C222"  Part="1" 
AR Path="/5F6294E6/5F854242" Ref="C?"  Part="1" 
F 0 "C222" H 7650 5150 40  0000 L CNN
F 1 "1uF" H 7656 4965 40  0000 L CNN
F 2 "Capacitors_SMD:C_0603" H 7688 4900 30  0001 C CNN
F 3 "~" H 7650 5050 60  0000 C CNN
	1    7650 5050
	1    0    0    -1  
$EndComp
$Comp
L Device:C C?
U 1 1 5F854251
P 7850 4800
AR Path="/5F854251" Ref="C?"  Part="1" 
AR Path="/55AE8620/5F854251" Ref="C?"  Part="1" 
AR Path="/5F622C8F/5F854251" Ref="C224"  Part="1" 
AR Path="/5F6294E6/5F854251" Ref="C?"  Part="1" 
F 0 "C224" H 7850 4900 40  0000 L CNN
F 1 "1uF" H 7856 4715 40  0000 L CNN
F 2 "Capacitors_SMD:C_0603" H 7888 4650 30  0001 C CNN
F 3 "~" H 7850 4800 60  0000 C CNN
	1    7850 4800
	1    0    0    -1  
$EndComp
Wire Wire Line
	7650 4700 7650 4750
Wire Wire Line
	7650 4750 7600 4750
Wire Wire Line
	7600 4850 7650 4850
Wire Wire Line
	7650 4850 7650 4900
Wire Wire Line
	7850 4350 7850 4650
Wire Wire Line
	7650 4350 7850 4350
Wire Wire Line
	7850 4950 7850 5250
Wire Wire Line
	7850 5250 7650 5250
Wire Wire Line
	7650 5200 7650 5250
Connection ~ 7650 5250
Wire Wire Line
	7650 5250 7600 5250
Wire Wire Line
	7300 4750 7250 4750
Wire Wire Line
	7250 4750 7250 4850
Wire Wire Line
	7300 4850 7250 4850
Connection ~ 7250 4850
Wire Wire Line
	7250 4850 7250 4900
Wire Wire Line
	7150 5250 7400 5250
$Comp
L Connector:Screw_Terminal_01x04 J202
U 1 1 5F8718FA
P 8350 4250
F 0 "J202" H 8350 4450 50  0000 C CNN
F 1 "Speaker" H 8350 3950 50  0000 C CNN
F 2 "ProjectFootprints:PhoenixContact_PT_1.5-4-3.5-H" H 8350 4250 50  0001 C CNN
F 3 "~" H 8350 4250 50  0001 C CNN
	1    8350 4250
	1    0    0    -1  
$EndComp
Connection ~ 7850 3350
Wire Wire Line
	8050 5250 7850 5250
Connection ~ 7850 5250
$Comp
L Device:L_Core_Ferrite_Small L202
U 1 1 5F890CAD
P 7500 4250
F 0 "L202" V 7600 4250 50  0000 C CNN
F 1 "4.7uH" V 7450 4250 50  0001 C CNN
F 2 "ProjectFootprints:L_Murata_LQH3N" H 7500 4250 50  0001 C CNN
F 3 "~" H 7500 4250 50  0001 C CNN
F 4 "LQH3NPH4R7MME" H 7500 4250 50  0001 C CNN "MPN"
F 5 "Murata" H 0   0   50  0001 C CNN "Manufacturer"
	1    7500 4250
	0    -1   -1   0   
$EndComp
$Comp
L Device:L_Core_Ferrite_Small L203
U 1 1 5F890D25
P 7500 4350
F 0 "L203" V 7450 4350 50  0000 C CNN
F 1 "4.7uH" V 7550 4550 50  0000 C CNN
F 2 "ProjectFootprints:L_Murata_LQH3N" H 7500 4350 50  0001 C CNN
F 3 "~" H 7500 4350 50  0001 C CNN
F 4 "LQH3NPH4R7MME" H 7500 4350 50  0001 C CNN "MPN"
F 5 "Murata" H 0   0   50  0001 C CNN "Manufacturer"
	1    7500 4350
	0    -1   -1   0   
$EndComp
$Comp
L Device:L_Core_Ferrite_Small L204
U 1 1 5F890D83
P 7500 5250
F 0 "L204" V 7600 5250 50  0000 C CNN
F 1 "4.7uH" V 7450 5250 50  0000 C CNN
F 2 "ProjectFootprints:L_Murata_LQH3N" H 7500 5250 50  0001 C CNN
F 3 "~" H 7500 5250 50  0001 C CNN
F 4 "LQH3NPH4R7MME" H 7500 5250 50  0001 C CNN "MPN"
F 5 "Murata" H 0   0   50  0001 C CNN "Manufacturer"
	1    7500 5250
	0    -1   -1   0   
$EndComp
NoConn ~ 4550 3150
$Comp
L Device:R R?
U 1 1 5F8AB68C
P 4250 2550
AR Path="/5F6294E6/5F8AB68C" Ref="R?"  Part="1" 
AR Path="/5F622C8F/5F8AB68C" Ref="R201"  Part="1" 
F 0 "R201" V 4100 2550 40  0000 C CNN
F 1 "22" V 4250 2550 40  0000 C CNN
F 2 "Resistors_SMD:R_0402_NoSilk" V 4180 2550 30  0001 C CNN
F 3 "~" H 4250 2550 30  0000 C CNN
	1    4250 2550
	0    1    1    0   
$EndComp
Wire Wire Line
	4100 2550 3950 2550
Wire Wire Line
	4400 2550 4550 2550
Wire Wire Line
	3100 2150 4550 2150
Connection ~ 3100 2150
Wire Wire Line
	4500 1950 4500 2750
Connection ~ 4500 2750
Wire Wire Line
	4500 2750 3100 2750
Wire Wire Line
	8050 4450 8050 5250
Wire Wire Line
	8050 3350 7850 3350
Wire Wire Line
	8050 3350 8050 4150
Wire Wire Line
	8050 4150 8150 4350
Wire Wire Line
	7850 4250 8150 4450
Connection ~ 7850 4250
Wire Wire Line
	8150 4150 8050 4450
Wire Wire Line
	8150 4250 7850 4350
Connection ~ 7850 4350
$Comp
L power:GND #PWR0216
U 1 1 5FB2C9BB
P 7200 2400
AR Path="/5F622C8F/5FB2C9BB" Ref="#PWR0216"  Part="1" 
AR Path="/5F6294E6/5FB2C9BB" Ref="#PWR?"  Part="1" 
F 0 "#PWR0216" H 7200 2150 50  0001 C CNN
F 1 "GND" H 7205 2227 50  0001 C CNN
F 2 "" H 7200 2400 50  0001 C CNN
F 3 "" H 7200 2400 50  0001 C CNN
	1    7200 2400
	1    0    0    -1  
$EndComp
Wire Wire Line
	7100 2300 7200 2300
Wire Wire Line
	7200 2300 7200 2400
Connection ~ 7100 2300
Wire Wire Line
	6300 5650 6300 5700
Text Notes 8450 4300 0    50   ~ 0
Right+
Text Notes 8450 4200 0    50   ~ 0
Right-
Text Notes 8450 4400 0    50   ~ 0
Left+
Text Notes 8450 4500 0    50   ~ 0
Left-
$Comp
L power:GND #PWR0214
U 1 1 5FBC6BA9
P 6500 3750
AR Path="/5F622C8F/5FBC6BA9" Ref="#PWR0214"  Part="1" 
AR Path="/5F6294E6/5FBC6BA9" Ref="#PWR?"  Part="1" 
F 0 "#PWR0214" H 6500 3500 50  0001 C CNN
F 1 "GND" H 6505 3577 50  0001 C CNN
F 2 "" H 6500 3750 50  0001 C CNN
F 3 "" H 6500 3750 50  0001 C CNN
	1    6500 3750
	1    0    0    -1  
$EndComp
Wire Wire Line
	6500 3700 6500 3750
Text HLabel 3800 4050 0    50   Input ~ 0
OSC_EN
Wire Wire Line
	3550 3700 4200 3700
Wire Wire Line
	4200 4350 4200 4400
Wire Wire Line
	3800 4050 3900 4050
$Comp
L Jumper:SolderJumper_2_Bridged JP201
U 1 1 5F86F86F
P 7250 2950
F 0 "JP201" H 7100 3000 50  0000 C CNN
F 1 "SolderJumper_2_Bridged" H 7250 2800 50  0001 C CNN
F 2 "Jumper:SolderJumper-2_P1.3mm_Bridged_RoundedPad1.0x1.5mm" H 7250 2950 50  0001 C CNN
F 3 "~" H 7250 2950 50  0001 C CNN
	1    7250 2950
	1    0    0    -1  
$EndComp
Wire Wire Line
	7050 2950 7050 3100
Wire Wire Line
	7050 2950 7100 2950
Wire Wire Line
	7400 2950 7450 2950
Wire Wire Line
	7450 2650 7450 2950
Wire Wire Line
	6150 2650 7450 2650
Connection ~ 7450 2950
Wire Wire Line
	7450 2950 7500 2950
$Comp
L Device:C C?
U 1 1 5F847308
P 6700 4750
AR Path="/5F847308" Ref="C?"  Part="1" 
AR Path="/55AE8620/5F847308" Ref="C?"  Part="1" 
AR Path="/5F622C8F/5F847308" Ref="C215"  Part="1" 
AR Path="/5F6294E6/5F847308" Ref="C?"  Part="1" 
F 0 "C215" H 6700 4850 40  0000 L CNN
F 1 "10uF" H 6706 4665 40  0000 L CNN
F 2 "Capacitors_SMD:C_0805" H 6738 4600 30  0001 C CNN
F 3 "~" H 6700 4750 60  0000 C CNN
	1    6700 4750
	1    0    0    -1  
$EndComp
Wire Wire Line
	7100 5850 7100 5950
Wire Wire Line
	6700 4900 6700 4950
Connection ~ 6700 4950
Wire Wire Line
	6700 4950 6900 4950
Wire Wire Line
	6700 4600 6700 4550
Connection ~ 6700 4550
Wire Wire Line
	6700 4550 6900 4550
Wire Wire Line
	6150 4450 7150 4450
Wire Wire Line
	6150 4350 7400 4350
Wire Wire Line
	6150 4250 7400 4250
Wire Wire Line
	6150 4150 7150 4150
Text Notes 5000 5750 0    50   ~ 0
I2C Addr: 0x10
$EndSCHEMATC
