*----------------------------------------------------------------------
* SPICE Model generated by Murata Manufacturing Co., Ltd.
* Copyright(C) Murata Manufacturing Co., Ltd.
* Description :1005M(0402)/C0G/8.2pF/200V
* Murata P/N :GQM1555C2D8R2BB01
* Property : C = 8.2[pF]
* Data Generated on Jan 10, 2017
*----------------------------------------------------------------------
* Applicable Conditions:
*   Frequency Range = 100MHz-8.5GHz
*   Temperature = 25 degC
*   DC Bias Voltage = 0V
*   Small Signal Operation
*----------------------------------------------------------------------
.SUBCKT GQM1555C2D8R2BB01 port1 port2
C1 port1 11 8.20e-12
L2 11 12 1.81e-10
R3 12 13 7.06e-2
L4 13 14 3.73e-12
R4 13 14 8.84e-2
C5 14 15 2.15e-11
L5 14 15 2.39e-11
R5 14 15 31.3
C6 15 port2 5.39e-12
L6 15 port2 5.40e-11
R6 15 port2 95.3
R100 port1 11 1.00e+10
.ENDS GQM1555C2D8R2BB01