*----------------------------------------------------------------------
* SPICE Model generated by Murata Manufacturing Co., Ltd.
* Copyright(C) Murata Manufacturing Co., Ltd.
* Description :1005M(0402)/X5R/1uF/10V
* Murata P/N :GRM153R61A105ME95
* Property : C = 1[uF]
* Data Generated on Oct 1, 2019
*----------------------------------------------------------------------
* Applicable Conditions:
*   Frequency Range = 100Hz-6GHz
*   Temperature = 25 degC
*   DC Bias Voltage = 2.5V
*   Small Signal Operation
*----------------------------------------------------------------------
.SUBCKT GRM153R61A105ME95 port1 port2
C1 port1 11 5.49e-7
L2 11 12 1.80e-10
R3 12 13 1.73e-2
C4 13 14 2.20e-5
R4 13 14 191
C5 14 15 3.06e-5
R5 14 15 22.0
C6 15 16 3.88e-5
R6 15 16 2.37
C7 16 17 4.41e-5
R7 16 17 2.27e-1
C8 17 18 4.05e-5
R8 17 18 3.11e-2
C9 18 19 5.28e-5
R9 18 19 7.88e-3
L10 19 20 1.43e-11
R10 19 20 1.33e-1
L11 20 21 5.75e-11
R11 20 21 1.25e-1
C12 21 22 1.86e-8
L12 21 22 8.44e-11
R12 21 22 2.20e-2
C13 22 port2 3.50e-11
L13 22 port2 1.17e-11
R13 22 port2 9.20e-1
R100 port1 11 5.00e+7
.ENDS GRM153R61A105ME95