EESchema Schematic File Version 4
LIBS:frontplate-withbuttons-cache
EELAYER 26 0
EELAYER END
$Descr A4 11693 8268
encoding utf-8
Sheet 1 1
Title "DAB radio frontplate with buttons"
Date "2020-05-19"
Rev "1"
Comp "Copyright (c) 2030 Andreas Messer"
Comment1 ""
Comment2 ""
Comment3 ""
Comment4 ""
$EndDescr
$Comp
L extra-symbols:EA_OLEDM204-LGA U2
U 1 1 5EC3EEB9
P 4850 3400
F 0 "U2" H 4500 3850 50  0000 C CNN
F 1 "EA_OLEDM204-LGA" H 4950 3400 50  0000 C CNN
F 2 "extra-footprints:EA_OLEDM204" H 4850 3500 50  0001 C CNN
F 3 "" H 4850 3500 50  0001 C CNN
	1    4850 3400
	1    0    0    -1  
$EndComp
$Comp
L power:GND #PWR07
U 1 1 5EC3EF23
P 5050 4050
F 0 "#PWR07" H 5050 3800 50  0001 C CNN
F 1 "GND" H 5055 3877 50  0001 C CNN
F 2 "" H 5050 4050 50  0001 C CNN
F 3 "" H 5050 4050 50  0001 C CNN
	1    5050 4050
	1    0    0    -1  
$EndComp
$Comp
L power:GND #PWR06
U 1 1 5EC3EFB7
P 4850 4050
F 0 "#PWR06" H 4850 3800 50  0001 C CNN
F 1 "GND" H 4855 3877 50  0001 C CNN
F 2 "" H 4850 4050 50  0001 C CNN
F 3 "" H 4850 4050 50  0001 C CNN
	1    4850 4050
	1    0    0    -1  
$EndComp
Wire Wire Line
	4850 4050 4850 4000
Wire Wire Line
	5050 4050 5050 4000
$Comp
L Device:R R6
U 1 1 5EC3EFF1
P 5750 3700
F 0 "R6" H 5800 3950 50  0000 L CNN
F 1 "910k" H 5800 3850 50  0000 L CNN
F 2 "Resistors_SMD:R_0603_HandSoldering" V 5680 3700 50  0001 C CNN
F 3 "~" H 5750 3700 50  0001 C CNN
	1    5750 3700
	1    0    0    -1  
$EndComp
$Comp
L Device:C C6
U 1 1 5EC3F06C
P 6050 3700
F 0 "C6" H 6100 3950 50  0000 L CNN
F 1 "2.2µF" H 6100 3850 50  0000 L CNN
F 2 "Resistors_SMD:R_0805_HandSoldering" H 6088 3550 50  0001 C CNN
F 3 "~" H 6050 3700 50  0001 C CNN
	1    6050 3700
	1    0    0    -1  
$EndComp
Wire Wire Line
	5550 3300 5750 3300
Wire Wire Line
	5750 3300 5750 3550
Wire Wire Line
	5550 3200 6050 3200
Wire Wire Line
	6050 3200 6050 3550
$Comp
L power:GND #PWR09
U 1 1 5EC3F14A
P 5750 4050
F 0 "#PWR09" H 5750 3800 50  0001 C CNN
F 1 "GND" H 5755 3877 50  0001 C CNN
F 2 "" H 5750 4050 50  0001 C CNN
F 3 "" H 5750 4050 50  0001 C CNN
	1    5750 4050
	1    0    0    -1  
$EndComp
Wire Wire Line
	5750 3850 5750 4050
$Comp
L power:GND #PWR010
U 1 1 5EC3F187
P 6050 4050
F 0 "#PWR010" H 6050 3800 50  0001 C CNN
F 1 "GND" H 6055 3877 50  0001 C CNN
F 2 "" H 6050 4050 50  0001 C CNN
F 3 "" H 6050 4050 50  0001 C CNN
	1    6050 4050
	1    0    0    -1  
$EndComp
Wire Wire Line
	6050 3850 6050 4050
$Comp
L power:GND #PWR08
U 1 1 5EC3F1D8
P 5600 4050
F 0 "#PWR08" H 5600 3800 50  0001 C CNN
F 1 "GND" H 5605 3877 50  0001 C CNN
F 2 "" H 5600 4050 50  0001 C CNN
F 3 "" H 5600 4050 50  0001 C CNN
	1    5600 4050
	1    0    0    -1  
$EndComp
Wire Wire Line
	5550 3500 5600 3500
Wire Wire Line
	5600 3500 5600 4050
Wire Wire Line
	4650 2800 4650 2750
$Comp
L Device:C C3
U 1 1 5EC3F561
P 3700 2950
F 0 "C3" H 3800 2900 50  0000 L CNN
F 1 "100n" H 3800 2800 50  0000 L CNN
F 2 "Capacitors_SMD:C_0603_HandSoldering" H 3738 2800 50  0001 C CNN
F 3 "~" H 3700 2950 50  0001 C CNN
	1    3700 2950
	1    0    0    -1  
$EndComp
Wire Wire Line
	3700 2750 3700 2800
$Comp
L power:GND #PWR03
U 1 1 5EC3F6E8
P 3700 3150
F 0 "#PWR03" H 3700 2900 50  0001 C CNN
F 1 "GND" H 3705 2977 50  0001 C CNN
F 2 "" H 3700 3150 50  0001 C CNN
F 3 "" H 3700 3150 50  0001 C CNN
	1    3700 3150
	1    0    0    -1  
$EndComp
Wire Wire Line
	3700 3100 3700 3150
$Comp
L power:GND #PWR01
U 1 1 5EC3F9F2
P 2650 4150
F 0 "#PWR01" H 2650 3900 50  0001 C CNN
F 1 "GND" H 2655 3977 50  0001 C CNN
F 2 "" H 2650 4150 50  0001 C CNN
F 3 "" H 2650 4150 50  0001 C CNN
	1    2650 4150
	1    0    0    -1  
$EndComp
Wire Wire Line
	4850 2800 4850 2750
Wire Wire Line
	4850 2750 4650 2750
Connection ~ 4650 2750
$Comp
L Regulator_Switching:MC34063AD U1
U 1 1 5ECEA452
P 3800 4900
F 0 "U1" H 3550 5250 50  0000 C CNN
F 1 "MC34063AD" H 3900 5250 50  0000 C CNN
F 2 "Housings_SOIC:SOIC-8_3.9x4.9mm_Pitch1.27mm" H 3850 4450 50  0001 L CNN
F 3 "http://www.onsemi.com/pub_link/Collateral/MC34063A-D.PDF" H 4300 4800 50  0001 C CNN
	1    3800 4900
	1    0    0    -1  
$EndComp
$Comp
L Device:R R2
U 1 1 5ECEA52F
P 3800 4300
F 0 "R2" V 3700 4300 50  0000 C CNN
F 1 "2" V 3800 4300 50  0000 C CNN
F 2 "Resistors_SMD:R_0805_HandSoldering" V 3730 4300 50  0001 C CNN
F 3 "~" H 3800 4300 50  0001 C CNN
	1    3800 4300
	0    1    1    0   
$EndComp
Wire Wire Line
	3400 4700 3350 4700
Wire Wire Line
	3350 4700 3350 4300
Wire Wire Line
	3350 4300 3650 4300
$Comp
L power:GND #PWR04
U 1 1 5ECEA970
P 3800 5650
F 0 "#PWR04" H 3800 5400 50  0001 C CNN
F 1 "GND" H 3805 5477 50  0001 C CNN
F 2 "" H 3800 5650 50  0001 C CNN
F 3 "" H 3800 5650 50  0001 C CNN
	1    3800 5650
	1    0    0    -1  
$EndComp
Wire Wire Line
	3800 5400 3800 5600
Wire Wire Line
	4200 5100 4250 5100
$Comp
L Device:R R4
U 1 1 5ECEB20F
P 4450 5400
F 0 "R4" H 4400 5400 50  0000 R CNN
F 1 "5.6k" H 4400 5500 50  0000 R CNN
F 2 "Resistors_SMD:R_0603_HandSoldering" V 4380 5400 50  0001 C CNN
F 3 "~" H 4450 5400 50  0001 C CNN
	1    4450 5400
	-1   0    0    1   
$EndComp
Wire Wire Line
	4450 5550 4450 5600
Wire Wire Line
	4200 5200 4450 5200
Wire Wire Line
	4450 5200 4450 5250
$Comp
L Device:R R5
U 1 1 5ECEC17E
P 4650 5200
F 0 "R5" V 4750 5200 50  0000 C CNN
F 1 "47k" V 4650 5200 50  0000 C CNN
F 2 "Resistors_SMD:R_0603_HandSoldering" V 4580 5200 50  0001 C CNN
F 3 "~" H 4650 5200 50  0001 C CNN
	1    4650 5200
	0    -1   -1   0   
$EndComp
Wire Wire Line
	4450 5200 4500 5200
Connection ~ 4450 5200
$Comp
L Device:D D1
U 1 1 5ECEC8AB
P 4650 4900
F 0 "D1" H 4650 4800 50  0000 C CNN
F 1 "1N4148" H 4650 5000 50  0000 C CNN
F 2 "Diodes_SMD:D_MiniMELF" H 4650 4900 50  0001 C CNN
F 3 "~" H 4650 4900 50  0001 C CNN
	1    4650 4900
	-1   0    0    1   
$EndComp
Wire Wire Line
	4800 5200 4850 5200
Wire Wire Line
	4850 5200 4850 4900
Wire Wire Line
	4850 4900 4800 4900
Wire Wire Line
	4500 4900 4450 4900
Wire Wire Line
	4200 4700 4250 4700
Wire Wire Line
	4250 4700 4250 4300
Wire Wire Line
	4250 4300 3950 4300
$Comp
L Device:R R3
U 1 1 5ECEE081
P 4350 4550
F 0 "R3" H 4600 4400 50  0000 R CNN
F 1 "180" H 4600 4500 50  0000 R CNN
F 2 "Resistors_SMD:R_0603_HandSoldering" V 4280 4550 50  0001 C CNN
F 3 "~" H 4350 4550 50  0001 C CNN
	1    4350 4550
	-1   0    0    1   
$EndComp
Wire Wire Line
	4200 4800 4350 4800
Wire Wire Line
	4350 4800 4350 4700
Wire Wire Line
	4250 4300 4350 4300
Wire Wire Line
	4350 4300 4350 4400
Connection ~ 4250 4300
$Comp
L pspice:INDUCTOR L1
U 1 1 5ECEFF47
P 4450 4600
F 0 "L1" V 4350 4750 50  0000 L CNN
F 1 "220µH/120mA" V 4495 4677 50  0000 L CNN
F 2 "Inductors:Inductor_Wurth_HCI-1030" H 4450 4600 50  0001 C CNN
F 3 "~" H 4450 4600 50  0001 C CNN
	1    4450 4600
	0    1    1    0   
$EndComp
Wire Wire Line
	4350 4300 4450 4300
Wire Wire Line
	4450 4300 4450 4350
Connection ~ 4350 4300
Wire Wire Line
	4450 4850 4450 4900
Connection ~ 4450 4900
Wire Wire Line
	4450 4900 4200 4900
$Comp
L Device:C C2
U 1 1 5ECF675F
P 3350 5350
F 0 "C2" H 3200 5750 50  0000 L CNN
F 1 "319pF" H 3200 5700 50  0000 L CNN
F 2 "Capacitors_SMD:C_0603_HandSoldering" H 3388 5200 50  0001 C CNN
F 3 "~" H 3350 5350 50  0001 C CNN
	1    3350 5350
	1    0    0    -1  
$EndComp
Wire Wire Line
	3400 5100 3350 5100
Wire Wire Line
	3350 5100 3350 5200
Wire Wire Line
	4850 5550 4850 5600
Wire Wire Line
	4850 5250 4850 5200
Connection ~ 4850 5200
$Comp
L Device:CP C1
U 1 1 5ECFA00D
P 3050 5350
F 0 "C1" H 2900 6150 50  0000 L CNN
F 1 "100µF/16V" H 2900 6050 50  0000 L CNN
F 2 "Capacitors_ThroughHole:CP_Radial_D6.3mm_P2.50mm" H 3088 5200 50  0001 C CNN
F 3 "~" H 3050 5350 50  0001 C CNN
	1    3050 5350
	1    0    0    -1  
$EndComp
Wire Wire Line
	5050 2800 5050 2750
Wire Wire Line
	3700 2750 3500 2750
$Comp
L Device:R R1
U 1 1 5ED00204
P 3500 2950
F 0 "R1" H 3500 3300 50  0000 L CNN
F 1 "47k" H 3500 3200 50  0000 L CNN
F 2 "Resistors_SMD:R_0603_HandSoldering" V 3430 2950 50  0001 C CNN
F 3 "~" H 3500 2950 50  0001 C CNN
	1    3500 2950
	1    0    0    -1  
$EndComp
Wire Wire Line
	3500 2750 3500 2800
Connection ~ 3500 2750
Wire Wire Line
	3500 3300 3500 3200
$Comp
L Switch:SW_Push SW3
U 1 1 5ED05437
P 3000 3000
F 0 "SW3" H 2850 3100 50  0000 C CNN
F 1 "~" H 3000 3194 50  0000 C CNN
F 2 "Buttons_Switches_ThroughHole:SW_PUSH_6mm_h5mm" H 3000 3200 50  0001 C CNN
F 3 "" H 3000 3200 50  0001 C CNN
	1    3000 3000
	1    0    0    -1  
$EndComp
$Comp
L Switch:SW_Push SW2
U 1 1 5ED05717
P 3000 2800
F 0 "SW2" H 2850 2900 50  0000 C CNN
F 1 "~" H 3000 2994 50  0000 C CNN
F 2 "Buttons_Switches_ThroughHole:SW_PUSH_6mm_h5mm" H 3000 3000 50  0001 C CNN
F 3 "" H 3000 3000 50  0001 C CNN
	1    3000 2800
	1    0    0    -1  
$EndComp
$Comp
L Switch:SW_Push SW1
U 1 1 5ED0575D
P 3000 2600
F 0 "SW1" H 2850 2700 50  0000 C CNN
F 1 "~" H 3000 2794 50  0000 C CNN
F 2 "Buttons_Switches_ThroughHole:SW_PUSH_6mm_h5mm" H 3000 2800 50  0001 C CNN
F 3 "" H 3000 2800 50  0001 C CNN
	1    3000 2600
	1    0    0    -1  
$EndComp
Wire Wire Line
	3200 2600 3250 2600
Wire Wire Line
	3200 2800 3250 2800
$Comp
L power:GND #PWR05
U 1 1 5ED0BF5A
P 4350 2900
F 0 "#PWR05" H 4350 2650 50  0001 C CNN
F 1 "GND" H 4355 2727 50  0001 C CNN
F 2 "" H 4350 2900 50  0001 C CNN
F 3 "" H 4350 2900 50  0001 C CNN
	1    4350 2900
	0    -1   -1   0   
$EndComp
Wire Wire Line
	2950 3600 2950 3700
$Comp
L Connector_Generic:Conn_01x10 J1
U 1 1 5ED10F54
P 2400 3600
F 0 "J1" H 2320 4217 50  0000 C CNN
F 1 "Conn_01x10" H 2320 4126 50  0000 C CNN
F 2 "Socket_Strips:Socket_Strip_Straight_2x05_Pitch2.54mm_SMD" H 2400 3600 50  0001 C CNN
F 3 "~" H 2400 3600 50  0001 C CNN
	1    2400 3600
	-1   0    0    -1  
$EndComp
Wire Wire Line
	2600 4100 2650 4100
Wire Wire Line
	2650 4100 2650 4150
Wire Wire Line
	3250 2600 3250 2800
Wire Wire Line
	3250 2800 3250 3000
Connection ~ 3250 2800
Wire Wire Line
	3000 3800 2600 3800
Wire Wire Line
	3000 3500 3000 3800
Wire Wire Line
	2600 3700 2950 3700
Wire Wire Line
	2600 3200 3500 3200
Connection ~ 3500 3200
Wire Wire Line
	3500 3200 3500 3100
Wire Wire Line
	3250 3000 3200 3000
Wire Wire Line
	2800 3000 2700 3000
Wire Wire Line
	2750 3600 2600 3600
Wire Wire Line
	2600 3500 2700 3500
Wire Wire Line
	2650 2800 2800 2800
Wire Wire Line
	2800 2600 2750 2600
$Comp
L power:GND #PWR02
U 1 1 5ED4AF80
P 3250 3050
F 0 "#PWR02" H 3250 2800 50  0001 C CNN
F 1 "GND" H 3255 2877 50  0001 C CNN
F 2 "" H 3250 3050 50  0001 C CNN
F 3 "" H 3250 3050 50  0001 C CNN
	1    3250 3050
	1    0    0    -1  
$EndComp
Wire Wire Line
	3050 5200 3050 4700
Connection ~ 3350 4700
Wire Wire Line
	3050 4700 3350 4700
Wire Wire Line
	5050 2750 6350 2750
Wire Wire Line
	6350 2750 6350 5200
Connection ~ 3800 5600
Wire Wire Line
	3800 5600 3800 5650
Wire Wire Line
	3800 5600 4250 5600
Wire Wire Line
	4450 5600 4850 5600
Connection ~ 4450 5600
Wire Wire Line
	3800 5600 3350 5600
Wire Wire Line
	3050 5500 3050 5600
Wire Wire Line
	3350 5500 3350 5600
Connection ~ 3350 5600
Wire Wire Line
	3350 5600 3050 5600
Wire Wire Line
	4250 5100 4250 5600
Connection ~ 4250 5600
Wire Wire Line
	4250 5600 4450 5600
Text Label 2750 4000 0    50   ~ 0
3.3V
Text Label 4950 5200 0    50   ~ 0
VCC_12V
$Comp
L Jumper:SolderJumper_3_Bridged12 JP2
U 1 1 5ECFDFDE
P 4100 2900
F 0 "JP2" H 4100 3200 50  0000 C CNN
F 1 "Mode" H 4100 3100 50  0000 C CNN
F 2 "Jumper:SolderJumper-3_P1.3mm_Bridged12_RoundedPad1.0x1.5mm_NumberLabels" H 4100 2900 50  0001 C CNN
F 3 "~" H 4100 2900 50  0001 C CNN
	1    4100 2900
	-1   0    0    -1  
$EndComp
Wire Wire Line
	3700 2750 3850 2750
Connection ~ 3700 2750
Wire Wire Line
	3900 2900 3850 2900
Wire Wire Line
	3850 2900 3850 2750
Connection ~ 3850 2750
Wire Wire Line
	3850 2750 4650 2750
Wire Wire Line
	4350 2900 4300 2900
Wire Wire Line
	4100 3050 4100 3100
Wire Wire Line
	4100 3100 4150 3100
Wire Wire Line
	3500 3300 4150 3300
Wire Wire Line
	2600 3400 4150 3400
Wire Wire Line
	3000 3500 4150 3500
Wire Wire Line
	2950 3600 3750 3600
Wire Wire Line
	4100 3700 4150 3700
$Comp
L Jumper:SolderJumper_2_Open JP1
U 1 1 5ED1D6FF
P 3950 3700
F 0 "JP1" H 3950 3600 50  0000 C CNN
F 1 "Mode" H 3950 3550 50  0000 C CNN
F 2 "Jumper:SolderJumper-2_P1.3mm_Open_RoundedPad1.0x1.5mm" H 3950 3700 50  0001 C CNN
F 3 "~" H 3950 3700 50  0001 C CNN
	1    3950 3700
	1    0    0    -1  
$EndComp
Wire Wire Line
	3800 3700 3750 3700
Wire Wire Line
	3750 3700 3750 3600
Connection ~ 3750 3600
Wire Wire Line
	3750 3600 4150 3600
Connection ~ 3250 3000
Wire Wire Line
	3250 3000 3250 3050
Wire Wire Line
	3350 4000 2600 4000
Connection ~ 3350 4300
Wire Wire Line
	3350 4000 3350 4300
Connection ~ 3350 4000
Wire Wire Line
	3500 2750 3350 2750
Wire Wire Line
	3350 2750 3350 4000
Wire Wire Line
	4850 5200 5150 5200
NoConn ~ 2600 3900
$Comp
L Device:C C4
U 1 1 5ED58CDA
P 4850 5400
F 0 "C4" H 4900 5500 50  0000 L CNN
F 1 "22µF" H 4900 5300 50  0000 L CNN
F 2 "Capacitors_SMD:C_1210_HandSoldering" H 4888 5250 50  0001 C CNN
F 3 "~" H 4850 5400 50  0001 C CNN
	1    4850 5400
	1    0    0    -1  
$EndComp
Wire Wire Line
	5150 5550 5150 5600
Wire Wire Line
	5150 5600 4850 5600
Connection ~ 4850 5600
Wire Wire Line
	5150 5250 5150 5200
Connection ~ 5150 5200
Wire Wire Line
	5150 5200 6350 5200
Text Notes 4400 5750 0    50   ~ 0
1.5k/13k
$Comp
L Device:C C5
U 1 1 5ED60412
P 5150 5400
F 0 "C5" H 5200 5500 50  0000 L CNN
F 1 "22µF" H 5200 5300 50  0000 L CNN
F 2 "Capacitors_SMD:C_1210_HandSoldering" H 5188 5250 50  0001 C CNN
F 3 "~" H 5150 5400 50  0001 C CNN
	1    5150 5400
	1    0    0    -1  
$EndComp
$Comp
L Device:C C7
U 1 1 5EE27BE1
P 2750 5350
F 0 "C7" H 2600 5750 50  0000 L CNN
F 1 "100n" H 2600 5700 50  0000 L CNN
F 2 "Capacitors_SMD:C_0603_HandSoldering" H 2788 5200 50  0001 C CNN
F 3 "~" H 2750 5350 50  0001 C CNN
	1    2750 5350
	1    0    0    -1  
$EndComp
Wire Wire Line
	3050 4700 2750 4700
Wire Wire Line
	2750 4700 2750 5200
Connection ~ 3050 4700
Wire Wire Line
	2750 5500 2750 5600
Wire Wire Line
	2750 5600 3050 5600
Connection ~ 3050 5600
Wire Wire Line
	2600 3300 2650 3300
Wire Wire Line
	2750 2600 2750 3600
Wire Wire Line
	2650 2800 2650 3300
Wire Wire Line
	2700 3000 2700 3500
$Comp
L Mechanical:MountingHole H1
U 1 1 5EE4D177
P 5550 4400
F 0 "H1" H 5650 4446 50  0000 L CNN
F 1 "MountingHole" H 5650 4355 50  0000 L CNN
F 2 "Mounting_Holes:MountingHole_3.2mm_M3" H 5550 4400 50  0001 C CNN
F 3 "~" H 5550 4400 50  0001 C CNN
	1    5550 4400
	1    0    0    -1  
$EndComp
$Comp
L Mechanical:MountingHole H2
U 1 1 5EE4D27A
P 5550 4600
F 0 "H2" H 5650 4646 50  0000 L CNN
F 1 "MountingHole" H 5650 4555 50  0000 L CNN
F 2 "Mounting_Holes:MountingHole_3.2mm_M3" H 5550 4600 50  0001 C CNN
F 3 "~" H 5550 4600 50  0001 C CNN
	1    5550 4600
	1    0    0    -1  
$EndComp
$Comp
L Mechanical:MountingHole H3
U 1 1 5EE4D2C0
P 5550 4800
F 0 "H3" H 5650 4846 50  0000 L CNN
F 1 "MountingHole" H 5650 4755 50  0000 L CNN
F 2 "Mounting_Holes:MountingHole_3.2mm_M3" H 5550 4800 50  0001 C CNN
F 3 "~" H 5550 4800 50  0001 C CNN
	1    5550 4800
	1    0    0    -1  
$EndComp
$Comp
L Mechanical:MountingHole H4
U 1 1 5EE4D308
P 5550 5000
F 0 "H4" H 5650 5046 50  0000 L CNN
F 1 "MountingHole" H 5650 4955 50  0000 L CNN
F 2 "Mounting_Holes:MountingHole_3.2mm_M3" H 5550 5000 50  0001 C CNN
F 3 "~" H 5550 5000 50  0001 C CNN
	1    5550 5000
	1    0    0    -1  
$EndComp
$EndSCHEMATC
