2-Way Active Crossover

.INCLUDE tl072.mod

* Powersupply
VDD 3 0 DC 12V
* Virtual Ground
VGND 1 0 DC 6V
* Input signal
VIN 2 1 DC 0V AC 1V

* Low Pass Filter
R2   2  4 5.6k
R4   4  6 5.6k
R12  5  7 5.6k
R16  7  9 5.6k

C4   4  5 22n
C10  6  1 10n
C18  7  8 22n
C23  9  1 10n

X2A  6  5  3  0  5 TL072
X4A  9  8  3  0  8 TL072

* High Pass Filter
C6   2 10 10n
C8  10 12 10n
C16 11 13 10n
C21 13 15 10n

R5  10 11 5.6k
R8  12  1  10k
R14 13 14 5.6k
R20 15  1  10k

X2B 12 11  3  0 11 TL072
X4B 15 14  3  0 14 TL072
