*----------------------------------------------------------------------
* SPICE Model generated by Murata Manufacturing Co., Ltd.
* Copyright(C) Murata Manufacturing Co., Ltd.
* Description :0816M(0306)/X7R/0.1uF/10V
* Murata P/N :LLL185R71A104MA01
* Property : C = 0.1[uF]
* Data Generated on Nov 6, 2018
*----------------------------------------------------------------------
* Applicable Conditions:
*   Frequency Range = 100Hz-6GHz
*   Temperature = 25 degC
*   DC Bias Voltage = 2.5V
*   Small Signal Operation
*----------------------------------------------------------------------
.SUBCKT LLL185R71A104MA01 port1 port2
C1 port1 11 9.40e-8
L2 11 12 4.10e-11
R3 12 13 7.00e-3
C4 13 14 7.37e-6
R4 13 14 540
C5 14 15 1.06e-5
R5 14 15 43.9
C6 15 16 7.80e-6
R6 15 16 7.46
C7 16 17 9.81e-6
R7 16 17 5.40e-1
C8 17 18 1.21e-5
R8 17 18 9.76e-2
C9 18 19 7.79e-6
R9 18 19 2.98e-2
C10 19 20 5.41e-6
R10 19 20 6.19e-3
L11 20 21 3.65e-11
R11 20 21 5.73e-2
L12 21 22 1.92e-13
R12 21 22 2.41e-3
C13 22 23 1.65e-7
L13 22 23 1.57e-11
R13 22 23 2.59e-2
C14 23 24 8.14e-8
L14 23 24 1.05e-11
R14 23 24 2.32e-2
C15 24 port2 6.35e-12
L15 24 port2 5.10e-11
R15 24 port2 9.53
R100 port1 11 5.00e+9
.ENDS LLL185R71A104MA01