EESchema Schematic File Version 4
LIBS:dabradio-cache
EELAYER 26 0
EELAYER END
$Descr A4 11693 8268
encoding utf-8
Sheet 3 3
Title "Si4688 based DAB/FM Radio"
Date "2019-03-26"
Rev "2"
Comp "Copyright (c) 2019 Andreas Messer"
Comment1 ""
Comment2 ""
Comment3 ""
Comment4 ""
$EndDescr
$Comp
L dabradio:MAX98089 U301
U 1 1 52F7B06D
P 7150 3800
F 0 "U301" H 7900 1950 60  0000 C CNN
F 1 "MAX98089" H 7150 3650 60  0000 C CNN
F 2 "Housings_DFN_QFN:QFN-56-1EP_7x7mm_Pitch0.4mm" H 7150 3800 60  0001 C CNN
F 3 "~" H 7150 3800 60  0000 C CNN
	1    7150 3800
	1    0    0    -1  
$EndComp
$Comp
L Device:R R301
U 1 1 52F7B273
P 5800 4000
F 0 "R301" V 5880 4000 40  0000 C CNN
F 1 "10k" V 5807 4001 40  0000 C CNN
F 2 "Resistors_SMD:R_0603" V 5730 4000 30  0001 C CNN
F 3 "~" H 5800 4000 30  0000 C CNN
	1    5800 4000
	0    -1   -1   0   
$EndComp
$Comp
L Device:C C306
U 1 1 52F7B5C8
P 5850 5200
AR Path="/52F7B5C8" Ref="C306"  Part="1" 
AR Path="/55AE8620/52F7B5C8" Ref="C306"  Part="1" 
F 0 "C306" H 5850 5300 40  0000 L CNN
F 1 "1u" H 5856 5115 40  0000 L CNN
F 2 "Capacitors_SMD:C_0603" H 5888 5050 30  0001 C CNN
F 3 "~" H 5850 5200 60  0000 C CNN
	1    5850 5200
	1    0    0    -1  
$EndComp
Text HLabel 6000 2700 0    60   Output ~ 0
I2S1_OUT
Text HLabel 6000 2600 0    60   Input ~ 0
I2S1_IN
Text HLabel 6000 2500 0    60   Output ~ 0
I2S1_WS
Text HLabel 6000 2400 0    60   Output ~ 0
I2S1_CLK
Text HLabel 5350 3700 0    60   BiDi ~ 0
SCL
Text HLabel 5350 3800 0    60   BiDi ~ 0
SDA
Text HLabel 5350 3900 0    60   Output ~ 0
#IRQ
$Comp
L Device:C C303
U 1 1 52F7F438
P 5200 2500
AR Path="/52F7F438" Ref="C303"  Part="1" 
AR Path="/55AE8620/52F7F438" Ref="C303"  Part="1" 
F 0 "C303" H 5200 2600 40  0000 L CNN
F 1 "1u" H 5206 2415 40  0000 L CNN
F 2 "Capacitors_SMD:C_0603" H 5238 2350 30  0001 C CNN
F 3 "~" H 5200 2500 60  0000 C CNN
	1    5200 2500
	1    0    0    -1  
$EndComp
$Comp
L Device:C C307
U 1 1 52F7F516
P 6650 1450
AR Path="/52F7F516" Ref="C307"  Part="1" 
AR Path="/55AE8620/52F7F516" Ref="C307"  Part="1" 
F 0 "C307" H 6650 1550 40  0000 L CNN
F 1 "1u" H 6656 1365 40  0000 L CNN
F 2 "Capacitors_SMD:C_0603" H 6688 1300 30  0001 C CNN
F 3 "~" H 6650 1450 60  0000 C CNN
	1    6650 1450
	0    -1   -1   0   
$EndComp
$Comp
L Device:C C308
U 1 1 52F7F603
P 7650 1450
AR Path="/52F7F603" Ref="C308"  Part="1" 
AR Path="/55AE8620/52F7F603" Ref="C308"  Part="1" 
F 0 "C308" H 7650 1550 40  0000 L CNN
F 1 "1u" H 7656 1365 40  0000 L CNN
F 2 "Capacitors_SMD:C_0603" H 7688 1300 30  0001 C CNN
F 3 "~" H 7650 1450 60  0000 C CNN
	1    7650 1450
	0    -1   -1   0   
$EndComp
NoConn ~ 8250 1900
NoConn ~ 8250 2100
NoConn ~ 8250 2300
NoConn ~ 8250 2400
NoConn ~ 8250 2600
NoConn ~ 8250 2700
$Comp
L Device:C C302
U 1 1 5344A6E8
P 5000 2500
AR Path="/5344A6E8" Ref="C302"  Part="1" 
AR Path="/55AE8620/5344A6E8" Ref="C302"  Part="1" 
F 0 "C302" H 5000 2600 40  0000 L CNN
F 1 "1u" H 5006 2415 40  0000 L CNN
F 2 "Capacitors_SMD:C_0603" H 5038 2350 30  0001 C CNN
F 3 "~" H 5000 2500 60  0000 C CNN
	1    5000 2500
	1    0    0    -1  
$EndComp
Text HLabel 4950 2300 0    60   Input ~ 0
+3.3V
Text HLabel 6000 3100 0    60   Output ~ 0
I2S2_CLK
Text HLabel 6000 3200 0    60   Output ~ 0
I2S2_WS
Text HLabel 6000 3300 0    60   Input ~ 0
I2S2_IN
Text HLabel 6000 3400 0    60   Output ~ 0
I2S2_OUT
Text HLabel 8300 4000 2    60   Output ~ 0
SPKL+
Text HLabel 8300 4100 2    60   Output ~ 0
SPKL-
Text HLabel 8300 4500 2    60   Output ~ 0
SPKR+
Text HLabel 8300 4600 2    60   Output ~ 0
SPKR-
$Comp
L Device:C C305
U 1 1 559C7E12
P 5650 5200
AR Path="/559C7E12" Ref="C305"  Part="1" 
AR Path="/55AE8620/559C7E12" Ref="C305"  Part="1" 
F 0 "C305" H 5650 5300 40  0000 L CNN
F 1 "10u" H 5656 5115 40  0000 L CNN
F 2 "Capacitors_SMD:C_0805" H 5688 5050 30  0001 C CNN
F 3 "~" H 5650 5200 60  0000 C CNN
	1    5650 5200
	1    0    0    -1  
$EndComp
$Comp
L Device:C C310
U 1 1 559C8739
P 8550 5750
AR Path="/559C8739" Ref="C310"  Part="1" 
AR Path="/55AE8620/559C8739" Ref="C310"  Part="1" 
F 0 "C310" H 8550 5850 40  0000 L CNN
F 1 "1u" H 8556 5665 40  0000 L CNN
F 2 "Capacitors_SMD:C_0603" H 8588 5600 30  0001 C CNN
F 3 "~" H 8550 5750 60  0000 C CNN
	1    8550 5750
	-1   0    0    1   
$EndComp
Text HLabel 6850 1400 1    60   Input ~ 0
+1.8V
Text HLabel 7450 1400 1    60   Input ~ 0
+1.8V
Text HLabel 5450 5000 0    60   Input ~ 0
+1.8V
Text HLabel 9750 4050 2    60   Input ~ 0
+3.3V
Text HLabel 8300 3600 2    60   Output ~ 0
LINEL
Text HLabel 8300 3700 2    60   Output ~ 0
LINER
NoConn ~ 8250 2900
NoConn ~ 8250 3000
NoConn ~ 8250 3300
NoConn ~ 8250 3200
$Comp
L Device:C C313
U 1 1 559C8BAD
P 8950 4400
AR Path="/559C8BAD" Ref="C313"  Part="1" 
AR Path="/55AE8620/559C8BAD" Ref="C313"  Part="1" 
F 0 "C313" H 8950 4500 40  0000 L CNN
F 1 "1u" H 8956 4315 40  0000 L CNN
F 2 "Capacitors_SMD:C_0603" H 8988 4250 30  0001 C CNN
F 3 "~" H 8950 4400 60  0000 C CNN
	1    8950 4400
	0    1    1    0   
$EndComp
$Comp
L Device:C C314
U 1 1 559C8BBD
P 9500 4300
AR Path="/559C8BBD" Ref="C314"  Part="1" 
AR Path="/55AE8620/559C8BBD" Ref="C314"  Part="1" 
F 0 "C314" H 9500 4400 40  0000 L CNN
F 1 "10u" H 9506 4215 40  0000 L CNN
F 2 "Capacitors_SMD:C_0805" H 9538 4150 30  0001 C CNN
F 3 "~" H 9500 4300 60  0000 C CNN
	1    9500 4300
	1    0    0    -1  
$EndComp
$Comp
L Device:C C312
U 1 1 52F7F8F6
P 8950 3900
AR Path="/52F7F8F6" Ref="C312"  Part="1" 
AR Path="/55AE8620/52F7F8F6" Ref="C312"  Part="1" 
F 0 "C312" H 8950 4000 40  0000 L CNN
F 1 "1u" H 8956 3815 40  0000 L CNN
F 2 "Capacitors_SMD:C_0603" H 8988 3750 30  0001 C CNN
F 3 "~" H 8950 3900 60  0000 C CNN
	1    8950 3900
	0    -1   -1   0   
$EndComp
Wire Wire Line
	7450 6000 7450 5900
Wire Wire Line
	8250 5500 8350 5500
Wire Wire Line
	8350 5500 8350 5600
Wire Wire Line
	8250 5400 8750 5400
Wire Wire Line
	8350 5900 8350 5950
Wire Wire Line
	8550 5900 8550 5950
Wire Wire Line
	5350 3700 6050 3700
Wire Wire Line
	5350 3800 6050 3800
Wire Wire Line
	5350 3900 6000 3900
Wire Wire Line
	5450 5000 5650 5000
Wire Wire Line
	4650 4200 6050 4200
Wire Wire Line
	6050 2400 6000 2400
Wire Wire Line
	6000 2500 6050 2500
Wire Wire Line
	6050 2600 6000 2600
Wire Wire Line
	6000 2700 6050 2700
Wire Wire Line
	4950 2300 5000 2300
Wire Wire Line
	5200 2300 5200 2350
Connection ~ 5200 2300
Wire Wire Line
	5200 2700 5200 2650
Wire Wire Line
	6850 5900 6850 6000
Wire Wire Line
	6450 1450 6500 1450
Wire Wire Line
	6850 1400 6850 1450
Wire Wire Line
	6850 1450 6800 1450
Connection ~ 6850 1450
Wire Wire Line
	7450 1400 7450 1450
Wire Wire Line
	7450 1450 7500 1450
Wire Wire Line
	7850 1450 7800 1450
Connection ~ 7450 1450
Wire Wire Line
	5400 3000 6050 3000
Wire Wire Line
	8250 4700 9150 4700
Wire Wire Line
	7150 5900 7150 6000
Wire Wire Line
	8250 4400 8750 4400
Wire Wire Line
	5350 4000 5650 4000
Wire Wire Line
	5950 4000 6000 4000
Wire Wire Line
	6000 4000 6000 3900
Connection ~ 6000 3900
Wire Wire Line
	5400 2300 5400 3000
Connection ~ 5400 2300
Wire Wire Line
	5000 2300 5000 2350
Wire Wire Line
	5000 2650 5000 2700
Connection ~ 5000 2300
Wire Wire Line
	8250 4000 8300 4000
Wire Wire Line
	8300 4100 8250 4100
Wire Wire Line
	8250 4500 8300 4500
Wire Wire Line
	8250 4600 8300 4600
Wire Wire Line
	5650 5050 5650 5000
Connection ~ 5650 5000
Wire Wire Line
	5850 5050 5850 5000
Connection ~ 5850 5000
Wire Wire Line
	6050 5100 6000 5100
Wire Wire Line
	6000 5100 6000 5400
Wire Wire Line
	5650 5350 5650 5400
Connection ~ 5650 5400
Wire Wire Line
	5850 5350 5850 5400
Connection ~ 5850 5400
Wire Wire Line
	8300 3600 8250 3600
Wire Wire Line
	8250 3700 8300 3700
Wire Wire Line
	8750 3750 8750 3900
Wire Wire Line
	8250 3900 8750 3900
Connection ~ 8750 4400
Connection ~ 8750 3900
Wire Wire Line
	8250 4200 9150 4200
Wire Wire Line
	9150 3900 9150 4200
Wire Wire Line
	9150 3900 9100 3900
Wire Wire Line
	9150 4400 9100 4400
Wire Wire Line
	9500 3750 9500 4050
Connection ~ 9500 4050
Connection ~ 9150 4400
Connection ~ 9150 4200
Wire Wire Line
	9500 4700 9500 4450
Connection ~ 9150 4700
Connection ~ 9500 4700
Text HLabel 9750 4700 2    60   Input ~ 0
GND
Wire Wire Line
	8750 3750 9500 3750
Wire Wire Line
	9500 4050 9750 4050
Text HLabel 8350 5000 2    60   Input ~ 0
GND
Wire Wire Line
	8250 5000 8350 5000
$Comp
L Device:C C309
U 1 1 559C93A7
P 8350 5750
AR Path="/559C93A7" Ref="C309"  Part="1" 
AR Path="/55AE8620/559C93A7" Ref="C309"  Part="1" 
F 0 "C309" H 8350 5850 40  0000 L CNN
F 1 "1u" H 8356 5665 40  0000 L CNN
F 2 "Capacitors_SMD:C_0603" H 8388 5600 30  0001 C CNN
F 3 "~" H 8350 5750 60  0000 C CNN
	1    8350 5750
	-1   0    0    1   
$EndComp
$Comp
L Device:C C311
U 1 1 559C93AD
P 8750 5750
AR Path="/559C93AD" Ref="C311"  Part="1" 
AR Path="/55AE8620/559C93AD" Ref="C311"  Part="1" 
F 0 "C311" H 8750 5850 40  0000 L CNN
F 1 "1u" H 8756 5665 40  0000 L CNN
F 2 "Capacitors_SMD:C_0603" H 8788 5600 30  0001 C CNN
F 3 "~" H 8750 5750 60  0000 C CNN
	1    8750 5750
	-1   0    0    1   
$EndComp
Wire Wire Line
	8750 5400 8750 5600
Wire Wire Line
	8550 5500 8550 5600
Connection ~ 8350 5500
Wire Wire Line
	8750 5950 8750 5900
Wire Wire Line
	8350 5950 8550 5950
Connection ~ 8550 5950
Text HLabel 8800 5950 2    60   Input ~ 0
GND
Connection ~ 8750 5950
Text HLabel 7500 6000 2    60   Input ~ 0
GND
Wire Wire Line
	6850 6000 7150 6000
Connection ~ 7450 6000
Connection ~ 7150 6000
Text HLabel 5450 5400 0    60   Input ~ 0
GND
Text HLabel 6450 1450 0    60   Input ~ 0
GND
Text HLabel 7850 1450 2    60   Input ~ 0
GND
Wire Wire Line
	6000 3100 6050 3100
Wire Wire Line
	6050 3200 6000 3200
Wire Wire Line
	6000 3300 6050 3300
Wire Wire Line
	6050 3400 6000 3400
Text HLabel 4950 2700 0    60   Input ~ 0
GND
Wire Wire Line
	4950 2700 5000 2700
Connection ~ 5000 2700
$Comp
L dabradio:IQXO_7X X301
U 1 1 55AEEA44
P 4050 4350
F 0 "X301" H 4050 4650 70  0000 C CNN
F 1 "ASDMB-24.576MHZ-LC-T" H 4050 4350 70  0000 C CNN
F 2 "" H 4050 4350 60  0001 C CNN
F 3 "" H 4050 4350 60  0000 C CNN
	1    4050 4350
	1    0    0    -1  
$EndComp
Wire Wire Line
	4650 4500 4750 4500
Wire Wire Line
	4750 4500 4750 3950
Wire Wire Line
	4750 3950 3400 3950
Wire Wire Line
	3400 3950 3400 4200
Wire Wire Line
	3400 4200 3450 4200
$Comp
L Device:C C301
U 1 1 55AEEB4F
P 3200 4200
AR Path="/55AEEB4F" Ref="C301"  Part="1" 
AR Path="/55AE8620/55AEEB4F" Ref="C301"  Part="1" 
F 0 "C301" H 3200 4300 40  0000 L CNN
F 1 "100n" H 3206 4115 40  0000 L CNN
F 2 "Capacitors_SMD:C_0603" H 3238 4050 30  0001 C CNN
F 3 "~" H 3200 4200 60  0000 C CNN
	1    3200 4200
	1    0    0    -1  
$EndComp
Wire Wire Line
	3200 3950 3200 4050
Connection ~ 3400 3950
Wire Wire Line
	3050 4500 3200 4500
Wire Wire Line
	3200 4500 3200 4350
Text HLabel 3050 4500 0    60   Input ~ 0
GND
Text HLabel 3050 3950 0    60   Input ~ 0
+1.8V
Connection ~ 3200 4500
Connection ~ 3200 3950
Text HLabel 5350 4000 0    60   Input ~ 0
+3.3V
NoConn ~ 8250 4900
NoConn ~ 8250 5100
NoConn ~ 6050 4500
NoConn ~ 6050 4600
NoConn ~ 6050 4700
NoConn ~ 6050 4800
Wire Wire Line
	6000 5400 5850 5400
Wire Wire Line
	5200 2300 5400 2300
Wire Wire Line
	6850 1450 6850 1500
Wire Wire Line
	7450 1450 7450 1500
Wire Wire Line
	6000 3900 6050 3900
Wire Wire Line
	5400 2300 6050 2300
Wire Wire Line
	5000 2300 5200 2300
Wire Wire Line
	5650 5000 5850 5000
Wire Wire Line
	5850 5000 6050 5000
Wire Wire Line
	5650 5400 5450 5400
Wire Wire Line
	5850 5400 5650 5400
Wire Wire Line
	8750 4400 8800 4400
Wire Wire Line
	8750 3900 8750 4400
Wire Wire Line
	8750 3900 8800 3900
Wire Wire Line
	9500 4050 9500 4150
Wire Wire Line
	9150 4400 9150 4700
Wire Wire Line
	9150 4200 9150 4400
Wire Wire Line
	9150 4700 9500 4700
Wire Wire Line
	9500 4700 9750 4700
Wire Wire Line
	8350 5500 8550 5500
Wire Wire Line
	8550 5950 8750 5950
Wire Wire Line
	8750 5950 8800 5950
Wire Wire Line
	7450 6000 7500 6000
Wire Wire Line
	7150 6000 7450 6000
Wire Wire Line
	5000 2700 5200 2700
Wire Wire Line
	3400 3950 3200 3950
Wire Wire Line
	3200 4500 3450 4500
Wire Wire Line
	3200 3950 3050 3950
$EndSCHEMATC
