*----------------------------------------------------------------------
* SPICE Model generated by Murata Manufacturing Co., Ltd.
* Copyright(C) Murata Manufacturing Co., Ltd.
* Description :1608M(0603)/X7R/1uF/16V
* Murata P/N :GCH188R71C105KE01
* Property : C = 1[uF]
* Data Generated on May 9, 2017
*----------------------------------------------------------------------
* Applicable Conditions:
*   Frequency Range = 100Hz-6GHz
*   Temperature = 25 degC
*   DC Bias Voltage = 2V
*   Small Signal Operation
*----------------------------------------------------------------------
.SUBCKT GCH188R71C105KE01 port1 port2
C1 port1 11 7.71e-7
L2 11 12 8.09e-11
R3 12 13 7.70e-3
C4 13 14 4.41e-6
R4 13 14 1.51e+3
C5 14 15 1.50e-5
R5 14 15 23.2
C6 15 16 1.46e-5
R6 15 16 2.12
C7 16 17 1.14e-5
R7 16 17 2.46e-1
C8 17 18 8.54e-6
R8 17 18 2.81e-2
L9 18 19 2.93e-11
R9 18 19 1.10e-1
L10 19 20 1.75e-10
R10 19 20 4.19e-2
C11 20 21 3.21e-6
L11 20 21 3.06e-11
R11 20 21 9.78e-3
C12 21 22 1.01e-6
L12 21 22 4.54e-11
R12 21 22 1.49e-2
C13 22 port2 1.23e-12
L13 22 port2 2.21e-10
R13 22 port2 87.4
R100 port1 11 5.00e+7
.ENDS GCH188R71C105KE01