(export (version D)
  (design
    (source /home/andi/Projekte/radio-shield/hardware/shield/shield.sch)
    (date "So 16 Mai 2021 14:40:01 CEST")
    (tool "Eeschema 5.0.2+dfsg1-1")
    (sheet (number 1) (name /) (tstamps /)
      (title_block
        (title "Music Shield")
        (company "(c) 2021 Andreas Messer")
        (rev r2)
        (date 2021-05-16)
        (source shield.sch)
        (comment (number 1) (value "Connectors, powersupply & additional parts"))
        (comment (number 2) (value ""))
        (comment (number 3) (value ""))
        (comment (number 4) (value ""))))
    (sheet (number 2) (name /MAX98089/) (tstamps /5F622C8F/)
      (title_block
        (title "Music Shield")
        (company "(c) 2021 Andreas Messer")
        (rev r2)
        (date 2021-05-13)
        (source max98089.sch)
        (comment (number 1) (value "Audio codec"))
        (comment (number 2) (value ""))
        (comment (number 3) (value ""))
        (comment (number 4) (value ""))))
    (sheet (number 3) (name /Si4688/) (tstamps /5F6294E6/)
      (title_block
        (title "Music Shield")
        (company "(c) 2021 Andreas Messer")
        (rev r2)
        (date 2021-05-13)
        (source si4688.sch)
        (comment (number 1) (value "Radio Receiver"))
        (comment (number 2) (value ""))
        (comment (number 3) (value ""))
        (comment (number 4) (value "")))))
  (components
    (comp (ref RN103)
      (value 10)
      (footprint Resistors_SMD:R_Array_Convex_4x0603)
      (datasheet ~)
      (libsource (lib Device) (part R_Pack04) (description "4 resistor network, parallel topology, DIP package"))
      (sheetpath (names /) (tstamps /))
      (tstamp 5F72109D))
    (comp (ref RN104)
      (value n.p.)
      (footprint Resistors_SMD:R_Array_Convex_4x0603)
      (datasheet ~)
      (libsource (lib Device) (part R_Pack04) (description "4 resistor network, parallel topology, DIP package"))
      (sheetpath (names /) (tstamps /))
      (tstamp 5F8C4AFC))
    (comp (ref A101)
      (value Arduino_UNO_R3)
      (footprint ProjectFootprints:ArduinoUNO_ProjectAdapted)
      (datasheet https://www.arduino.cc/en/Main/arduinoBoardUno)
      (libsource (lib MCU_Module) (part Arduino_UNO_R3) (description "Arduino UNO Microcontroller Module, release 3"))
      (sheetpath (names /) (tstamps /))
      (tstamp 5F723E96))
    (comp (ref D101)
      (value SL12)
      (footprint Diodes_SMD:D_SMA)
      (datasheet ~)
      (fields
        (field (name MPN) SL12))
      (libsource (lib Device) (part D) (description Diode))
      (sheetpath (names /) (tstamps /))
      (tstamp 5F7B739A))
    (comp (ref U102)
      (value PCAL6408APW)
      (footprint Housings_SSOP:TSSOP-16_4.4x5mm_Pitch0.65mm)
      (fields
        (field (name MPN) PCAL6408APW)
        (field (name Manufacturer) NXP))
      (libsource (lib ProjectSymbols) (part PCAL6408APW) (description ""))
      (sheetpath (names /) (tstamps /))
      (tstamp 5F74CF5C))
    (comp (ref Q101)
      (value IRLML6401)
      (footprint TO_SOT_Packages_SMD:SOT-23)
      (datasheet ~)
      (libsource (lib Device) (part Q_PMOS_GSD) (description "P-MOSFET transistor, gate/source/drain"))
      (sheetpath (names /) (tstamps /))
      (tstamp 5F8AA41F))
    (comp (ref C102)
      (value 10uF)
      (footprint Capacitors_SMD:C_0805)
      (datasheet ~)
      (libsource (lib Device) (part C) (description "Unpolarized capacitor"))
      (sheetpath (names /) (tstamps /))
      (tstamp 5F8B6A2D))
    (comp (ref C106)
      (value 1uF)
      (footprint Capacitors_SMD:C_0603)
      (datasheet ~)
      (libsource (lib Device) (part C) (description "Unpolarized capacitor"))
      (sheetpath (names /) (tstamps /))
      (tstamp 5F8BD398))
    (comp (ref C101)
      (value 10uF)
      (footprint Capacitors_SMD:C_0805)
      (datasheet ~)
      (libsource (lib Device) (part C) (description "Unpolarized capacitor"))
      (sheetpath (names /) (tstamps /))
      (tstamp 5F8BD5DF))
    (comp (ref R101)
      (value 100)
      (footprint Resistors_SMD:R_0603)
      (datasheet ~)
      (libsource (lib Device) (part R) (description Resistor))
      (sheetpath (names /) (tstamps /))
      (tstamp 5F9F38EC))
    (comp (ref J102)
      (value MicroSD)
      (footprint ProjectFootprints:Molex_SD-47309-201)
      (fields
        (field (name MPN) 47309-201)
        (field (name Manufacturer) Molex))
      (libsource (lib Connector) (part Micro_SD_Card_Det) (description "Micro SD Card Socket with card detection pins"))
      (sheetpath (names /) (tstamps /))
      (tstamp 5FAF84B1))
    (comp (ref R102)
      (value 1M)
      (footprint Resistors_SMD:R_0603)
      (datasheet ~)
      (libsource (lib Device) (part R) (description Resistor))
      (sheetpath (names /) (tstamps /))
      (tstamp 5FC354B3))
    (comp (ref C107)
      (value 10nF)
      (footprint Capacitors_SMD:C_0603)
      (datasheet ~)
      (libsource (lib Device) (part C) (description "Unpolarized capacitor"))
      (sheetpath (names /) (tstamps /))
      (tstamp 5FC354C8))
    (comp (ref U101)
      (value TPS79318-EP)
      (footprint TO_SOT_Packages_SMD:SOT-23-5)
      (datasheet http://www.ti.com/lit/ds/symlink/tps79333-ep.pdf)
      (fields
        (field (name MPN) TPS79318DBVR-Q1)
        (field (name Manufacturer) "Texas Instruments"))
      (libsource (lib Regulator_Linear) (part TPS79318-EP) (description "200mA UltraLow-Noise, High-Precision, Fast RF, Low Drop-out Voltage Regualtor, Fixed Output 1.8V, SOT-23"))
      (sheetpath (names /) (tstamps /))
      (tstamp 5FC33050))
    (comp (ref C103)
      (value 100nF)
      (footprint Capacitors_SMD:C_0603)
      (datasheet ~)
      (libsource (lib Device) (part C) (description "Unpolarized capacitor"))
      (sheetpath (names /) (tstamps /))
      (tstamp 5FDFF9A2))
    (comp (ref C104)
      (value 10uF)
      (footprint Capacitors_SMD:C_0805)
      (datasheet ~)
      (libsource (lib Device) (part C) (description "Unpolarized capacitor"))
      (sheetpath (names /) (tstamps /))
      (tstamp 5FDFFBE8))
    (comp (ref RN105)
      (value 100k)
      (footprint Resistors_SMD:R_Array_Convex_2x0402)
      (datasheet ~)
      (libsource (lib Device) (part R_Pack02) (description "2 resistor network, parallel topology, DIP package"))
      (sheetpath (names /) (tstamps /))
      (tstamp 605ED981))
    (comp (ref X101)
      (value Teensy_Small)
      (footprint ProjectFootprints:Module_Teensy_Small)
      (libsource (lib ProjectSymbols) (part Teensy_Small) (description ""))
      (sheetpath (names /) (tstamps /))
      (tstamp 5F7C5CB4))
    (comp (ref RN107)
      (value 100k)
      (footprint Resistors_SMD:R_Array_Convex_2x0402)
      (datasheet ~)
      (libsource (lib Device) (part R_Pack02) (description "2 resistor network, parallel topology, DIP package"))
      (sheetpath (names /) (tstamps /))
      (tstamp 5F7D5CA3))
    (comp (ref RN109)
      (value 100k)
      (footprint Resistors_SMD:R_Array_Convex_2x0402)
      (datasheet ~)
      (libsource (lib Device) (part R_Pack02) (description "2 resistor network, parallel topology, DIP package"))
      (sheetpath (names /) (tstamps /))
      (tstamp 5F7D5CE3))
    (comp (ref RN108)
      (value 3.3k)
      (footprint Resistors_SMD:R_Array_Convex_2x0402)
      (datasheet ~)
      (libsource (lib Device) (part R_Pack02) (description "2 resistor network, parallel topology, DIP package"))
      (sheetpath (names /) (tstamps /))
      (tstamp 5FA5B781))
    (comp (ref H101)
      (value M2)
      (footprint Mounting_Holes:MountingHole_2.2mm_M2_ISO7380)
      (datasheet ~)
      (libsource (lib Mechanical) (part MountingHole) (description "Mounting Hole without connection"))
      (sheetpath (names /) (tstamps /))
      (tstamp 5FB5E8C0))
    (comp (ref J101)
      (value ~)
      (footprint Pin_Headers:Pin_Header_Straight_1x01_Pitch2.54mm)
      (datasheet ~)
      (libsource (lib Connector_Generic) (part Conn_01x01) (description "Generic connector, single row, 01x01, script generated (kicad-library-utils/schlib/autogen/connector/)"))
      (sheetpath (names /) (tstamps /))
      (tstamp 5F8436A8))
    (comp (ref RN102)
      (value n.p)
      (footprint Resistors_SMD:R_Array_Convex_2x0603)
      (datasheet ~)
      (fields
        (field (name Comment) "Custom board MMC Bus"))
      (libsource (lib Device) (part R_Pack02) (description "2 resistor network, parallel topology, DIP package"))
      (sheetpath (names /) (tstamps /))
      (tstamp 5F85575B))
    (comp (ref C105)
      (value 100nF)
      (footprint Capacitors_SMD:C_0603)
      (datasheet ~)
      (libsource (lib Device) (part C) (description "Unpolarized capacitor"))
      (sheetpath (names /) (tstamps /))
      (tstamp 5F8B89BC))
    (comp (ref U103)
      (value 64CW1280)
      (footprint TO_SOT_Packages_SMD:SOT-23-5)
      (datasheet http://ww1.microchip.com/downloads/en/DeviceDoc/21709J.pdf)
      (libsource (lib Memory_EEPROM) (part 24AA02-OT) (description "I2C Serial EEPROM, 2Kb, SOT-23"))
      (sheetpath (names /) (tstamps /))
      (tstamp 5F955E5A))
    (comp (ref RN110)
      (value 10)
      (footprint Resistors_SMD:R_Array_Convex_4x0603)
      (datasheet ~)
      (libsource (lib Device) (part R_Pack04) (description "4 resistor network, parallel topology, DIP package"))
      (sheetpath (names /) (tstamps /))
      (tstamp 60A59A88))
    (comp (ref RN106)
      (value 10)
      (footprint Resistors_SMD:R_Array_Convex_4x0603)
      (datasheet ~)
      (libsource (lib Device) (part R_Pack04) (description "4 resistor network, parallel topology, DIP package"))
      (sheetpath (names /) (tstamps /))
      (tstamp 60A59D0C))
    (comp (ref RN101)
      (value 10k)
      (footprint Resistors_SMD:R_Array_Convex_2x0402)
      (datasheet ~)
      (libsource (lib Device) (part R_Pack02) (description "2 resistor network, parallel topology, DIP package"))
      (sheetpath (names /) (tstamps /))
      (tstamp 60D5996A))
    (comp (ref JP101)
      (value SolderJumper_2_Open)
      (footprint Jumper:SolderJumper-2_P1.3mm_Open_RoundedPad1.0x1.5mm)
      (datasheet ~)
      (libsource (lib Jumper) (part SolderJumper_2_Open) (description "Solder Jumper, 2-pole, open"))
      (sheetpath (names /) (tstamps /))
      (tstamp 5F821D4E))
    (comp (ref Q201)
      (value EM6K34)
      (footprint ProjectFootprints:SOT-563)
      (fields
        (field (name MPN) EM6K34)
        (field (name Manufacturer) Rohm))
      (libsource (lib ProjectSymbols) (part Q_DUAL_NMOS_S1G1D2S2G2D1) (description "Dual NMOS transistor, 6 pin package"))
      (sheetpath (names /) (tstamps /))
      (tstamp 60A46DDA))
    (comp (ref R207)
      (value 10k)
      (footprint Resistors_SMD:R_0402_NoSilk)
      (datasheet ~)
      (libsource (lib Device) (part R) (description Resistor))
      (sheetpath (names /) (tstamps /))
      (tstamp 60A46DEA))
    (comp (ref JP102)
      (value SolderJumper_2_Open)
      (footprint Jumper:SolderJumper-2_P1.3mm_Open_RoundedPad1.0x1.5mm)
      (datasheet ~)
      (libsource (lib Jumper) (part SolderJumper_2_Open) (description "Solder Jumper, 2-pole, open"))
      (sheetpath (names /) (tstamps /))
      (tstamp 60BC5DE8))
    (comp (ref C202)
      (value 1uF)
      (footprint Capacitors_SMD:C_0603)
      (datasheet ~)
      (libsource (lib Device) (part C) (description "Unpolarized capacitor"))
      (sheetpath (names /MAX98089/) (tstamps /5F622C8F/))
      (tstamp 5FF2275F))
    (comp (ref C207)
      (value 1uF)
      (footprint Capacitors_SMD:C_0603)
      (datasheet ~)
      (libsource (lib Device) (part C) (description "Unpolarized capacitor"))
      (sheetpath (names /MAX98089/) (tstamps /5F622C8F/))
      (tstamp 5FF22766))
    (comp (ref C201)
      (value 1uF)
      (footprint Capacitors_SMD:C_0603)
      (datasheet ~)
      (libsource (lib Device) (part C) (description "Unpolarized capacitor"))
      (sheetpath (names /MAX98089/) (tstamps /5F622C8F/))
      (tstamp 5FF2276D))
    (comp (ref X201)
      (value 12.288Mhz)
      (footprint Oscillators:Oscillator_SMD_SeikoEpson_SG210-4pin_2.5x2.0mm)
      (datasheet https://support.epson.biz/td/api/doc_check.php?mode=dl&lang=en&Parts=SG-210SED)
      (fields
        (field (name MPN) "SG-210STF 12.2880ML")
        (field (name Manufacturer) "Epson Timing"))
      (libsource (lib Oscillator) (part SG-210SCD) (description "Crystal Oscillator Low Profile / High Stability SPXO"))
      (sheetpath (names /MAX98089/) (tstamps /5F622C8F/))
      (tstamp 5FF227BF))
    (comp (ref C209)
      (value 1uF)
      (footprint Capacitors_SMD:C_0603)
      (datasheet ~)
      (libsource (lib Device) (part C) (description "Unpolarized capacitor"))
      (sheetpath (names /MAX98089/) (tstamps /5F622C8F/))
      (tstamp 5FF227F1))
    (comp (ref C212)
      (value 1uF)
      (footprint Capacitors_SMD:C_0603)
      (datasheet ~)
      (libsource (lib Device) (part C) (description "Unpolarized capacitor"))
      (sheetpath (names /MAX98089/) (tstamps /5F622C8F/))
      (tstamp 5FF22809))
    (comp (ref C218)
      (value 470µF)
      (footprint Capacitors_ThroughHole:CP_Radial_D6.3mm_P2.50mm)
      (datasheet ~)
      (libsource (lib Device) (part CP) (description "Polarized capacitor"))
      (sheetpath (names /MAX98089/) (tstamps /5F622C8F/))
      (tstamp 5FF22815))
    (comp (ref C205)
      (value 1uF)
      (footprint Capacitors_SMD:C_0603)
      (datasheet ~)
      (libsource (lib Device) (part C) (description "Unpolarized capacitor"))
      (sheetpath (names /MAX98089/) (tstamps /5F622C8F/))
      (tstamp 5FF22829))
    (comp (ref C206)
      (value 1uF)
      (footprint Capacitors_SMD:C_0603)
      (datasheet ~)
      (libsource (lib Device) (part C) (description "Unpolarized capacitor"))
      (sheetpath (names /MAX98089/) (tstamps /5F622C8F/))
      (tstamp 5FF22834))
    (comp (ref C204)
      (value 1uF)
      (footprint Capacitors_SMD:C_0603)
      (datasheet ~)
      (libsource (lib Device) (part C) (description "Unpolarized capacitor"))
      (sheetpath (names /MAX98089/) (tstamps /5F622C8F/))
      (tstamp 5FF2283B))
    (comp (ref C203)
      (value 10uF)
      (footprint Capacitors_SMD:C_0805)
      (datasheet ~)
      (libsource (lib Device) (part C) (description "Unpolarized capacitor"))
      (sheetpath (names /MAX98089/) (tstamps /5F622C8F/))
      (tstamp 5FF2284A))
    (comp (ref R202)
      (value 2.2k)
      (footprint Resistors_SMD:R_0603)
      (datasheet ~)
      (libsource (lib Device) (part R) (description Resistor))
      (sheetpath (names /MAX98089/) (tstamps /5F622C8F/))
      (tstamp 5FF2285F))
    (comp (ref C214)
      (value 1uF)
      (footprint Capacitors_SMD:C_1210)
      (datasheet ~)
      (fields
        (field (name Comment) "film capacitor")
        (field (name MPN) ECP-U1C105MA5))
      (libsource (lib Device) (part C) (description "Unpolarized capacitor"))
      (sheetpath (names /MAX98089/) (tstamps /5F622C8F/))
      (tstamp 5FF22868))
    (comp (ref C208)
      (value 1uF)
      (footprint Capacitors_SMD:C_0603)
      (datasheet ~)
      (libsource (lib Device) (part C) (description "Unpolarized capacitor"))
      (sheetpath (names /MAX98089/) (tstamps /5F622C8F/))
      (tstamp 5FF2286F))
    (comp (ref C210)
      (value 2.2uF)
      (footprint Capacitors_SMD:C_0603)
      (datasheet ~)
      (libsource (lib Device) (part C) (description "Unpolarized capacitor"))
      (sheetpath (names /MAX98089/) (tstamps /5F622C8F/))
      (tstamp 5FF2287D))
    (comp (ref C213)
      (value 1uF)
      (footprint Capacitors_SMD:C_0603)
      (datasheet ~)
      (libsource (lib Device) (part C) (description "Unpolarized capacitor"))
      (sheetpath (names /MAX98089/) (tstamps /5F622C8F/))
      (tstamp 5FF2288B))
    (comp (ref U201)
      (value MAX98089)
      (footprint Housings_DFN_QFN:QFN-56-1EP_7x7mm_Pitch0.4mm)
      (fields
        (field (name MPN) MAX98089ETN+)
        (field (name Manufacturer) Maxim))
      (libsource (lib ProjectSymbols) (part MAX98089) (description ""))
      (sheetpath (names /MAX98089/) (tstamps /5F622C8F/))
      (tstamp 5FF228CB))
    (comp (ref FB203)
      (value 1kOhm@100Mhz)
      (footprint Resistors_SMD:R_0402)
      (datasheet ~)
      (fields
        (field (name MPN) BLM15HG102SN1D)
        (field (name Manufacturer) Murata))
      (libsource (lib Device) (part Ferrite_Bead_Small) (description "Ferrite bead, small symbol"))
      (sheetpath (names /MAX98089/) (tstamps /5F622C8F/))
      (tstamp 5FF228E4))
    (comp (ref C211)
      (value 10pF)
      (footprint Capacitors_SMD:C_0402_NoSilk)
      (datasheet ~)
      (libsource (lib Device) (part C) (description "Unpolarized capacitor"))
      (sheetpath (names /MAX98089/) (tstamps /5F622C8F/))
      (tstamp 5FF228F0))
    (comp (ref FB202)
      (value 1kOhm@100Mhz)
      (footprint Resistors_SMD:R_0402)
      (datasheet ~)
      (fields
        (field (name MPN) BLM15HG102SN1D)
        (field (name Manufacturer) Murata))
      (libsource (lib Device) (part Ferrite_Bead_Small) (description "Ferrite bead, small symbol"))
      (sheetpath (names /MAX98089/) (tstamps /5F622C8F/))
      (tstamp 5FF2290A))
    (comp (ref FB201)
      (value 1kOhm@100Mhz)
      (footprint Resistors_SMD:R_0402)
      (datasheet ~)
      (fields
        (field (name MPN) BLM15HG102SN1D)
        (field (name Manufacturer) Murata))
      (libsource (lib Device) (part Ferrite_Bead_Small) (description "Ferrite bead, small symbol"))
      (sheetpath (names /MAX98089/) (tstamps /5F622C8F/))
      (tstamp 5FF22912))
    (comp (ref C217)
      (value 10pF)
      (footprint Capacitors_SMD:C_0402_NoSilk)
      (datasheet ~)
      (libsource (lib Device) (part C) (description "Unpolarized capacitor"))
      (sheetpath (names /MAX98089/) (tstamps /5F622C8F/))
      (tstamp 5FF2291D))
    (comp (ref C216)
      (value 10pF)
      (footprint Capacitors_SMD:C_0402_NoSilk)
      (datasheet ~)
      (libsource (lib Device) (part C) (description "Unpolarized capacitor"))
      (sheetpath (names /MAX98089/) (tstamps /5F622C8F/))
      (tstamp 5FF22924))
    (comp (ref J201)
      (value AudioJack)
      (footprint ProjectFootprints:CUI_SJ-4351x)
      (datasheet ~)
      (libsource (lib ProjectSymbols) (part AudioJack) (description "Audio Jack, 4 Poles (TRRS)"))
      (sheetpath (names /MAX98089/) (tstamps /5F622C8F/))
      (tstamp 603C2A39))
    (comp (ref C219)
      (value 1uF)
      (footprint Capacitors_SMD:C_0603)
      (datasheet ~)
      (libsource (lib Device) (part C) (description "Unpolarized capacitor"))
      (sheetpath (names /MAX98089/) (tstamps /5F622C8F/))
      (tstamp 5F7F5D65))
    (comp (ref L201)
      (value 4.7uH)
      (footprint ProjectFootprints:L_Murata_LQH3N)
      (datasheet ~)
      (fields
        (field (name MPN) LQH3NPH4R7MME)
        (field (name Manufacturer) Murata))
      (libsource (lib Device) (part L_Core_Ferrite_Small) (description "Inductor with ferrite core, small symbol"))
      (sheetpath (names /MAX98089/) (tstamps /5F622C8F/))
      (tstamp 5F7FB10C))
    (comp (ref R203)
      (value 2.2)
      (footprint Resistors_SMD:R_0603)
      (datasheet ~)
      (libsource (lib Device) (part R) (description Resistor))
      (sheetpath (names /MAX98089/) (tstamps /5F622C8F/))
      (tstamp 5F8006F2))
    (comp (ref R204)
      (value 2.2)
      (footprint Resistors_SMD:R_0603)
      (datasheet ~)
      (libsource (lib Device) (part R) (description Resistor))
      (sheetpath (names /MAX98089/) (tstamps /5F622C8F/))
      (tstamp 5F805DFE))
    (comp (ref C220)
      (value 1uF)
      (footprint Capacitors_SMD:C_0603)
      (datasheet ~)
      (libsource (lib Device) (part C) (description "Unpolarized capacitor"))
      (sheetpath (names /MAX98089/) (tstamps /5F622C8F/))
      (tstamp 5F805E87))
    (comp (ref C223)
      (value 1uF)
      (footprint Capacitors_SMD:C_0603)
      (datasheet ~)
      (libsource (lib Device) (part C) (description "Unpolarized capacitor"))
      (sheetpath (names /MAX98089/) (tstamps /5F622C8F/))
      (tstamp 5F80B27D))
    (comp (ref C221)
      (value 1uF)
      (footprint Capacitors_SMD:C_0603)
      (datasheet ~)
      (libsource (lib Device) (part C) (description "Unpolarized capacitor"))
      (sheetpath (names /MAX98089/) (tstamps /5F622C8F/))
      (tstamp 5F854225))
    (comp (ref R205)
      (value 2.2)
      (footprint Resistors_SMD:R_0603)
      (datasheet ~)
      (libsource (lib Device) (part R) (description Resistor))
      (sheetpath (names /MAX98089/) (tstamps /5F622C8F/))
      (tstamp 5F854234))
    (comp (ref R206)
      (value 2.2)
      (footprint Resistors_SMD:R_0603)
      (datasheet ~)
      (libsource (lib Device) (part R) (description Resistor))
      (sheetpath (names /MAX98089/) (tstamps /5F622C8F/))
      (tstamp 5F85423B))
    (comp (ref C222)
      (value 1uF)
      (footprint Capacitors_SMD:C_0603)
      (datasheet ~)
      (libsource (lib Device) (part C) (description "Unpolarized capacitor"))
      (sheetpath (names /MAX98089/) (tstamps /5F622C8F/))
      (tstamp 5F854242))
    (comp (ref C224)
      (value 1uF)
      (footprint Capacitors_SMD:C_0603)
      (datasheet ~)
      (libsource (lib Device) (part C) (description "Unpolarized capacitor"))
      (sheetpath (names /MAX98089/) (tstamps /5F622C8F/))
      (tstamp 5F854251))
    (comp (ref J202)
      (value Speaker)
      (footprint ProjectFootprints:PhoenixContact_PT_1.5-4-3.5-H)
      (datasheet ~)
      (libsource (lib Connector) (part Screw_Terminal_01x04) (description "Generic screw terminal, single row, 01x04, script generated (kicad-library-utils/schlib/autogen/connector/)"))
      (sheetpath (names /MAX98089/) (tstamps /5F622C8F/))
      (tstamp 5F8718FA))
    (comp (ref L202)
      (value 4.7uH)
      (footprint ProjectFootprints:L_Murata_LQH3N)
      (datasheet ~)
      (fields
        (field (name MPN) LQH3NPH4R7MME)
        (field (name Manufacturer) Murata))
      (libsource (lib Device) (part L_Core_Ferrite_Small) (description "Inductor with ferrite core, small symbol"))
      (sheetpath (names /MAX98089/) (tstamps /5F622C8F/))
      (tstamp 5F890CAD))
    (comp (ref L203)
      (value 4.7uH)
      (footprint ProjectFootprints:L_Murata_LQH3N)
      (datasheet ~)
      (fields
        (field (name MPN) LQH3NPH4R7MME)
        (field (name Manufacturer) Murata))
      (libsource (lib Device) (part L_Core_Ferrite_Small) (description "Inductor with ferrite core, small symbol"))
      (sheetpath (names /MAX98089/) (tstamps /5F622C8F/))
      (tstamp 5F890D25))
    (comp (ref L204)
      (value 4.7uH)
      (footprint ProjectFootprints:L_Murata_LQH3N)
      (datasheet ~)
      (fields
        (field (name MPN) LQH3NPH4R7MME)
        (field (name Manufacturer) Murata))
      (libsource (lib Device) (part L_Core_Ferrite_Small) (description "Inductor with ferrite core, small symbol"))
      (sheetpath (names /MAX98089/) (tstamps /5F622C8F/))
      (tstamp 5F890D83))
    (comp (ref R201)
      (value 22)
      (footprint Resistors_SMD:R_0402_NoSilk)
      (datasheet ~)
      (libsource (lib Device) (part R) (description Resistor))
      (sheetpath (names /MAX98089/) (tstamps /5F622C8F/))
      (tstamp 5F8AB68C))
    (comp (ref JP201)
      (value SolderJumper_2_Bridged)
      (footprint Jumper:SolderJumper-2_P1.3mm_Bridged_RoundedPad1.0x1.5mm)
      (datasheet ~)
      (libsource (lib Jumper) (part SolderJumper_2_Bridged) (description "Solder Jumper, 2-pole, closed/bridged"))
      (sheetpath (names /MAX98089/) (tstamps /5F622C8F/))
      (tstamp 5F86F86F))
    (comp (ref C215)
      (value 10uF)
      (footprint Capacitors_SMD:C_0805)
      (datasheet ~)
      (libsource (lib Device) (part C) (description "Unpolarized capacitor"))
      (sheetpath (names /MAX98089/) (tstamps /5F622C8F/))
      (tstamp 5F847308))
    (comp (ref L303)
      (value 22nH)
      (footprint Resistors_SMD:R_0402_NoSilk)
      (datasheet ~)
      (libsource (lib Device) (part L) (description Inductor))
      (sheetpath (names /Si4688/) (tstamps /5F6294E6/))
      (tstamp 558C8089))
    (comp (ref L302)
      (value 120nH)
      (footprint Resistors_SMD:R_0402_NoSilk)
      (datasheet ~)
      (libsource (lib Device) (part L) (description Inductor))
      (sheetpath (names /Si4688/) (tstamps /5F6294E6/))
      (tstamp 558C816A))
    (comp (ref C303)
      (value 2.7pF)
      (footprint Capacitors_SMD:C_0402_NoSilk)
      (datasheet ~)
      (libsource (lib Device) (part C) (description "Unpolarized capacitor"))
      (sheetpath (names /Si4688/) (tstamps /5F6294E6/))
      (tstamp 558C83F6))
    (comp (ref L301)
      (value 18nH)
      (footprint Resistors_SMD:R_0402_NoSilk)
      (datasheet ~)
      (libsource (lib Device) (part L) (description Inductor))
      (sheetpath (names /Si4688/) (tstamps /5F6294E6/))
      (tstamp 558C8401))
    (comp (ref C302)
      (value 33pF)
      (footprint Capacitors_SMD:C_0402_NoSilk)
      (datasheet ~)
      (libsource (lib Device) (part C) (description "Unpolarized capacitor"))
      (sheetpath (names /Si4688/) (tstamps /5F6294E6/))
      (tstamp 558C856A))
    (comp (ref D301)
      (value CM1213A-01SO)
      (footprint TO_SOT_Packages_SMD:SOT-23)
      (datasheet http://www.onsemi.com/pub_link/Collateral/CM1213A-D.PDF)
      (libsource (lib Power_Protection) (part CM1213A-01SO) (description "Single Channel ESD Protection Array"))
      (sheetpath (names /Si4688/) (tstamps /5F6294E6/))
      (tstamp 5F73B3BA))
    (comp (ref FB301)
      (value 1kOhm@100Mhz)
      (footprint Resistors_SMD:R_0402)
      (datasheet ~)
      (fields
        (field (name MPN) BLM15HG102SN1D)
        (field (name Manufacturer) Murata))
      (libsource (lib Device) (part Ferrite_Bead_Small) (description "Ferrite bead, small symbol"))
      (sheetpath (names /Si4688/) (tstamps /5F6294E6/))
      (tstamp 5F7C1618))
    (comp (ref C305)
      (value "100nF LESL")
      (footprint ProjectFootprints:C_0204)
      (datasheet ~)
      (fields
        (field (name MPN) LWK105C7104MP-F))
      (libsource (lib Device) (part C) (description "Unpolarized capacitor"))
      (sheetpath (names /Si4688/) (tstamps /5F6294E6/))
      (tstamp 5F7C1D27))
    (comp (ref C304)
      (value "100nF LESL")
      (footprint ProjectFootprints:C_0204)
      (datasheet ~)
      (fields
        (field (name MPN) LWK105C7104MP-F))
      (libsource (lib Device) (part C) (description "Unpolarized capacitor"))
      (sheetpath (names /Si4688/) (tstamps /5F6294E6/))
      (tstamp 5F7E0233))
    (comp (ref Y301)
      (value 19.2Mhz)
      (footprint Crystals:Crystal_SMD_3225-4pin_3.2x2.5mm)
      (datasheet ~)
      (fields
        (field (name Comment) "<12pF Load, ESR <250Ohm"))
      (libsource (lib Device) (part Crystal_GND24) (description "Four pin crystal, GND on pins 2 and 4"))
      (sheetpath (names /Si4688/) (tstamps /5F6294E6/))
      (tstamp 5F85EE57))
    (comp (ref U301)
      (value SI4688-A10-GM)
      (footprint Housings_DFN_QFN:QFN-48-1EP_7x7mm_Pitch0.5mm)
      (fields
        (field (name MPN) Si4688-A10-GM)
        (field (name Manufacturer) "Silicon Labs"))
      (libsource (lib ProjectSymbols) (part SI4688-A10-GM) (description ""))
      (sheetpath (names /Si4688/) (tstamps /5F6294E6/))
      (tstamp 5F6E6E7F))
    (comp (ref U302)
      (value SST26WF016B-104I/SN)
      (footprint Housings_SOIC:SOIC-8_3.9x4.9mm_Pitch1.27mm)
      (fields
        (field (name MPN) SST26WF016B-104I/SN)
        (field (name Manufacturer) Microchip))
      (libsource (lib ProjectSymbols) (part SerialFlash_SOIC) (description ""))
      (sheetpath (names /Si4688/) (tstamps /5F6294E6/))
      (tstamp 5F986F0E))
    (comp (ref C306)
      (value "100nF LESL")
      (footprint ProjectFootprints:C_0204)
      (datasheet ~)
      (fields
        (field (name MPN) LWK105C7104MP-F))
      (libsource (lib Device) (part C) (description "Unpolarized capacitor"))
      (sheetpath (names /Si4688/) (tstamps /5F6294E6/))
      (tstamp 5FA8C178))
    (comp (ref C308)
      (value "100nF LESL")
      (footprint ProjectFootprints:C_0204)
      (datasheet ~)
      (fields
        (field (name MPN) LWK105C7104MP-F))
      (libsource (lib Device) (part C) (description "Unpolarized capacitor"))
      (sheetpath (names /Si4688/) (tstamps /5F6294E6/))
      (tstamp 5FA8C5FC))
    (comp (ref C307)
      (value 1uF)
      (footprint Capacitors_SMD:C_0603)
      (datasheet ~)
      (libsource (lib Device) (part C) (description "Unpolarized capacitor"))
      (sheetpath (names /Si4688/) (tstamps /5F6294E6/))
      (tstamp 5FB46B93))
    (comp (ref C309)
      (value 1uF)
      (footprint Capacitors_SMD:C_0603)
      (datasheet ~)
      (libsource (lib Device) (part C) (description "Unpolarized capacitor"))
      (sheetpath (names /Si4688/) (tstamps /5F6294E6/))
      (tstamp 5F70E347))
    (comp (ref J301)
      (value SMA)
      (footprint ProjectFootprints:MOLEX_SMA_JACK_73251)
      (datasheet " ~")
      (fields
        (field (name MPN) 73251)
        (field (name Manufacturer) Molex))
      (libsource (lib Connector) (part Conn_Coaxial) (description "coaxial connector (BNC, SMA, SMB, SMC, Cinch/RCA, ...)"))
      (sheetpath (names /Si4688/) (tstamps /5F6294E6/))
      (tstamp 5F8AB6CA))
    (comp (ref R301)
      (value 1M)
      (footprint Resistors_SMD:R_0603)
      (datasheet ~)
      (libsource (lib Device) (part R) (description Resistor))
      (sheetpath (names /Si4688/) (tstamps /5F6294E6/))
      (tstamp 5F8B4F55))
    (comp (ref C301)
      (value 10nF)
      (footprint Capacitors_SMD:C_0603)
      (datasheet ~)
      (libsource (lib Device) (part C) (description "Unpolarized capacitor"))
      (sheetpath (names /Si4688/) (tstamps /5F6294E6/))
      (tstamp 5F922935))
    (comp (ref R303)
      (value 22)
      (footprint Resistors_SMD:R_0402_NoSilk)
      (datasheet ~)
      (libsource (lib Device) (part R) (description Resistor))
      (sheetpath (names /Si4688/) (tstamps /5F6294E6/))
      (tstamp 5F8E2150))
    (comp (ref R304)
      (value 22)
      (footprint Resistors_SMD:R_0402_NoSilk)
      (datasheet ~)
      (libsource (lib Device) (part R) (description Resistor))
      (sheetpath (names /Si4688/) (tstamps /5F6294E6/))
      (tstamp 5F8E8030))
    (comp (ref R305)
      (value 22)
      (footprint Resistors_SMD:R_0402_NoSilk)
      (datasheet ~)
      (libsource (lib Device) (part R) (description Resistor))
      (sheetpath (names /Si4688/) (tstamps /5F6294E6/))
      (tstamp 5F8E807A))
    (comp (ref Q301)
      (value EM6K34)
      (footprint ProjectFootprints:SOT-563)
      (fields
        (field (name MPN) EM6K34)
        (field (name Manufacturer) Rohm))
      (libsource (lib ProjectSymbols) (part Q_DUAL_NMOS_S1G1D2S2G2D1) (description "Dual NMOS transistor, 6 pin package"))
      (sheetpath (names /Si4688/) (tstamps /5F6294E6/))
      (tstamp 5F8236A2))
    (comp (ref C310)
      (value 100nF)
      (footprint Capacitors_SMD:C_0603)
      (datasheet ~)
      (libsource (lib Device) (part C) (description "Unpolarized capacitor"))
      (sheetpath (names /Si4688/) (tstamps /5F6294E6/))
      (tstamp 5F852AD9))
    (comp (ref RN302)
      (value 10k)
      (footprint Resistors_SMD:R_Array_Convex_2x0402)
      (datasheet ~)
      (libsource (lib Device) (part R_Pack02) (description "2 resistor network, parallel topology, DIP package"))
      (sheetpath (names /Si4688/) (tstamps /5F6294E6/))
      (tstamp 60D51CFC))
    (comp (ref RN301)
      (value 3.3k)
      (footprint Resistors_SMD:R_Array_Convex_2x0402)
      (datasheet ~)
      (libsource (lib ProjectSymbols) (part R_Pack02_Crossed) (description "2 resistor network, parallel topology, DIP package"))
      (sheetpath (names /Si4688/) (tstamps /5F6294E6/))
      (tstamp 60B2A5C9)))
  (libparts
    (libpart (lib Connector) (part Conn_Coaxial)
      (description "coaxial connector (BNC, SMA, SMB, SMC, Cinch/RCA, ...)")
      (docs " ~")
      (footprints
        (fp *BNC*)
        (fp *SMA*)
        (fp *SMB*)
        (fp *SMC*)
        (fp *Cinch*))
      (fields
        (field (name Reference) J)
        (field (name Value) Conn_Coaxial))
      (pins
        (pin (num 1) (name In) (type passive))
        (pin (num 2) (name Ext) (type passive))))
    (libpart (lib Connector) (part Micro_SD_Card_Det)
      (aliases
        (alias Micro_SD_Card_Det_Hirose_DM3AT))
      (description "Micro SD Card Socket with card detection pins")
      (docs https://www.hirose.com/product/en/download_file/key_name/DM3/category/Catalog/doc_file_id/49662/?file_category_id=4&item_id=195&is_series=1)
      (footprints
        (fp microSD*))
      (fields
        (field (name Reference) J)
        (field (name Value) Micro_SD_Card_Det))
      (pins
        (pin (num 1) (name DAT2) (type BiDi))
        (pin (num 2) (name DAT3/CD) (type BiDi))
        (pin (num 3) (name CMD) (type input))
        (pin (num 4) (name VDD) (type power_in))
        (pin (num 5) (name CLK) (type input))
        (pin (num 6) (name VSS) (type power_in))
        (pin (num 7) (name DAT0) (type input))
        (pin (num 8) (name DAT1) (type input))
        (pin (num 9) (name DET_B) (type passive))
        (pin (num 10) (name DET_A) (type passive))
        (pin (num 11) (name SHIELD) (type passive))))
    (libpart (lib Connector) (part Screw_Terminal_01x04)
      (description "Generic screw terminal, single row, 01x04, script generated (kicad-library-utils/schlib/autogen/connector/)")
      (docs ~)
      (footprints
        (fp TerminalBlock*:*))
      (fields
        (field (name Reference) J)
        (field (name Value) Screw_Terminal_01x04))
      (pins
        (pin (num 1) (name Pin_1) (type passive))
        (pin (num 2) (name Pin_2) (type passive))
        (pin (num 3) (name Pin_3) (type passive))
        (pin (num 4) (name Pin_4) (type passive))))
    (libpart (lib Connector_Generic) (part Conn_01x01)
      (description "Generic connector, single row, 01x01, script generated (kicad-library-utils/schlib/autogen/connector/)")
      (docs ~)
      (footprints
        (fp Connector*:*))
      (fields
        (field (name Reference) J)
        (field (name Value) Conn_01x01))
      (pins
        (pin (num 1) (name Pin_1) (type passive))))
    (libpart (lib Device) (part C)
      (description "Unpolarized capacitor")
      (docs ~)
      (footprints
        (fp C_*))
      (fields
        (field (name Reference) C)
        (field (name Value) C))
      (pins
        (pin (num 1) (name ~) (type passive))
        (pin (num 2) (name ~) (type passive))))
    (libpart (lib Device) (part CP)
      (description "Polarized capacitor")
      (docs ~)
      (footprints
        (fp CP_*))
      (fields
        (field (name Reference) C)
        (field (name Value) CP))
      (pins
        (pin (num 1) (name ~) (type passive))
        (pin (num 2) (name ~) (type passive))))
    (libpart (lib Device) (part Crystal_GND24)
      (description "Four pin crystal, GND on pins 2 and 4")
      (docs ~)
      (footprints
        (fp Crystal*))
      (fields
        (field (name Reference) Y)
        (field (name Value) Crystal_GND24))
      (pins
        (pin (num 1) (name 1) (type passive))
        (pin (num 2) (name 2) (type passive))
        (pin (num 3) (name 3) (type passive))
        (pin (num 4) (name 4) (type passive))))
    (libpart (lib Device) (part D)
      (description Diode)
      (docs ~)
      (footprints
        (fp TO-???*)
        (fp *_Diode_*)
        (fp *SingleDiode*)
        (fp D_*))
      (fields
        (field (name Reference) D)
        (field (name Value) D))
      (pins
        (pin (num 1) (name K) (type passive))
        (pin (num 2) (name A) (type passive))))
    (libpart (lib Device) (part Ferrite_Bead_Small)
      (description "Ferrite bead, small symbol")
      (docs ~)
      (footprints
        (fp Inductor_*)
        (fp L_*)
        (fp *Ferrite*))
      (fields
        (field (name Reference) FB)
        (field (name Value) Ferrite_Bead_Small))
      (pins
        (pin (num 1) (name ~) (type passive))
        (pin (num 2) (name ~) (type passive))))
    (libpart (lib Device) (part L)
      (description Inductor)
      (docs ~)
      (footprints
        (fp Choke_*)
        (fp *Coil*)
        (fp Inductor_*)
        (fp L_*))
      (fields
        (field (name Reference) L)
        (field (name Value) L))
      (pins
        (pin (num 1) (name 1) (type passive))
        (pin (num 2) (name 2) (type passive))))
    (libpart (lib Device) (part L_Core_Ferrite_Small)
      (description "Inductor with ferrite core, small symbol")
      (docs ~)
      (footprints
        (fp Choke_*)
        (fp *Coil*)
        (fp Inductor_*)
        (fp L_*))
      (fields
        (field (name Reference) L)
        (field (name Value) L_Core_Ferrite_Small))
      (pins
        (pin (num 1) (name ~) (type passive))
        (pin (num 2) (name ~) (type passive))))
    (libpart (lib Device) (part Q_PMOS_GSD)
      (description "P-MOSFET transistor, gate/source/drain")
      (docs ~)
      (fields
        (field (name Reference) Q)
        (field (name Value) Q_PMOS_GSD))
      (pins
        (pin (num 1) (name G) (type input))
        (pin (num 2) (name S) (type passive))
        (pin (num 3) (name D) (type passive))))
    (libpart (lib Device) (part R)
      (description Resistor)
      (docs ~)
      (footprints
        (fp R_*))
      (fields
        (field (name Reference) R)
        (field (name Value) R))
      (pins
        (pin (num 1) (name ~) (type passive))
        (pin (num 2) (name ~) (type passive))))
    (libpart (lib Device) (part R_Pack02)
      (description "2 resistor network, parallel topology, DIP package")
      (docs ~)
      (footprints
        (fp DIP*)
        (fp SOIC*))
      (fields
        (field (name Reference) RN)
        (field (name Value) R_Pack02))
      (pins
        (pin (num 1) (name R1.1) (type passive))
        (pin (num 2) (name R2.1) (type passive))
        (pin (num 3) (name R2.2) (type passive))
        (pin (num 4) (name R1.2) (type passive))))
    (libpart (lib Device) (part R_Pack04)
      (description "4 resistor network, parallel topology, DIP package")
      (docs ~)
      (footprints
        (fp DIP*)
        (fp SOIC*))
      (fields
        (field (name Reference) RN)
        (field (name Value) R_Pack04))
      (pins
        (pin (num 1) (name R1.1) (type passive))
        (pin (num 2) (name R2.1) (type passive))
        (pin (num 3) (name R3.1) (type passive))
        (pin (num 4) (name R4.1) (type passive))
        (pin (num 5) (name R4.2) (type passive))
        (pin (num 6) (name R3.2) (type passive))
        (pin (num 7) (name R2.2) (type passive))
        (pin (num 8) (name R1.2) (type passive))))
    (libpart (lib Jumper) (part SolderJumper_2_Bridged)
      (description "Solder Jumper, 2-pole, closed/bridged")
      (docs ~)
      (footprints
        (fp SolderJumper*Bridged*))
      (fields
        (field (name Reference) JP)
        (field (name Value) SolderJumper_2_Bridged))
      (pins
        (pin (num 1) (name A) (type passive))
        (pin (num 2) (name B) (type passive))))
    (libpart (lib Jumper) (part SolderJumper_2_Open)
      (description "Solder Jumper, 2-pole, open")
      (docs ~)
      (footprints
        (fp SolderJumper*Open*))
      (fields
        (field (name Reference) JP)
        (field (name Value) SolderJumper_2_Open))
      (pins
        (pin (num 1) (name A) (type passive))
        (pin (num 2) (name B) (type passive))))
    (libpart (lib MCU_Module) (part Arduino_UNO_R3)
      (description "Arduino UNO Microcontroller Module, release 3")
      (docs https://www.arduino.cc/en/Main/arduinoBoardUno)
      (footprints
        (fp Arduino*UNO*R3*))
      (fields
        (field (name Reference) A)
        (field (name Value) Arduino_UNO_R3)
        (field (name Footprint) Module:Arduino_UNO_R3))
      (pins
        (pin (num 1) (name NC) (type NotConnected))
        (pin (num 2) (name IOREF) (type output))
        (pin (num 3) (name RESET) (type input))
        (pin (num 4) (name 3V3) (type power_out))
        (pin (num 5) (name +5V) (type power_out))
        (pin (num 6) (name GND) (type power_in))
        (pin (num 7) (name GND) (type power_in))
        (pin (num 8) (name VIN) (type power_in))
        (pin (num 9) (name A0) (type BiDi))
        (pin (num 10) (name A1) (type BiDi))
        (pin (num 11) (name A2) (type BiDi))
        (pin (num 12) (name A3) (type BiDi))
        (pin (num 13) (name A4/SDA) (type BiDi))
        (pin (num 14) (name A5/SCL) (type BiDi))
        (pin (num 15) (name D0/RX) (type BiDi))
        (pin (num 16) (name D1/TX) (type BiDi))
        (pin (num 17) (name D2) (type BiDi))
        (pin (num 18) (name D3) (type BiDi))
        (pin (num 19) (name D4) (type BiDi))
        (pin (num 20) (name D5) (type BiDi))
        (pin (num 21) (name D6) (type BiDi))
        (pin (num 22) (name D7) (type BiDi))
        (pin (num 23) (name D8) (type BiDi))
        (pin (num 24) (name D9) (type BiDi))
        (pin (num 25) (name D10) (type BiDi))
        (pin (num 26) (name D11) (type BiDi))
        (pin (num 27) (name D12) (type BiDi))
        (pin (num 28) (name D13) (type BiDi))
        (pin (num 29) (name GND) (type power_in))
        (pin (num 30) (name AREF) (type input))
        (pin (num 31) (name SDA) (type BiDi))
        (pin (num 32) (name SCL) (type BiDi))))
    (libpart (lib Mechanical) (part MountingHole)
      (description "Mounting Hole without connection")
      (docs ~)
      (footprints
        (fp MountingHole*))
      (fields
        (field (name Reference) H)
        (field (name Value) MountingHole)))
    (libpart (lib Memory_EEPROM) (part 24AA02-OT)
      (description "I2C Serial EEPROM, 2Kb, SOT-23")
      (docs http://ww1.microchip.com/downloads/en/DeviceDoc/21709J.pdf)
      (footprints
        (fp SOT?23*))
      (fields
        (field (name Reference) U)
        (field (name Value) 24AA02-OT)
        (field (name Footprint) Package_TO_SOT_SMD:SOT-23-5))
      (pins
        (pin (num 1) (name SCL) (type input))
        (pin (num 2) (name GND) (type power_in))
        (pin (num 3) (name SDA) (type BiDi))
        (pin (num 4) (name VCC) (type power_in))
        (pin (num 5) (name NC) (type NotConnected))))
    (libpart (lib Oscillator) (part SG-210SED)
      (aliases
        (alias SG-210SDD)
        (alias SG-210SCD))
      (description "Crystal Oscillator Low Profile / High Stability SPXO")
      (docs https://support.epson.biz/td/api/doc_check.php?mode=dl&lang=en&Parts=SG-210SED)
      (footprints
        (fp Oscillator*SMD*SeikoEpson*SG210*2.5x2.0mm*))
      (fields
        (field (name Reference) X)
        (field (name Value) SG-210SED)
        (field (name Footprint) Oscillator:Oscillator_SMD_SeikoEpson_SG210-4Pin_2.5x2.0mm))
      (pins
        (pin (num 1) (name OE) (type input))
        (pin (num 2) (name GND) (type power_in))
        (pin (num 3) (name OUT) (type output))
        (pin (num 4) (name Vcc) (type power_in))))
    (libpart (lib Power_Protection) (part CM1213A-01SO)
      (description "Single Channel ESD Protection Array")
      (docs http://www.onsemi.com/pub_link/Collateral/CM1213A-D.PDF)
      (footprints
        (fp SOT?23*))
      (fields
        (field (name Reference) D)
        (field (name Value) CM1213A-01SO)
        (field (name Footprint) Package_TO_SOT_SMD:SOT-23))
      (pins
        (pin (num 1) (name CH1) (type passive))
        (pin (num 2) (name VP) (type passive))
        (pin (num 3) (name VN) (type passive))))
    (libpart (lib ProjectSymbols) (part AudioJack)
      (description "Audio Jack, 4 Poles (TRRS)")
      (docs ~)
      (footprints
        (fp Jack*))
      (fields
        (field (name Reference) J)
        (field (name Value) AudioJack))
      (pins
        (pin (num 1) (name ~) (type passive))
        (pin (num 2) (name ~) (type passive))
        (pin (num 3) (name ~) (type passive))
        (pin (num 4) (name ~) (type passive))))
    (libpart (lib ProjectSymbols) (part MAX98089)
      (fields
        (field (name Reference) U)
        (field (name Value) MAX98089))
      (pins
        (pin (num 1) (name SDOUTS2) (type output))
        (pin (num 2) (name BLCKS2) (type BiDi))
        (pin (num 3) (name DGND) (type power_in))
        (pin (num 4) (name LRCLKS2) (type BiDi))
        (pin (num 5) (name MCLK) (type input))
        (pin (num 6) (name DVDDS1) (type input))
        (pin (num 7) (name SDOUTS1) (type output))
        (pin (num 8) (name BCLKS1) (type BiDi))
        (pin (num 9) (name SDINS1) (type input))
        (pin (num 10) (name LRCLKS1) (type BiDi))
        (pin (num 15) (name SPKRN) (type output))
        (pin (num 16) (name SPKRGND) (type power_in))
        (pin (num 17) (name SPKRP) (type output))
        (pin (num 18) (name SPKRVDD) (type power_in))
        (pin (num 19) (name SPKLVDD) (type power_in))
        (pin (num 20) (name SPKLP) (type output))
        (pin (num 21) (name SPKLGND) (type power_in))
        (pin (num 22) (name SPKLN) (type output))
        (pin (num 23) (name RECN/LOUTR/RXINN) (type output))
        (pin (num 24) (name RECP/LOUTL/RXINP) (type output))
        (pin (num 25) (name PVDD) (type power_in))
        (pin (num 26) (name C1P) (type BiDi))
        (pin (num 27) (name C1N) (type BiDi))
        (pin (num 30) (name HPGND) (type power_in))
        (pin (num 31) (name HPVSS) (type power_out))
        (pin (num 32) (name HPVDD) (type power_out))
        (pin (num 33) (name HPL) (type output))
        (pin (num 34) (name HPSNS) (type power_in))
        (pin (num 35) (name HPR) (type output))
        (pin (num 36) (name INB2) (type input))
        (pin (num 37) (name INB1) (type input))
        (pin (num 38) (name INA2/EXTMICN) (type input))
        (pin (num 39) (name INA1/EXTMICP) (type input))
        (pin (num 40) (name MIC1P/DIGMICDATA) (type input))
        (pin (num 41) (name MIC1N/DIGMICCLK) (type input))
        (pin (num 42) (name MIC2P) (type input))
        (pin (num 43) (name MIC2N) (type input))
        (pin (num 44) (name MICBIAS) (type output))
        (pin (num 45) (name JACKSNS) (type input))
        (pin (num 47) (name AGND) (type power_in))
        (pin (num 48) (name REF) (type input))
        (pin (num 49) (name REG) (type input))
        (pin (num 50) (name AVDD) (type input))
        (pin (num 51) (name SCL) (type input))
        (pin (num 52) (name SDA) (type BiDi))
        (pin (num 53) (name DVDD) (type power_in))
        (pin (num 54) (name SDINS2) (type input))
        (pin (num 55) (name DVDDS2) (type input))
        (pin (num 56) (name "#IRQ") (type output))
        (pin (num 57) (name EP) (type input))))
    (libpart (lib ProjectSymbols) (part PCAL6408APW)
      (fields
        (field (name Reference) U)
        (field (name Value) PCAL6408APW))
      (pins
        (pin (num 1) (name "VDD(BUS)") (type input))
        (pin (num 2) (name ADDR) (type input))
        (pin (num 3) (name ~RESET~) (type input))
        (pin (num 4) (name P0) (type BiDi))
        (pin (num 5) (name P1) (type BiDi))
        (pin (num 6) (name P2) (type BiDi))
        (pin (num 7) (name P3) (type BiDi))
        (pin (num 8) (name VSS) (type power_in))
        (pin (num 9) (name P4) (type BiDi))
        (pin (num 10) (name P5) (type BiDi))
        (pin (num 11) (name P6) (type BiDi))
        (pin (num 12) (name P7) (type BiDi))
        (pin (num 13) (name ~INT~) (type power_in))
        (pin (num 14) (name SCL) (type openCol))
        (pin (num 15) (name SDA) (type openCol))
        (pin (num 16) (name "VDD(P)") (type power_in))))
    (libpart (lib ProjectSymbols) (part Q_DUAL_NMOS_S1G1D2S2G2D1)
      (description "Dual NMOS transistor, 6 pin package")
      (docs ~)
      (footprints
        (fp TSOP*)
        (fp SC?70*)
        (fp SC?88*)
        (fp SOT?363*))
      (fields
        (field (name Reference) Q)
        (field (name Value) Q_DUAL_NMOS_S1G1D2S2G2D1))
      (pins
        (pin (num 1) (name S) (type passive))
        (pin (num 2) (name G) (type input))
        (pin (num 3) (name D) (type passive))
        (pin (num 4) (name S) (type passive))
        (pin (num 5) (name G) (type input))
        (pin (num 6) (name D) (type passive))))
    (libpart (lib ProjectSymbols) (part R_Pack02_Crossed)
      (description "2 resistor network, parallel topology, DIP package")
      (docs ~)
      (footprints
        (fp DIP*)
        (fp SOIC*))
      (fields
        (field (name Reference) RN)
        (field (name Value) R_Pack02_Crossed))
      (pins
        (pin (num 1) (name R1.1) (type passive))
        (pin (num 2) (name R2.2) (type passive))
        (pin (num 3) (name R2.1) (type passive))
        (pin (num 4) (name R1.2) (type passive))))
    (libpart (lib ProjectSymbols) (part SI4688-A10-GM)
      (fields
        (field (name Reference) U)
        (field (name Value) SI4688-A10-GM))
      (pins
        (pin (num 1) (name NVSSB) (type output))
        (pin (num 2) (name NVSCLK) (type output))
        (pin (num 3) (name ~INTB~) (type output))
        (pin (num 4) (name RSTB) (type input))
        (pin (num 5) (name SMODE) (type input))
        (pin (num 6) (name RFREF) (type power_in))
        (pin (num 7) (name RFREF) (type power_in))
        (pin (num 8) (name RFREF) (type power_in))
        (pin (num 9) (name RFREF) (type power_in))
        (pin (num 10) (name VHFI) (type input))
        (pin (num 11) (name VHFSW) (type output))
        (pin (num 12) (name VA) (type power_in))
        (pin (num 13) (name ABYP) (type power_out))
        (pin (num 15) (name XTALI) (type input))
        (pin (num 16) (name XTALO) (type output))
        (pin (num 17) (name DACREF) (type power_out))
        (pin (num 18) (name LOUT) (type output))
        (pin (num 19) (name ROUT) (type output))
        (pin (num 27) (name DCLK) (type BiDi))
        (pin (num 28) (name DFS) (type BiDi))
        (pin (num 29) (name ~SSB~/A1) (type input))
        (pin (num 30) (name SCLK/SCL) (type input))
        (pin (num 31) (name MOSI/SDA) (type BiDi))
        (pin (num 32) (name MISO/A0) (type BiDi))
        (pin (num 33) (name DOUT) (type output))
        (pin (num 34) (name VIO) (type power_in))
        (pin (num 35) (name VMEM) (type power_in))
        (pin (num 36) (name DBYP) (type power_out))
        (pin (num 37) (name VCORE) (type power_in))
        (pin (num 39) (name GNDD) (type power_in))
        (pin (num 40) (name GNDD) (type power_in))
        (pin (num 41) (name GNDD) (type power_in))
        (pin (num 42) (name GNDD) (type power_in))
        (pin (num 47) (name NVMISO) (type input))
        (pin (num 48) (name NVMOSI) (type output))
        (pin (num 49) (name EP) (type power_in))))
    (libpart (lib ProjectSymbols) (part SerialFlash_SOIC)
      (fields
        (field (name Reference) U)
        (field (name Value) SerialFlash_SOIC))
      (pins
        (pin (num 1) (name ~CE~) (type input))
        (pin (num 2) (name SO/SIO1) (type BiDi))
        (pin (num 3) (name ~WP~/SIO2) (type BiDi))
        (pin (num 4) (name VSS) (type power_in))
        (pin (num 5) (name SI/SIO0) (type BiDi))
        (pin (num 6) (name SCK) (type input))
        (pin (num 7) (name HOLD/SIO3) (type BiDi))
        (pin (num 8) (name VDD) (type power_in))))
    (libpart (lib ProjectSymbols) (part Teensy_Small)
      (fields
        (field (name Reference) X)
        (field (name Value) Teensy_Small))
      (pins
        (pin (num 1) (name GND) (type passive))
        (pin (num 2) (name 0) (type passive))
        (pin (num 3) (name 1) (type passive))
        (pin (num 4) (name 2) (type passive))
        (pin (num 5) (name 3) (type passive))
        (pin (num 6) (name 4) (type passive))
        (pin (num 7) (name 5) (type passive))
        (pin (num 8) (name 6) (type passive))
        (pin (num 9) (name 7) (type passive))
        (pin (num 10) (name 8) (type passive))
        (pin (num 11) (name 9) (type passive))
        (pin (num 12) (name 10) (type passive))
        (pin (num 13) (name 11) (type passive))
        (pin (num 14) (name 12) (type passive))
        (pin (num 15) (name 13) (type passive))
        (pin (num 16) (name 14) (type passive))
        (pin (num 17) (name 15) (type passive))
        (pin (num 18) (name 16) (type passive))
        (pin (num 19) (name 17) (type passive))
        (pin (num 20) (name SDA/18) (type passive))
        (pin (num 21) (name SCL/19) (type passive))
        (pin (num 22) (name 20) (type passive))
        (pin (num 23) (name 21) (type passive))
        (pin (num 24) (name 22) (type passive))
        (pin (num 25) (name 23) (type passive))
        (pin (num 26) (name Vcc) (type passive))
        (pin (num 27) (name GND) (type passive))
        (pin (num 28) (name Vin) (type passive))))
    (libpart (lib Regulator_Linear) (part TPS79318-EP)
      (aliases
        (alias TPS79325-EP)
        (alias TPS79328-EP)
        (alias TPS793285-EP)
        (alias TPS79330-EP)
        (alias TPS793333-EP)
        (alias TPS793475-EP))
      (description "200mA UltraLow-Noise, High-Precision, Fast RF, Low Drop-out Voltage Regualtor, Fixed Output 1.8V, SOT-23")
      (docs http://www.ti.com/lit/ds/symlink/tps79333-ep.pdf)
      (footprints
        (fp SOT?23*))
      (fields
        (field (name Reference) U)
        (field (name Value) TPS79318-EP)
        (field (name Footprint) Package_TO_SOT_SMD:SOT-23-5))
      (pins
        (pin (num 1) (name IN) (type power_in))
        (pin (num 2) (name GND) (type power_in))
        (pin (num 3) (name EN) (type input))
        (pin (num 4) (name BP) (type BiDi))
        (pin (num 5) (name OUT) (type power_out)))))
  (libraries
    (library (logical Connector)
      (uri /usr/share/kicad/library/Connector.lib))
    (library (logical Connector_Generic)
      (uri /usr/share/kicad/library/Connector_Generic.lib))
    (library (logical Device)
      (uri /usr/share/kicad/library/Device.lib))
    (library (logical Jumper)
      (uri /usr/share/kicad/library/Jumper.lib))
    (library (logical MCU_Module)
      (uri /usr/share/kicad/library/MCU_Module.lib))
    (library (logical Mechanical)
      (uri /usr/share/kicad/library/Mechanical.lib))
    (library (logical Memory_EEPROM)
      (uri /usr/share/kicad/library/Memory_EEPROM.lib))
    (library (logical Oscillator)
      (uri /usr/share/kicad/library/Oscillator.lib))
    (library (logical Power_Protection)
      (uri /usr/share/kicad/library/Power_Protection.lib))
    (library (logical ProjectSymbols)
      (uri /home/andi/Projekte/radio-shield/hardware/shield/../ProjectSymbols.lib))
    (library (logical Regulator_Linear)
      (uri /usr/share/kicad/library/Regulator_Linear.lib)))
  (nets
    (net (code 2) (name /Si4688/I2S_CLK)
      (node (ref R303) (pin 1))
      (node (ref U201) (pin 2)))
    (net (code 3) (name /MAX98089/I2S_SI_LRCLK)
      (node (ref R304) (pin 1))
      (node (ref U201) (pin 4)))
    (net (code 4) (name /Si4688/I2S_OUT)
      (node (ref U201) (pin 54))
      (node (ref R305) (pin 1)))
    (net (code 5) (name "Net-(A101-Pad19)")
      (node (ref A101) (pin 19)))
    (net (code 6) (name "Net-(A101-Pad17)")
      (node (ref A101) (pin 17)))
    (net (code 7) (name "Net-(A101-Pad18)")
      (node (ref A101) (pin 18)))
    (net (code 8) (name "Net-(A101-Pad20)")
      (node (ref A101) (pin 20)))
    (net (code 9) (name "Net-(A101-Pad21)")
      (node (ref A101) (pin 21)))
    (net (code 10) (name "Net-(A101-Pad22)")
      (node (ref A101) (pin 22)))
    (net (code 11) (name "Net-(A101-Pad23)")
      (node (ref A101) (pin 23)))
    (net (code 12) (name "Net-(A101-Pad25)")
      (node (ref A101) (pin 25)))
    (net (code 13) (name "Net-(A101-Pad26)")
      (node (ref A101) (pin 26)))
    (net (code 14) (name "Net-(A101-Pad27)")
      (node (ref A101) (pin 27)))
    (net (code 15) (name "Net-(A101-Pad28)")
      (node (ref A101) (pin 28)))
    (net (code 16) (name "Net-(A101-Pad9)")
      (node (ref A101) (pin 9)))
    (net (code 17) (name /Si4688/I2C_SCL)
      (node (ref A101) (pin 32))
      (node (ref U102) (pin 14))
      (node (ref X101) (pin 21))
      (node (ref U103) (pin 1))
      (node (ref RN108) (pin 2))
      (node (ref U201) (pin 51))
      (node (ref Q301) (pin 6)))
    (net (code 18) (name GND)
      (node (ref C105) (pin 2))
      (node (ref C102) (pin 2))
      (node (ref C106) (pin 2))
      (node (ref C101) (pin 2))
      (node (ref C301) (pin 2))
      (node (ref Y301) (pin 2))
      (node (ref C107) (pin 2))
      (node (ref J102) (pin 10))
      (node (ref C310) (pin 2))
      (node (ref J102) (pin 6))
      (node (ref R102) (pin 1))
      (node (ref U102) (pin 2))
      (node (ref A101) (pin 29))
      (node (ref A101) (pin 7))
      (node (ref U102) (pin 8))
      (node (ref A101) (pin 6))
      (node (ref RN302) (pin 2))
      (node (ref U101) (pin 2))
      (node (ref C309) (pin 2))
      (node (ref X101) (pin 1))
      (node (ref C304) (pin 2))
      (node (ref C104) (pin 2))
      (node (ref RN302) (pin 1))
      (node (ref C103) (pin 2))
      (node (ref U103) (pin 2))
      (node (ref U301) (pin 9))
      (node (ref U301) (pin 29))
      (node (ref U301) (pin 8))
      (node (ref C202) (pin 2))
      (node (ref C207) (pin 2))
      (node (ref U301) (pin 7))
      (node (ref C215) (pin 2))
      (node (ref C216) (pin 1))
      (node (ref C217) (pin 1))
      (node (ref U201) (pin 57))
      (node (ref X201) (pin 2))
      (node (ref Y301) (pin 4))
      (node (ref U302) (pin 4))
      (node (ref X101) (pin 27))
      (node (ref U301) (pin 32))
      (node (ref C209) (pin 2))
      (node (ref U301) (pin 40))
      (node (ref U301) (pin 39))
      (node (ref U301) (pin 41))
      (node (ref C212) (pin 2))
      (node (ref U301) (pin 6))
      (node (ref U301) (pin 49))
      (node (ref JP201) (pin 1))
      (node (ref C201) (pin 2))
      (node (ref C218) (pin 2))
      (node (ref R206) (pin 1))
      (node (ref C206) (pin 2))
      (node (ref R205) (pin 1))
      (node (ref C204) (pin 2))
      (node (ref U301) (pin 42))
      (node (ref D301) (pin 2))
      (node (ref C303) (pin 2))
      (node (ref L302) (pin 1))
      (node (ref D301) (pin 3))
      (node (ref R301) (pin 1))
      (node (ref C213) (pin 2))
      (node (ref R204) (pin 1))
      (node (ref C208) (pin 2))
      (node (ref R203) (pin 1))
      (node (ref C211) (pin 2))
      (node (ref U201) (pin 16))
      (node (ref U201) (pin 47))
      (node (ref C210) (pin 2))
      (node (ref U201) (pin 30))
      (node (ref C203) (pin 2))
      (node (ref U201) (pin 3))
      (node (ref U201) (pin 21)))
    (net (code 19) (name "Net-(A101-Pad8)")
      (node (ref A101) (pin 8))
      (node (ref X101) (pin 28)))
    (net (code 20) (name "Net-(X101-Pad2)")
      (node (ref X101) (pin 2)))
    (net (code 21) (name "Net-(X101-Pad3)")
      (node (ref X101) (pin 3)))
    (net (code 22) (name "Net-(X101-Pad19)")
      (node (ref X101) (pin 19)))
    (net (code 23) (name /Si4688/I2C_SDA)
      (node (ref U201) (pin 52))
      (node (ref Q301) (pin 3))
      (node (ref U102) (pin 15))
      (node (ref RN108) (pin 1))
      (node (ref X101) (pin 20))
      (node (ref U103) (pin 3))
      (node (ref A101) (pin 31)))
    (net (code 24) (name "Net-(X101-Pad22)")
      (node (ref X101) (pin 22)))
    (net (code 25) (name "Net-(X101-Pad23)")
      (node (ref X101) (pin 23)))
    (net (code 26) (name /MAX98089/I2S_MC_LRCLK)
      (node (ref RN103) (pin 6))
      (node (ref U201) (pin 10))
      (node (ref RN104) (pin 7)))
    (net (code 27) (name /MAX98089/I2S_MC_IN)
      (node (ref U201) (pin 9))
      (node (ref RN104) (pin 8))
      (node (ref RN103) (pin 5)))
    (net (code 28) (name /T4_DOUT2)
      (node (ref X101) (pin 4))
      (node (ref RN103) (pin 4)))
    (net (code 29) (name "Net-(A101-Pad10)")
      (node (ref A101) (pin 10)))
    (net (code 30) (name /MAX98089/I2S_MC_BCLK)
      (node (ref U201) (pin 8))
      (node (ref RN103) (pin 7))
      (node (ref RN104) (pin 6)))
    (net (code 31) (name /T_MISO)
      (node (ref RN106) (pin 4))
      (node (ref X101) (pin 14))
      (node (ref RN110) (pin 3)))
    (net (code 32) (name /T_MOSI)
      (node (ref RN106) (pin 3))
      (node (ref RN110) (pin 2))
      (node (ref X101) (pin 13)))
    (net (code 33) (name "Net-(RN101-Pad1)")
      (node (ref RN101) (pin 1))
      (node (ref U102) (pin 3)))
    (net (code 34) (name /~INT~)
      (node (ref U201) (pin 56))
      (node (ref RN101) (pin 2))
      (node (ref A101) (pin 24))
      (node (ref U102) (pin 13))
      (node (ref X101) (pin 8)))
    (net (code 35) (name VDD_PWR)
      (node (ref R207) (pin 2))
      (node (ref C209) (pin 1))
      (node (ref C218) (pin 1))
      (node (ref C212) (pin 1))
      (node (ref D101) (pin 1))
      (node (ref U201) (pin 19))
      (node (ref C215) (pin 1))
      (node (ref A101) (pin 5))
      (node (ref U201) (pin 18)))
    (net (code 36) (name VDD_IO)
      (node (ref RN108) (pin 4))
      (node (ref C105) (pin 1))
      (node (ref RN108) (pin 3))
      (node (ref Q201) (pin 3))
      (node (ref JP101) (pin 2))
      (node (ref JP102) (pin 1))
      (node (ref RN101) (pin 4))
      (node (ref RN101) (pin 3))
      (node (ref A101) (pin 2))
      (node (ref U102) (pin 1))
      (node (ref U103) (pin 4)))
    (net (code 37) (name /MAX98089/V_I2S_MC)
      (node (ref Q201) (pin 4))
      (node (ref C201) (pin 1))
      (node (ref JP102) (pin 2))
      (node (ref U201) (pin 6)))
    (net (code 38) (name "Net-(Q201-Pad2)")
      (node (ref R207) (pin 1))
      (node (ref Q201) (pin 5))
      (node (ref Q201) (pin 6))
      (node (ref Q201) (pin 2)))
    (net (code 39) (name "Net-(RN102-Pad1)")
      (node (ref RN102) (pin 1))
      (node (ref X101) (pin 9)))
    (net (code 40) (name "Net-(J102-Pad1)")
      (node (ref RN109) (pin 2))
      (node (ref J102) (pin 1))
      (node (ref RN102) (pin 3)))
    (net (code 41) (name "Net-(J102-Pad8)")
      (node (ref RN102) (pin 4))
      (node (ref RN105) (pin 2))
      (node (ref J102) (pin 8)))
    (net (code 42) (name "Net-(RN102-Pad2)")
      (node (ref X101) (pin 10))
      (node (ref RN102) (pin 2)))
    (net (code 43) (name /Si4688/~INT~)
      (node (ref U301) (pin 3))
      (node (ref U102) (pin 6)))
    (net (code 44) (name /Si4688/I2C_EN)
      (node (ref Q301) (pin 2))
      (node (ref Q301) (pin 5))
      (node (ref U102) (pin 4))
      (node (ref RN302) (pin 3)))
    (net (code 45) (name /MAX98089/OSC_EN)
      (node (ref X201) (pin 1))
      (node (ref U102) (pin 11)))
    (net (code 46) (name "Net-(A101-Pad11)")
      (node (ref A101) (pin 11)))
    (net (code 47) (name "Net-(A101-Pad12)")
      (node (ref A101) (pin 12)))
    (net (code 48) (name "Net-(X101-Pad18)")
      (node (ref X101) (pin 18)))
    (net (code 49) (name "Net-(X101-Pad17)")
      (node (ref X101) (pin 17)))
    (net (code 50) (name /T3_SCK)
      (node (ref X101) (pin 16))
      (node (ref RN110) (pin 4))
      (node (ref J101) (pin 1)))
    (net (code 51) (name "Net-(U103-Pad5)")
      (node (ref U103) (pin 5)))
    (net (code 52) (name "Net-(U102-Pad7)")
      (node (ref U102) (pin 7)))
    (net (code 53) (name "Net-(U102-Pad9)")
      (node (ref U102) (pin 9)))
    (net (code 54) (name +3V3)
      (node (ref JP101) (pin 1))
      (node (ref Q201) (pin 1))
      (node (ref U101) (pin 1))
      (node (ref D101) (pin 2))
      (node (ref X101) (pin 26))
      (node (ref A101) (pin 4))
      (node (ref RN105) (pin 1))
      (node (ref Q101) (pin 2))
      (node (ref C101) (pin 1))
      (node (ref U101) (pin 3))
      (node (ref C102) (pin 1)))
    (net (code 55) (name "Net-(A101-Pad15)")
      (node (ref A101) (pin 15)))
    (net (code 56) (name "Net-(A101-Pad16)")
      (node (ref A101) (pin 16)))
    (net (code 57) (name "Net-(A101-Pad30)")
      (node (ref A101) (pin 30)))
    (net (code 58) (name "Net-(A101-Pad3)")
      (node (ref A101) (pin 3)))
    (net (code 59) (name "Net-(A101-Pad14)")
      (node (ref A101) (pin 14)))
    (net (code 60) (name "Net-(A101-Pad13)")
      (node (ref A101) (pin 13)))
    (net (code 61) (name +1V8)
      (node (ref U301) (pin 34))
      (node (ref C310) (pin 1))
      (node (ref U301) (pin 5))
      (node (ref U301) (pin 35))
      (node (ref U301) (pin 37))
      (node (ref U201) (pin 55))
      (node (ref U201) (pin 50))
      (node (ref U201) (pin 53))
      (node (ref C203) (pin 1))
      (node (ref C304) (pin 1))
      (node (ref C309) (pin 1))
      (node (ref C308) (pin 1))
      (node (ref C306) (pin 1))
      (node (ref FB301) (pin 2))
      (node (ref U302) (pin 3))
      (node (ref X201) (pin 4))
      (node (ref C202) (pin 1))
      (node (ref C207) (pin 1))
      (node (ref C307) (pin 1))
      (node (ref U201) (pin 25))
      (node (ref U302) (pin 7))
      (node (ref U302) (pin 8))
      (node (ref U102) (pin 16))
      (node (ref C104) (pin 1))
      (node (ref U101) (pin 5)))
    (net (code 62) (name /Si4688/RESET)
      (node (ref RN302) (pin 4))
      (node (ref RN301) (pin 4))
      (node (ref RN301) (pin 2))
      (node (ref U102) (pin 5))
      (node (ref U301) (pin 4)))
    (net (code 63) (name /T4_LRCLK2)
      (node (ref RN103) (pin 3))
      (node (ref X101) (pin 5)))
    (net (code 64) (name /T_CS)
      (node (ref X101) (pin 12))
      (node (ref RN110) (pin 1))
      (node (ref RN106) (pin 2)))
    (net (code 65) (name /T4_DIN2)
      (node (ref X101) (pin 7))
      (node (ref RN103) (pin 1)))
    (net (code 66) (name /T4_BCLK2)
      (node (ref RN103) (pin 2))
      (node (ref X101) (pin 6)))
    (net (code 67) (name /MAX98089/I2S_MC_OUT)
      (node (ref RN104) (pin 5))
      (node (ref RN103) (pin 8))
      (node (ref R201) (pin 2)))
    (net (code 68) (name /T3_DOUT)
      (node (ref RN104) (pin 1))
      (node (ref X101) (pin 24)))
    (net (code 69) (name /T3_LRCLK)
      (node (ref RN104) (pin 2))
      (node (ref X101) (pin 25)))
    (net (code 71) (name /T3_BCLK)
      (node (ref RN104) (pin 3))
      (node (ref X101) (pin 11)))
    (net (code 72) (name /T4_SCK_T3_DIN)
      (node (ref X101) (pin 15))
      (node (ref RN106) (pin 1))
      (node (ref RN104) (pin 4)))
    (net (code 73) (name "Net-(A101-Pad1)")
      (node (ref A101) (pin 1)))
    (net (code 74) (name "Net-(C103-Pad1)")
      (node (ref C103) (pin 1))
      (node (ref U101) (pin 4)))
    (net (code 75) (name /SD_SI)
      (node (ref RN106) (pin 6))
      (node (ref RN110) (pin 7))
      (node (ref J102) (pin 3))
      (node (ref RN107) (pin 2)))
    (net (code 76) (name /~SD_CS~)
      (node (ref J102) (pin 2))
      (node (ref RN106) (pin 7))
      (node (ref RN110) (pin 8))
      (node (ref RN109) (pin 1)))
    (net (code 77) (name /SD_CLK)
      (node (ref RN106) (pin 8))
      (node (ref J102) (pin 5))
      (node (ref RN110) (pin 5)))
    (net (code 78) (name /SD_SO)
      (node (ref RN107) (pin 1))
      (node (ref J102) (pin 7))
      (node (ref RN106) (pin 5))
      (node (ref RN110) (pin 6)))
    (net (code 79) (name "Net-(J102-Pad9)")
      (node (ref U102) (pin 10))
      (node (ref J102) (pin 9)))
    (net (code 80) (name "Net-(Q101-Pad1)")
      (node (ref Q101) (pin 1))
      (node (ref R101) (pin 2)))
    (net (code 81) (name "Net-(R101-Pad1)")
      (node (ref U102) (pin 12))
      (node (ref RN105) (pin 4))
      (node (ref R101) (pin 1)))
    (net (code 82) (name "Net-(C107-Pad1)")
      (node (ref R102) (pin 2))
      (node (ref C107) (pin 1))
      (node (ref J102) (pin 11)))
    (net (code 83) (name "Net-(C106-Pad1)")
      (node (ref RN105) (pin 3))
      (node (ref RN107) (pin 3))
      (node (ref RN107) (pin 4))
      (node (ref RN109) (pin 3))
      (node (ref RN109) (pin 4))
      (node (ref C106) (pin 1))
      (node (ref Q101) (pin 3))
      (node (ref J102) (pin 4)))
    (net (code 84) (name /MAX98089/MIC)
      (node (ref U201) (pin 45))
      (node (ref FB203) (pin 2))
      (node (ref R202) (pin 1))
      (node (ref J201) (pin 1)))
    (net (code 85) (name "Net-(C214-Pad1)")
      (node (ref FB203) (pin 1))
      (node (ref C214) (pin 1)))
    (net (code 86) (name /MAX98089/HPR)
      (node (ref J201) (pin 3))
      (node (ref FB201) (pin 2)))
    (net (code 87) (name /MAX98089/HPL)
      (node (ref J201) (pin 2))
      (node (ref FB202) (pin 2)))
    (net (code 88) (name "Net-(C220-Pad1)")
      (node (ref C220) (pin 1))
      (node (ref R204) (pin 2)))
    (net (code 89) (name "Net-(C220-Pad2)")
      (node (ref C223) (pin 2))
      (node (ref C220) (pin 2))
      (node (ref J202) (pin 4))
      (node (ref L202) (pin 2)))
    (net (code 90) (name "Net-(C219-Pad2)")
      (node (ref R203) (pin 2))
      (node (ref C219) (pin 2)))
    (net (code 91) (name "Net-(U201-Pad36)")
      (node (ref U201) (pin 36)))
    (net (code 92) (name "Net-(C211-Pad1)")
      (node (ref C211) (pin 1))
      (node (ref C214) (pin 2))
      (node (ref U201) (pin 40)))
    (net (code 93) (name "Net-(U201-Pad23)")
      (node (ref U201) (pin 23)))
    (net (code 94) (name "Net-(U201-Pad24)")
      (node (ref U201) (pin 24)))
    (net (code 95) (name "Net-(U201-Pad39)")
      (node (ref U201) (pin 39)))
    (net (code 96) (name "Net-(U201-Pad37)")
      (node (ref U201) (pin 37)))
    (net (code 97) (name "Net-(U201-Pad38)")
      (node (ref U201) (pin 38)))
    (net (code 98) (name "Net-(R201-Pad1)")
      (node (ref U201) (pin 7))
      (node (ref R201) (pin 1)))
    (net (code 99) (name "Net-(C217-Pad2)")
      (node (ref C217) (pin 2))
      (node (ref FB202) (pin 1))
      (node (ref U201) (pin 33)))
    (net (code 100) (name "Net-(C216-Pad2)")
      (node (ref FB201) (pin 1))
      (node (ref C216) (pin 2))
      (node (ref U201) (pin 35)))
    (net (code 101) (name "Net-(C219-Pad1)")
      (node (ref C223) (pin 1))
      (node (ref C219) (pin 1))
      (node (ref L201) (pin 2))
      (node (ref J202) (pin 3)))
    (net (code 102) (name "Net-(L201-Pad1)")
      (node (ref U201) (pin 20))
      (node (ref L201) (pin 1)))
    (net (code 103) (name "Net-(L202-Pad1)")
      (node (ref U201) (pin 22))
      (node (ref L202) (pin 1)))
    (net (code 104) (name "Net-(L203-Pad1)")
      (node (ref U201) (pin 17))
      (node (ref L203) (pin 1)))
    (net (code 106) (name "Net-(J201-Pad4)")
      (node (ref J201) (pin 4))
      (node (ref U201) (pin 34))
      (node (ref JP201) (pin 2)))
    (net (code 107) (name "Net-(C222-Pad1)")
      (node (ref R206) (pin 2))
      (node (ref C222) (pin 1)))
    (net (code 108) (name "Net-(C221-Pad2)")
      (node (ref C221) (pin 2))
      (node (ref R205) (pin 2)))
    (net (code 109) (name "Net-(C221-Pad1)")
      (node (ref L203) (pin 2))
      (node (ref J202) (pin 2))
      (node (ref C224) (pin 1))
      (node (ref C221) (pin 1)))
    (net (code 110) (name "Net-(U201-Pad1)")
      (node (ref U201) (pin 1)))
    (net (code 111) (name "Net-(C222-Pad2)")
      (node (ref J202) (pin 1))
      (node (ref C222) (pin 2))
      (node (ref C224) (pin 2))
      (node (ref L204) (pin 2)))
    (net (code 112) (name "Net-(L204-Pad1)")
      (node (ref L204) (pin 1))
      (node (ref U201) (pin 15)))
    (net (code 113) (name "Net-(C204-Pad1)")
      (node (ref U201) (pin 31))
      (node (ref C204) (pin 1)))
    (net (code 114) (name "Net-(C206-Pad1)")
      (node (ref U201) (pin 32))
      (node (ref C206) (pin 1)))
    (net (code 115) (name "Net-(C205-Pad2)")
      (node (ref C205) (pin 2))
      (node (ref U201) (pin 27)))
    (net (code 116) (name "Net-(C205-Pad1)")
      (node (ref C205) (pin 1))
      (node (ref U201) (pin 26)))
    (net (code 117) (name "Net-(U201-Pad5)")
      (node (ref U201) (pin 5))
      (node (ref X201) (pin 3)))
    (net (code 118) (name "Net-(C213-Pad1)")
      (node (ref C213) (pin 1))
      (node (ref U201) (pin 49)))
    (net (code 119) (name "Net-(C210-Pad1)")
      (node (ref U201) (pin 48))
      (node (ref C210) (pin 1)))
    (net (code 120) (name "Net-(U201-Pad43)")
      (node (ref U201) (pin 43)))
    (net (code 121) (name "Net-(U201-Pad42)")
      (node (ref U201) (pin 42)))
    (net (code 122) (name "Net-(U201-Pad41)")
      (node (ref U201) (pin 41)))
    (net (code 123) (name "Net-(C208-Pad1)")
      (node (ref U201) (pin 44))
      (node (ref C208) (pin 1))
      (node (ref R202) (pin 2)))
    (net (code 124) (name /Si4688/ANT_SHIELD)
      (node (ref J301) (pin 2))
      (node (ref C301) (pin 1))
      (node (ref R301) (pin 2)))
    (net (code 125) (name /Si4688/ABYP)
      (node (ref U301) (pin 13))
      (node (ref C305) (pin 2)))
    (net (code 126) (name "Net-(Q301-Pad1)")
      (node (ref U301) (pin 30))
      (node (ref RN301) (pin 3))
      (node (ref Q301) (pin 1)))
    (net (code 127) (name "Net-(Q301-Pad4)")
      (node (ref U301) (pin 31))
      (node (ref Q301) (pin 4))
      (node (ref RN301) (pin 1)))
    (net (code 128) (name "Net-(R305-Pad2)")
      (node (ref U301) (pin 33))
      (node (ref R305) (pin 2)))
    (net (code 129) (name "Net-(R303-Pad2)")
      (node (ref U301) (pin 27))
      (node (ref R303) (pin 2)))
    (net (code 130) (name "Net-(R304-Pad2)")
      (node (ref R304) (pin 2))
      (node (ref U301) (pin 28)))
    (net (code 131) (name "Net-(C305-Pad1)")
      (node (ref FB301) (pin 1))
      (node (ref C305) (pin 1))
      (node (ref U301) (pin 12)))
    (net (code 132) (name "Net-(U301-Pad15)")
      (node (ref U301) (pin 15))
      (node (ref Y301) (pin 1)))
    (net (code 133) (name "Net-(U301-Pad16)")
      (node (ref U301) (pin 16))
      (node (ref Y301) (pin 3)))
    (net (code 134) (name "Net-(C302-Pad2)")
      (node (ref C302) (pin 2))
      (node (ref L301) (pin 1)))
    (net (code 135) (name /Si4688/ANT)
      (node (ref J301) (pin 1))
      (node (ref C302) (pin 1))
      (node (ref D301) (pin 1)))
    (net (code 136) (name "Net-(C303-Pad1)")
      (node (ref L301) (pin 2))
      (node (ref L303) (pin 2))
      (node (ref U301) (pin 10))
      (node (ref L302) (pin 2))
      (node (ref C303) (pin 1)))
    (net (code 137) (name "Net-(L303-Pad1)")
      (node (ref U301) (pin 11))
      (node (ref L303) (pin 1)))
    (net (code 138) (name "Net-(U301-Pad2)")
      (node (ref U302) (pin 6))
      (node (ref U301) (pin 2)))
    (net (code 139) (name "Net-(U301-Pad48)")
      (node (ref U301) (pin 48))
      (node (ref U302) (pin 5)))
    (net (code 140) (name /Si4688/DBYP)
      (node (ref C307) (pin 2))
      (node (ref U301) (pin 36))
      (node (ref C308) (pin 2))
      (node (ref C306) (pin 2)))
    (net (code 141) (name "Net-(U301-Pad19)")
      (node (ref U301) (pin 19)))
    (net (code 142) (name "Net-(U301-Pad18)")
      (node (ref U301) (pin 18)))
    (net (code 143) (name "Net-(U301-Pad17)")
      (node (ref U301) (pin 17)))
    (net (code 144) (name "Net-(U301-Pad47)")
      (node (ref U301) (pin 47))
      (node (ref U302) (pin 2)))
    (net (code 145) (name "Net-(U301-Pad1)")
      (node (ref U302) (pin 1))
      (node (ref U301) (pin 1)))))