*----------------------------------------------------------------------
* SPICE Model generated by Murata Manufacturing Co., Ltd.
* Copyright(C) Murata Manufacturing Co., Ltd.
* Description :1608M(0603)/C0G/2200pF/50V
* Murata P/N :GRM1885C1H222JA01
* Property : C = 2200[pF]
* Data Generated on Jan 10, 2017
*----------------------------------------------------------------------
* Applicable Conditions:
*   Frequency Range = 1MHz-6GHz
*   Temperature = 25 degC
*   DC Bias Voltage = 0V
*   Small Signal Operation
*----------------------------------------------------------------------
.SUBCKT GRM1885C1H222JA01 port1 port2
C1 port1 11 2.20e-9
L2 11 12 3.20e-10
R3 12 13 1.62e-2
L4 13 14 4.87e-11
R4 13 14 5.51e-1
L5 14 15 7.26e-11
R5 14 15 2.02e-2
C6 15 16 1.76e-8
L6 15 16 1.51e-11
R6 15 16 1.94e-1
C7 16 17 3.11e-9
L7 16 17 3.33e-11
R7 16 17 4.17e-1
C8 17 18 1.80e-9
L8 17 18 1.85e-11
R8 17 18 2.06e-1
C9 18 19 7.70e-12
L9 18 19 3.27e-11
R9 18 19 1.00e+5
C10 19 port2 3.82e-12
L10 19 port2 4.88e-11
R10 19 port2 43.9
R100 port1 11 1.00e+10
.ENDS GRM1885C1H222JA01