*----------------------------------------------------------------------
* SPICE Model generated by Murata Manufacturing Co., Ltd.
* Copyright(C) Murata Manufacturing Co., Ltd.
* Description :1005M(0402)/X7R/2200pF/50V
* Murata P/N :GRM155R71H222KA01
* Property : C = 2200[pF]
* Data Generated on Nov 6, 2018
*----------------------------------------------------------------------
* Applicable Conditions:
*   Frequency Range = 100Hz-6GHz
*   Temperature = 25 degC
*   DC Bias Voltage = 2.5V
*   Small Signal Operation
*----------------------------------------------------------------------
.SUBCKT GRM155R71H222KA01 port1 port2
C1 port1 11 2.22e-9
L2 11 12 1.51e-10
R3 12 13 1.56e-1
C4 13 14 3.56e-7
R4 13 14 8.30e+3
C5 14 15 3.57e-7
R5 14 15 1.26e+3
C6 15 16 3.22e-7
R6 15 16 166
C7 16 17 3.02e-7
R7 16 17 20.8
C8 17 18 2.92e-7
R8 17 18 3.63
C9 18 19 1.88e-7
R9 18 19 7.84e-1
C10 19 20 9.60e-8
R10 19 20 2.55e-1
C11 20 21 2.32e-8
R11 20 21 1.28e-1
L12 21 22 5.89e-11
R12 21 22 5.55e-1
C13 22 23 3.82e-9
L13 22 23 1.38e-11
R13 22 23 8.55e-2
C14 23 port2 1.98e-12
L14 23 port2 1.48e-10
R14 23 port2 20.5
R100 port1 11 1.00e+10
.ENDS GRM155R71H222KA01