*----------------------------------------------------------------------
* SPICE Model generated by Murata Manufacturing Co., Ltd.
* Copyright(C) Murata Manufacturing Co., Ltd.
* Description :1608M(0603)/C0G/8.2pF/250V
* Murata P/N :GQM1875C2E8R2CB12
* Property : C = 8.2[pF]
* Data Generated on Jan 10, 2017
*----------------------------------------------------------------------
* Applicable Conditions:
*   Frequency Range = 100MHz-8.5GHz
*   Temperature = 25 degC
*   DC Bias Voltage = 0V
*   Small Signal Operation
*----------------------------------------------------------------------
.SUBCKT GQM1875C2E8R2CB12 port1 port2
C1 port1 11 8.20e-12
L2 11 12 1.46e-10
R3 12 13 7.00e-2
L4 13 14 1.27e-12
R4 13 14 3.18e-2
C5 14 15 1.88e-12
L5 14 15 1.29e-10
C6 15 16 2.46e-11
L6 15 16 1.14e-11
R6 15 16 6.46
C7 16 port2 1.47e-11
L7 16 port2 4.20e-11
R7 16 port2 67.5
R100 port1 11 1.00e+10
.ENDS GQM1875C2E8R2CB12