EESchema Schematic File Version 4
LIBS:shield-cache
EELAYER 26 0
EELAYER END
$Descr A4 11693 8268
encoding utf-8
Sheet 1 3
Title "Music Shield"
Date "2021-05-16"
Rev "r2"
Comp "(c) 2021 Andreas Messer"
Comment1 "Connectors, powersupply & additional parts"
Comment2 ""
Comment3 ""
Comment4 ""
$EndDescr
Text Label 5150 3550 2    50   ~ 0
T3_LRCLK
Text Label 4800 3650 0    50   ~ 0
T3_DOUT
Text Label 5100 4550 2    50   ~ 0
T4_SCK_T3_DIN
Text Label 3200 4250 0    50   ~ 0
T3_BCLK
Text Label 3050 3850 0    50   ~ 0
T4_DIN2
Text Label 3050 3550 0    50   ~ 0
T4_DOUT2
Text Label 3050 3650 0    50   ~ 0
T4_LRCLK2
NoConn ~ 13150 -100
$Sheet
S 7550 900  850  1750
U 5F622C8F
F0 "MAX98089" 50
F1 "max98089.sch" 50
F2 "SCL" B L 7550 2050 50 
F3 "SDA" B L 7550 2150 50 
F4 "#IRQ" O L 7550 2550 50 
F5 "I2S_SI_IN" I R 8400 2450 50 
F6 "I2S_SI_LRCLK" O R 8400 2350 50 
F7 "I2S_SI_BCLK" O R 8400 2250 50 
F8 "I2S_MC_BCLK" I L 7550 1250 50 
F9 "I2S_MC_LRCLK" I L 7550 1350 50 
F10 "I2S_MC_IN" I L 7550 1450 50 
F11 "I2S_MC_OUT" O L 7550 1150 50 
F12 "V_I2S_MC" I L 7550 950 50 
F13 "VSP" I L 7550 1650 50 
F14 "OSC_EN" I R 8400 2550 50 
$EndSheet
$Sheet
S 8800 1900 750  1500
U 5F6294E6
F0 "Si4688" 50
F1 "si4688.sch" 50
F2 "I2S_CLK" I L 8800 2250 50 
F3 "I2S_WS" I L 8800 2350 50 
F4 "I2S_OUT" O L 8800 2450 50 
F5 "RESET" I L 8800 3200 50 
F6 "I2C_SCL" B L 8800 2800 50 
F7 "I2C_SDA" B L 8800 2900 50 
F8 "~INT~" B L 8800 3300 50 
F9 "I2C_EN" I L 8800 3100 50 
$EndSheet
Text Label 3200 4350 0    50   ~ 0
T_CS
Text Label 3050 3750 0    50   ~ 0
T4_BCLK2
$Comp
L Device:R_Pack04 RN103
U 1 1 5F72109D
P 6150 1350
F 0 "RN103" V 5850 1350 50  0000 C CNN
F 1 "10" V 6350 1350 50  0000 C CNN
F 2 "Resistors_SMD:R_Array_Convex_4x0603" V 6425 1350 50  0001 C CNN
F 3 "~" H 6150 1350 50  0001 C CNN
	1    6150 1350
	0    1    1    0   
$EndComp
$Comp
L power:GND #PWR0106
U 1 1 5F76A3BF
P 4550 3400
F 0 "#PWR0106" H 4550 3150 50  0001 C CNN
F 1 "GND" H 4555 3227 50  0001 C CNN
F 2 "" H 4550 3400 50  0001 C CNN
F 3 "" H 4550 3400 50  0001 C CNN
	1    4550 3400
	1    0    0    -1  
$EndComp
$Comp
L Device:R_Pack04 RN104
U 1 1 5F8C4AFC
P 6150 1950
F 0 "RN104" V 5850 1950 50  0000 C CNN
F 1 "n.p." V 5824 1950 50  0001 C CNN
F 2 "Resistors_SMD:R_Array_Convex_4x0603" V 6425 1950 50  0001 C CNN
F 3 "~" H 6150 1950 50  0001 C CNN
	1    6150 1950
	0    1    1    0   
$EndComp
Wire Wire Line
	6350 1150 6550 1150
Wire Wire Line
	6550 1150 6550 2050
Wire Wire Line
	6550 2050 6350 2050
Wire Wire Line
	5950 2050 5350 2050
Wire Wire Line
	5950 1950 5350 1950
Wire Wire Line
	5950 1850 5350 1850
Wire Wire Line
	5950 1750 5350 1750
Wire Wire Line
	5950 1350 5350 1350
Wire Wire Line
	5950 1250 5350 1250
Wire Wire Line
	5950 1150 5350 1150
Entry Wire Line
	5250 2150 5350 2050
Entry Wire Line
	5250 2050 5350 1950
Entry Wire Line
	5250 1950 5350 1850
Entry Wire Line
	5250 1850 5350 1750
Entry Wire Line
	5250 1550 5350 1450
Entry Wire Line
	5250 1450 5350 1350
Entry Wire Line
	5250 1350 5350 1250
Entry Wire Line
	5250 1250 5350 1150
Wire Wire Line
	6550 1150 7550 1150
Connection ~ 6550 1150
$Comp
L MCU_Module:Arduino_UNO_R3 A101
U 1 1 5F723E96
P 1900 4100
F 0 "A101" H 1550 5050 50  0000 C CNN
F 1 "Arduino_UNO_R3" V 1900 4100 50  0000 C CNN
F 2 "ProjectFootprints:ArduinoUNO_ProjectAdapted" H 2050 3050 50  0001 L CNN
F 3 "https://www.arduino.cc/en/Main/arduinoBoardUno" H 1700 5150 50  0001 C CNN
	1    1900 4100
	1    0    0    -1  
$EndComp
$Comp
L power:GND #PWR0101
U 1 1 5F726574
P 1900 5300
F 0 "#PWR0101" H 1900 5050 50  0001 C CNN
F 1 "GND" H 1905 5127 50  0001 C CNN
F 2 "" H 1900 5300 50  0001 C CNN
F 3 "" H 1900 5300 50  0001 C CNN
	1    1900 5300
	1    0    0    -1  
$EndComp
NoConn ~ 2400 3500
Wire Wire Line
	7050 2800 7050 2050
Wire Wire Line
	7050 2050 7550 2050
NoConn ~ 2400 4600
NoConn ~ 2400 4500
Wire Wire Line
	2400 3700 2450 3700
Text GLabel 2200 3050 2    50   Input ~ 0
VDD_PWR
Wire Wire Line
	2100 3100 2100 3050
Wire Wire Line
	2100 3050 2200 3050
Text GLabel 7000 1650 0    50   Input ~ 0
VDD_PWR
Wire Wire Line
	7000 1650 7400 1650
$Comp
L Device:D D101
U 1 1 5F7B739A
P 7200 1750
F 0 "D101" H 7200 1534 50  0000 C CNN
F 1 "SL12" H 7200 1625 50  0000 C CNN
F 2 "Diodes_SMD:D_SMA" H 7200 1750 50  0001 C CNN
F 3 "~" H 7200 1750 50  0001 C CNN
F 4 "SL12" H 7200 1750 50  0001 C CNN "MPN"
	1    7200 1750
	-1   0    0    1   
$EndComp
Wire Wire Line
	7000 1750 7050 1750
Wire Wire Line
	7350 1750 7400 1750
Wire Wire Line
	7400 1750 7400 1650
Connection ~ 7400 1650
Wire Wire Line
	7400 1650 7550 1650
NoConn ~ 1400 3500
NoConn ~ 1400 3600
NoConn ~ 2400 3900
$Comp
L ProjectSymbols:PCAL6408APW U102
U 1 1 5F74CF5C
P 7650 3950
F 0 "U102" H 7650 4875 50  0000 C CNN
F 1 "PCAL6408APW" H 7650 4784 50  0000 C CNN
F 2 "Housings_SSOP:TSSOP-16_4.4x5mm_Pitch0.65mm" H 7650 3950 50  0001 C CNN
F 3 "" H 7650 3950 50  0001 C CNN
F 4 "PCAL6408APW" H 0   0   50  0001 C CNN "MPN"
F 5 "NXP" H 0   0   50  0001 C CNN "Manufacturer"
	1    7650 3950
	1    0    0    -1  
$EndComp
Wire Wire Line
	7050 3350 7000 3350
Wire Wire Line
	7000 3350 7000 3450
Wire Wire Line
	7000 3450 7050 3450
$Comp
L power:GND #PWR0112
U 1 1 5F758385
P 7000 3500
F 0 "#PWR0112" H 7000 3250 50  0001 C CNN
F 1 "GND" H 7005 3327 50  0001 C CNN
F 2 "" H 7000 3500 50  0001 C CNN
F 3 "" H 7000 3500 50  0001 C CNN
	1    7000 3500
	1    0    0    -1  
$EndComp
Wire Wire Line
	7000 3450 7000 3500
Connection ~ 7000 3450
Wire Wire Line
	7050 3250 6850 3250
Wire Wire Line
	6850 3250 6850 3300
Wire Wire Line
	6850 3250 6750 3250
Wire Wire Line
	6750 3250 6750 3300
Connection ~ 6850 3250
Wire Wire Line
	6750 3250 6650 3250
Connection ~ 6750 3250
Wire Wire Line
	6650 3250 6550 3250
Connection ~ 6650 3250
Wire Wire Line
	6350 3250 6400 3250
Connection ~ 6550 3250
$Comp
L power:+1V8 #PWR0115
U 1 1 5F78EB41
P 8300 3200
F 0 "#PWR0115" H 8300 3050 50  0001 C CNN
F 1 "+1V8" H 8315 3373 50  0000 C CNN
F 2 "" H 8300 3200 50  0001 C CNN
F 3 "" H 8300 3200 50  0001 C CNN
	1    8300 3200
	1    0    0    -1  
$EndComp
Wire Wire Line
	8300 3200 8300 3250
Wire Wire Line
	8300 3250 8250 3250
Wire Wire Line
	8400 3350 8400 3100
Wire Wire Line
	8400 3100 8800 3100
Wire Wire Line
	8800 3200 8450 3200
Wire Wire Line
	8450 3200 8450 3450
Wire Wire Line
	8800 3300 8500 3300
Wire Wire Line
	8500 3300 8500 3550
Wire Wire Line
	5900 3950 5900 2800
Wire Wire Line
	6000 4050 6000 2900
Wire Wire Line
	1900 5200 1900 5250
Wire Wire Line
	2000 5200 2000 5250
Wire Wire Line
	2000 5250 1900 5250
Connection ~ 1900 5250
Wire Wire Line
	1900 5250 1900 5300
Wire Wire Line
	1900 5250 1800 5250
Wire Wire Line
	1800 5250 1800 5200
$Comp
L Device:Q_PMOS_GSD Q101
U 1 1 5F8AA41F
P 6100 4550
F 0 "Q101" V 6350 4550 50  0000 C CNN
F 1 "IRLML6401" V 6441 4550 50  0000 C CNN
F 2 "TO_SOT_Packages_SMD:SOT-23" H 6300 4650 50  0001 C CNN
F 3 "~" H 6100 4550 50  0001 C CNN
	1    6100 4550
	0    1    1    0   
$EndComp
$Comp
L Device:C C102
U 1 1 5F8B6A2D
P 2300 1700
AR Path="/5F8B6A2D" Ref="C102"  Part="1" 
AR Path="/55AE8620/5F8B6A2D" Ref="C?"  Part="1" 
AR Path="/5F622C8F/5F8B6A2D" Ref="C?"  Part="1" 
AR Path="/5F6294E6/5F8B6A2D" Ref="C?"  Part="1" 
F 0 "C102" H 2300 1800 40  0000 L CNN
F 1 "10uF" H 2306 1615 40  0000 L CNN
F 2 "Capacitors_SMD:C_0805" H 2338 1550 30  0001 C CNN
F 3 "~" H 2300 1700 60  0000 C CNN
	1    2300 1700
	1    0    0    -1  
$EndComp
$Comp
L Device:C C106
U 1 1 5F8BD398
P 7200 4850
AR Path="/5F8BD398" Ref="C106"  Part="1" 
AR Path="/55AE8620/5F8BD398" Ref="C?"  Part="1" 
AR Path="/5F622C8F/5F8BD398" Ref="C?"  Part="1" 
AR Path="/5F6294E6/5F8BD398" Ref="C?"  Part="1" 
F 0 "C106" H 7200 4950 40  0000 L CNN
F 1 "1uF" H 7206 4765 40  0000 L CNN
F 2 "Capacitors_SMD:C_0603" H 7238 4700 30  0001 C CNN
F 3 "~" H 7200 4850 60  0000 C CNN
	1    7200 4850
	1    0    0    -1  
$EndComp
$Comp
L Device:C C101
U 1 1 5F8BD5DF
P 2100 1700
AR Path="/5F8BD5DF" Ref="C101"  Part="1" 
AR Path="/55AE8620/5F8BD5DF" Ref="C?"  Part="1" 
AR Path="/5F622C8F/5F8BD5DF" Ref="C?"  Part="1" 
AR Path="/5F6294E6/5F8BD5DF" Ref="C?"  Part="1" 
F 0 "C101" H 2100 1800 40  0000 L CNN
F 1 "10uF" H 2106 1615 40  0000 L CNN
F 2 "Capacitors_SMD:C_0805" H 2138 1550 30  0001 C CNN
F 3 "~" H 2100 1700 60  0000 C CNN
	1    2100 1700
	1    0    0    -1  
$EndComp
Wire Wire Line
	5900 4650 5850 4650
Wire Wire Line
	2300 1450 2300 1550
Wire Wire Line
	2300 1450 2100 1450
Wire Wire Line
	2100 1450 2100 1550
Connection ~ 2300 1450
Wire Wire Line
	2300 1850 2300 1950
$Comp
L power:GND #PWR0113
U 1 1 5F8E049A
P 7200 5050
F 0 "#PWR0113" H 7200 4800 50  0001 C CNN
F 1 "GND" H 7205 4877 50  0001 C CNN
F 2 "" H 7200 5050 50  0001 C CNN
F 3 "" H 7200 5050 50  0001 C CNN
	1    7200 5050
	1    0    0    -1  
$EndComp
Wire Wire Line
	7200 5000 7200 5050
Wire Wire Line
	6500 4300 6500 4750
Wire Wire Line
	6500 5150 6500 5200
Connection ~ 2100 1450
Wire Wire Line
	2100 1850 2100 1950
$Comp
L power:+3.3V #PWR0102
U 1 1 5F91DA98
P 2200 2950
F 0 "#PWR0102" H 2200 2800 50  0001 C CNN
F 1 "+3.3V" V 2200 3200 50  0000 C CNN
F 2 "" H 2200 2950 50  0001 C CNN
F 3 "" H 2200 2950 50  0001 C CNN
	1    2200 2950
	0    1    1    0   
$EndComp
Wire Wire Line
	2200 2950 2000 2950
Wire Wire Line
	2000 2950 2000 3100
$Comp
L power:+3.3V #PWR0103
U 1 1 5F926CAF
P 2050 1450
F 0 "#PWR0103" H 2050 1300 50  0001 C CNN
F 1 "+3.3V" V 2050 1700 50  0000 C CNN
F 2 "" H 2050 1450 50  0001 C CNN
F 3 "" H 2050 1450 50  0001 C CNN
	1    2050 1450
	0    -1   -1   0   
$EndComp
Wire Wire Line
	6600 4650 6600 4750
Wire Wire Line
	6600 4650 6700 4650
Wire Wire Line
	6700 4650 6700 4750
Connection ~ 6600 4650
Wire Wire Line
	6700 4650 6800 4650
Wire Wire Line
	6800 4650 6800 4750
Connection ~ 6700 4650
Wire Wire Line
	7200 4650 7200 4700
Wire Wire Line
	6800 4650 6900 4650
Connection ~ 7200 4650
Wire Wire Line
	2050 1450 2100 1450
Wire Wire Line
	5850 5200 5850 4650
Wire Wire Line
	2500 1450 2450 1450
$Comp
L Device:R R101
U 1 1 5F9F38EC
P 6300 4300
F 0 "R101" V 6200 4300 50  0000 C CNN
F 1 "100" V 6300 4300 50  0000 C CNN
F 2 "Resistors_SMD:R_0603" V 6230 4300 50  0001 C CNN
F 3 "~" H 6300 4300 50  0001 C CNN
	1    6300 4300
	0    1    1    0   
$EndComp
Wire Wire Line
	6300 4650 6600 4650
Text GLabel 4850 3250 2    50   Input ~ 0
VDD_IO
Text GLabel 2450 3700 2    50   Input ~ 0
VDD_IO
Text GLabel 6350 3250 0    50   Input ~ 0
VDD_IO
$Comp
L Connector:Micro_SD_Card_Det J102
U 1 1 5FAF84B1
P 8600 5600
F 0 "J102" H 8550 6417 50  0000 C CNN
F 1 "MicroSD" H 8550 6326 50  0000 C CNN
F 2 "ProjectFootprints:Molex_SD-47309-201" H 10650 6300 50  0001 C CNN
F 3 "" H 8600 5700 50  0001 C CNN
F 4 "47309-201" H 0   0   50  0001 C CNN "MPN"
F 5 "Molex" H 0   0   50  0001 C CNN "Manufacturer"
	1    8600 5600
	1    0    0    -1  
$EndComp
Wire Wire Line
	7650 4650 7650 5500
$Comp
L power:GND #PWR0114
U 1 1 5FB52396
P 7650 6150
F 0 "#PWR0114" H 7650 5900 50  0001 C CNN
F 1 "GND" H 7655 5977 50  0001 C CNN
F 2 "" H 7650 6150 50  0001 C CNN
F 3 "" H 7650 6150 50  0001 C CNN
	1    7650 6150
	1    0    0    -1  
$EndComp
Wire Wire Line
	7700 5700 7650 5700
Wire Wire Line
	7650 5700 7650 6000
Wire Wire Line
	7700 6000 7650 6000
Connection ~ 7650 6000
Wire Wire Line
	7650 6000 7650 6150
Wire Wire Line
	7650 5500 7700 5500
Wire Wire Line
	6800 5400 7700 5400
Wire Wire Line
	6900 5300 7700 5300
Wire Wire Line
	7700 6100 7600 6100
$Comp
L Device:R R?
U 1 1 5FC354B3
P 9650 6000
AR Path="/5F6294E6/5FC354B3" Ref="R?"  Part="1" 
AR Path="/5FC354B3" Ref="R102"  Part="1" 
F 0 "R102" V 9750 6000 50  0000 C CNN
F 1 "1M" V 9650 6000 50  0000 C CNN
F 2 "Resistors_SMD:R_0603" V 9580 6000 50  0001 C CNN
F 3 "~" H 9650 6000 50  0001 C CNN
	1    9650 6000
	0    1    -1   0   
$EndComp
Wire Wire Line
	9800 6200 9850 6200
Wire Wire Line
	9850 6000 9800 6000
$Comp
L power:GND #PWR?
U 1 1 5FC354BF
P 9850 6250
AR Path="/5F6294E6/5FC354BF" Ref="#PWR?"  Part="1" 
AR Path="/5FC354BF" Ref="#PWR0116"  Part="1" 
F 0 "#PWR0116" H 9850 6000 50  0001 C CNN
F 1 "GND" H 9855 6077 50  0001 C CNN
F 2 "" H 9850 6250 50  0001 C CNN
F 3 "" H 9850 6250 50  0001 C CNN
	1    9850 6250
	1    0    0    -1  
$EndComp
$Comp
L Device:C C107
U 1 1 5FC354C8
P 9650 6200
AR Path="/5FC354C8" Ref="C107"  Part="1" 
AR Path="/559EC5B3/5FC354C8" Ref="C?"  Part="1" 
AR Path="/5F6294E6/5FC354C8" Ref="C?"  Part="1" 
F 0 "C107" V 9700 6250 40  0000 L CNN
F 1 "10nF" V 9750 6250 40  0000 L CNN
F 2 "Capacitors_SMD:C_0603" H 9688 6050 30  0001 C CNN
F 3 "~" H 9650 6200 60  0000 C CNN
	1    9650 6200
	0    -1   1    0   
$EndComp
Wire Wire Line
	9850 6000 9850 6200
Wire Wire Line
	9850 6200 9850 6250
Connection ~ 9850 6200
Wire Wire Line
	9400 6100 9450 6100
Wire Wire Line
	9450 6100 9450 6000
Wire Wire Line
	9450 6000 9500 6000
Wire Wire Line
	9450 6100 9450 6200
Wire Wire Line
	9450 6200 9500 6200
Connection ~ 9450 6100
Text Label 7200 5400 0    50   ~ 0
SD_SI
Text Label 7200 5300 0    50   ~ 0
~SD_CS~
Text Label 7200 5600 0    50   ~ 0
SD_CLK
Text Label 7200 5800 0    50   ~ 0
SD_SO
Text Label 3200 4550 0    50   ~ 0
T_MISO
Wire Wire Line
	7600 6100 7600 4400
Wire Wire Line
	7600 4400 8350 4400
Wire Wire Line
	8350 4400 8350 3850
$Comp
L Regulator_Linear:TPS79318-EP U101
U 1 1 5FC33050
P 2800 1550
F 0 "U101" H 2800 1892 50  0000 C CNN
F 1 "TPS79318-EP" H 2800 1801 50  0000 C CNN
F 2 "TO_SOT_Packages_SMD:SOT-23-5" H 2800 1875 50  0001 C CIN
F 3 "http://www.ti.com/lit/ds/symlink/tps79333-ep.pdf" H 2800 1600 50  0001 C CNN
F 4 "TPS79318DBVR-Q1" H -1300 50  50  0001 C CNN "MPN"
F 5 "Texas Instruments" H -1300 50  50  0001 C CNN "Manufacturer"
	1    2800 1550
	1    0    0    -1  
$EndComp
Wire Wire Line
	6500 4300 8300 4300
Connection ~ 6500 4300
Wire Wire Line
	6450 4300 6500 4300
Wire Wire Line
	5850 5200 6500 5200
Wire Wire Line
	2450 1450 2450 1550
Wire Wire Line
	2450 1550 2500 1550
Connection ~ 2450 1450
Wire Wire Line
	2450 1450 2300 1450
$Comp
L power:GND #PWR0105
U 1 1 5FCCEA1E
P 2800 2000
F 0 "#PWR0105" H 2800 1750 50  0001 C CNN
F 1 "GND" H 2805 1827 50  0001 C CNN
F 2 "" H 2800 2000 50  0001 C CNN
F 3 "" H 2800 2000 50  0001 C CNN
	1    2800 2000
	1    0    0    -1  
$EndComp
Wire Wire Line
	2800 1850 2800 1950
$Comp
L power:+3.3V #PWR0109
U 1 1 5FD04175
P 5850 4600
F 0 "#PWR0109" H 5850 4450 50  0001 C CNN
F 1 "+3.3V" V 5850 4850 50  0000 C CNN
F 2 "" H 5850 4600 50  0001 C CNN
F 3 "" H 5850 4600 50  0001 C CNN
	1    5850 4600
	1    0    0    -1  
$EndComp
Wire Wire Line
	5850 4600 5850 4650
Connection ~ 5850 4650
Wire Wire Line
	2100 1950 2300 1950
Wire Wire Line
	2300 1950 2800 1950
Connection ~ 2300 1950
Connection ~ 2800 1950
Wire Wire Line
	2800 1950 2800 2000
Wire Wire Line
	2800 1950 3150 1950
Wire Wire Line
	3150 1950 3150 1900
Wire Wire Line
	3100 1550 3150 1550
Wire Wire Line
	3150 1550 3150 1600
$Comp
L Device:C C103
U 1 1 5FDFF9A2
P 3150 1750
AR Path="/5FDFF9A2" Ref="C103"  Part="1" 
AR Path="/55AE8620/5FDFF9A2" Ref="C?"  Part="1" 
AR Path="/5F622C8F/5FDFF9A2" Ref="C?"  Part="1" 
AR Path="/5F6294E6/5FDFF9A2" Ref="C?"  Part="1" 
F 0 "C103" H 3150 1850 40  0000 L CNN
F 1 "100nF" H 3156 1665 40  0000 L CNN
F 2 "Capacitors_SMD:C_0603" H 3188 1600 30  0001 C CNN
F 3 "~" H 3150 1750 60  0000 C CNN
	1    3150 1750
	1    0    0    -1  
$EndComp
$Comp
L Device:C C104
U 1 1 5FDFFBE8
P 3400 1700
AR Path="/5FDFFBE8" Ref="C104"  Part="1" 
AR Path="/55AE8620/5FDFFBE8" Ref="C?"  Part="1" 
AR Path="/5F622C8F/5FDFFBE8" Ref="C?"  Part="1" 
AR Path="/5F6294E6/5FDFFBE8" Ref="C?"  Part="1" 
F 0 "C104" H 3400 1800 40  0000 L CNN
F 1 "10uF" H 3406 1615 40  0000 L CNN
F 2 "Capacitors_SMD:C_0805" H 3438 1550 30  0001 C CNN
F 3 "~" H 3400 1700 60  0000 C CNN
	1    3400 1700
	1    0    0    -1  
$EndComp
Wire Wire Line
	3100 1450 3400 1450
Wire Wire Line
	3400 1450 3400 1550
Wire Wire Line
	3150 1950 3400 1950
Wire Wire Line
	3400 1950 3400 1850
Connection ~ 3150 1950
$Comp
L power:+1V8 #PWR0107
U 1 1 5FE250EC
P 3450 1450
F 0 "#PWR0107" H 3450 1300 50  0001 C CNN
F 1 "+1V8" V 3450 1650 50  0000 C CNN
F 2 "" H 3450 1450 50  0001 C CNN
F 3 "" H 3450 1450 50  0001 C CNN
	1    3450 1450
	0    1    1    0   
$EndComp
Wire Wire Line
	3400 1450 3450 1450
Connection ~ 3400 1450
Wire Wire Line
	5800 2550 5800 3850
Connection ~ 6800 4650
Wire Wire Line
	6150 4300 6100 4300
Wire Wire Line
	6100 4300 6100 4350
$Comp
L Device:R_Pack02 RN105
U 1 1 605ED981
P 6600 4950
F 0 "RN105" V 6550 5400 50  0000 C CNN
F 1 "100k" V 6400 4950 50  0000 C CNN
F 2 "Resistors_SMD:R_Array_Convex_2x0402" V 6775 4950 50  0001 C CNN
F 3 "~" H 6600 4950 50  0001 C CNN
	1    6600 4950
	1    0    0    -1  
$EndComp
Wire Wire Line
	7000 4750 7000 4650
Connection ~ 7000 4650
Wire Wire Line
	7000 4650 7200 4650
Wire Wire Line
	7700 5200 7000 5200
Wire Wire Line
	7000 5200 7000 5150
Wire Wire Line
	6900 5150 6900 5300
Wire Wire Line
	6800 5150 6800 5400
Wire Wire Line
	6700 5150 6700 5500
Wire Wire Line
	7100 5800 7700 5800
Wire Wire Line
	7700 5900 6600 5900
Wire Wire Line
	6900 4750 6900 4650
Connection ~ 6900 4650
Wire Wire Line
	6900 4650 7000 4650
$Comp
L ProjectSymbols:Teensy_Small X101
U 1 1 5F7C5CB4
P 3900 3950
F 0 "X101" H 3900 4875 50  0000 C CNN
F 1 "Teensy_Small" H 3900 4784 50  0000 C CNN
F 2 "ProjectFootprints:Module_Teensy_Small" H 2900 4150 50  0001 C CNN
F 3 "" H 2900 4150 50  0001 C CNN
	1    3900 3950
	1    0    0    -1  
$EndComp
Text Label 3200 4450 0    50   ~ 0
T_MOSI
Wire Wire Line
	4450 3450 4300 3450
Wire Wire Line
	5150 3550 4300 3550
Wire Wire Line
	4300 3650 5150 3650
Text Label 1150 4400 0    50   ~ 0
~INT~
Wire Wire Line
	4300 3350 4550 3350
Wire Wire Line
	4550 3350 4550 3400
Wire Wire Line
	1800 2850 4350 2850
Wire Wire Line
	4350 2850 4350 3250
Wire Wire Line
	4350 3250 4300 3250
Wire Wire Line
	1800 2850 1800 3100
$Comp
L power:GND #PWR0104
U 1 1 5F7AC0E5
P 3400 3300
F 0 "#PWR0104" H 3400 3050 50  0001 C CNN
F 1 "GND" H 3405 3127 50  0001 C CNN
F 2 "" H 3400 3300 50  0001 C CNN
F 3 "" H 3400 3300 50  0001 C CNN
	1    3400 3300
	1    0    0    -1  
$EndComp
Wire Wire Line
	3400 3300 3400 3250
Wire Wire Line
	3400 3250 3500 3250
NoConn ~ 3500 3350
NoConn ~ 3500 3450
Wire Wire Line
	2900 3650 3500 3650
Wire Wire Line
	2900 3550 3500 3550
Wire Wire Line
	2900 3750 3500 3750
Wire Wire Line
	2900 3850 3500 3850
Wire Wire Line
	2900 4250 3500 4250
Wire Wire Line
	3100 4350 3500 4350
Wire Wire Line
	3500 4450 3150 4450
Wire Wire Line
	3500 4550 3200 4550
Entry Wire Line
	2800 3450 2900 3550
Entry Wire Line
	2800 3550 2900 3650
Entry Wire Line
	2800 3650 2900 3750
Entry Wire Line
	2800 3750 2900 3850
Entry Wire Line
	2800 4150 2900 4250
Entry Wire Line
	5150 3550 5250 3450
Entry Wire Line
	5150 3650 5250 3550
Entry Wire Line
	5150 4550 5250 4450
Wire Bus Line
	2800 2950 5250 2950
Wire Wire Line
	4450 4800 4450 4050
Wire Wire Line
	4450 4050 4300 4050
Wire Wire Line
	2400 4800 4450 4800
Wire Wire Line
	2400 4900 4500 4900
Wire Wire Line
	5350 1450 5950 1450
Text Label 5400 1250 0    50   ~ 0
T4_BCLK2
Text Label 5400 1350 0    50   ~ 0
T4_LRCLK2
Text Label 5400 1450 0    50   ~ 0
T4_DOUT2
Text Label 5400 1150 0    50   ~ 0
T4_DIN2
Wire Wire Line
	6350 1250 6500 1250
Wire Wire Line
	6500 1250 6500 1950
Wire Wire Line
	6500 1950 6350 1950
Connection ~ 6500 1250
Wire Wire Line
	6500 1250 7550 1250
Wire Wire Line
	6350 1350 6450 1350
Wire Wire Line
	6350 1450 6400 1450
Wire Wire Line
	6450 1350 6450 1850
Wire Wire Line
	6450 1850 6350 1850
Connection ~ 6450 1350
Wire Wire Line
	6450 1350 7550 1350
Wire Wire Line
	6400 1450 6400 1750
Wire Wire Line
	6400 1750 6350 1750
Connection ~ 6400 1450
Wire Wire Line
	6400 1450 7550 1450
Text Label 5400 1850 0    50   ~ 0
T3_LRCLK
Text Label 5400 1750 0    50   ~ 0
T3_DOUT
Text Label 5400 2050 0    50   ~ 0
T4_SCK_T3_DIN
Text Label 5400 1950 0    50   ~ 0
T3_BCLK
Connection ~ 6800 5400
Connection ~ 6900 5300
Connection ~ 6700 5500
Text Label 4700 5500 0    50   ~ 0
T_MISO
Text Label 4700 5400 0    50   ~ 0
T_MOSI
Text Label 4700 5300 0    50   ~ 0
T_CS
Text Label 4700 5600 0    50   ~ 0
T3_SCK
Wire Wire Line
	5550 5600 5750 5600
Connection ~ 5750 5600
Wire Wire Line
	5750 5600 7700 5600
Wire Wire Line
	5550 5300 5700 5300
Wire Wire Line
	5550 5400 5650 5400
Wire Wire Line
	5550 5500 5600 5500
Wire Wire Line
	4400 4450 4300 4450
Wire Wire Line
	3200 4550 3200 5500
Wire Wire Line
	3200 5500 5100 5500
Wire Wire Line
	3150 4450 3150 5400
Wire Wire Line
	3150 5400 5050 5400
Wire Wire Line
	3100 4350 3100 5300
Wire Wire Line
	3100 5300 5000 5300
Connection ~ 5900 3950
Connection ~ 6000 4050
Wire Wire Line
	5800 2550 3000 2550
Wire Wire Line
	1100 4400 1400 4400
Connection ~ 5800 2550
Wire Wire Line
	4300 3950 4500 3950
Wire Wire Line
	4450 4050 6000 4050
Connection ~ 4450 4050
Wire Wire Line
	4500 4900 4500 3950
Connection ~ 4500 3950
Wire Wire Line
	4500 3950 5900 3950
Wire Wire Line
	5900 2800 7050 2800
Connection ~ 7050 2800
Wire Wire Line
	6000 2900 7150 2900
Wire Wire Line
	7050 2800 8700 2800
Wire Wire Line
	7150 2150 7150 2900
Wire Wire Line
	7150 2150 7550 2150
Connection ~ 7150 2900
Wire Wire Line
	7150 2900 8750 2900
Connection ~ 5250 2950
Wire Wire Line
	8400 2250 8800 2250
Wire Wire Line
	8400 2350 8800 2350
Wire Wire Line
	8800 2450 8400 2450
Text Label 3050 3950 0    50   ~ 0
~INT~
Wire Wire Line
	3000 3950 3000 2550
Wire Wire Line
	3000 3950 3500 3950
Connection ~ 3000 2550
Wire Wire Line
	3000 2550 1100 2550
Wire Wire Line
	5800 2550 7550 2550
$Comp
L Device:R_Pack02 RN107
U 1 1 5F7D5CA3
P 6800 4950
F 0 "RN107" V 6750 5400 50  0000 C CNN
F 1 "100k" V 6800 5450 50  0001 C CNN
F 2 "Resistors_SMD:R_Array_Convex_2x0402" V 6975 4950 50  0001 C CNN
F 3 "~" H 6800 4950 50  0001 C CNN
	1    6800 4950
	1    0    0    -1  
$EndComp
$Comp
L Device:R_Pack02 RN109
U 1 1 5F7D5CE3
P 7000 4950
F 0 "RN109" V 6950 5400 50  0000 C CNN
F 1 "100k" V 7000 5450 50  0001 C CNN
F 2 "Resistors_SMD:R_Array_Convex_2x0402" V 7175 4950 50  0001 C CNN
F 3 "~" H 7000 4950 50  0001 C CNN
	1    7000 4950
	1    0    0    -1  
$EndComp
Wire Wire Line
	7200 4650 7650 4650
Wire Wire Line
	5900 3950 6850 3950
Wire Wire Line
	6000 4050 6750 4050
Wire Wire Line
	6750 3700 6750 4050
Connection ~ 6750 4050
Wire Wire Line
	6750 4050 7050 4050
Wire Wire Line
	6850 3700 6850 3950
Connection ~ 6850 3950
Wire Wire Line
	6850 3950 7050 3950
Wire Wire Line
	5800 3850 6550 3850
Wire Wire Line
	7050 3750 6650 3750
Connection ~ 6550 3850
Wire Wire Line
	6550 3850 7050 3850
Wire Wire Line
	4400 4450 4400 5600
Wire Wire Line
	4400 5600 5150 5600
$Comp
L power:+3.3V #PWR0108
U 1 1 5F811119
P 4800 3100
F 0 "#PWR0108" H 4800 2950 50  0001 C CNN
F 1 "+3.3V" V 4800 3350 50  0000 C CNN
F 2 "" H 4800 3100 50  0001 C CNN
F 3 "" H 4800 3100 50  0001 C CNN
	1    4800 3100
	0    1    1    0   
$EndComp
$Comp
L power:+3.3V #PWR0111
U 1 1 5F81180E
P 7000 1750
F 0 "#PWR0111" H 7000 1600 50  0001 C CNN
F 1 "+3.3V" V 7000 2000 50  0000 C CNN
F 2 "" H 7000 1750 50  0001 C CNN
F 3 "" H 7000 1750 50  0001 C CNN
	1    7000 1750
	0    -1   -1   0   
$EndComp
Wire Wire Line
	4450 3450 4450 3250
Wire Wire Line
	4450 3250 4500 3250
Wire Wire Line
	4450 3250 4450 3100
Wire Wire Line
	4450 3100 4800 3100
Connection ~ 4450 3250
Wire Wire Line
	4800 3250 4850 3250
Wire Wire Line
	1100 2550 1100 4400
NoConn ~ 1400 3700
NoConn ~ 1400 3800
NoConn ~ 1400 3900
NoConn ~ 1400 4000
NoConn ~ 1400 4100
NoConn ~ 1400 4200
NoConn ~ 1400 4300
NoConn ~ 1400 4500
NoConn ~ 1400 4600
NoConn ~ 1400 4700
NoConn ~ 1400 4800
NoConn ~ 2400 4100
NoConn ~ 2400 4200
NoConn ~ 2400 4300
NoConn ~ 2400 4400
NoConn ~ 4300 3750
NoConn ~ 4300 3850
NoConn ~ 4300 4150
NoConn ~ 4300 4250
NoConn ~ 4300 4350
$Comp
L Device:R_Pack02 RN108
U 1 1 5FA5B781
P 6850 3500
AR Path="/5FA5B781" Ref="RN108"  Part="1" 
AR Path="/5F6294E6/5FA5B781" Ref="RN?"  Part="1" 
F 0 "RN108" V 6750 3800 50  0000 L CNN
F 1 "3.3k" V 6850 3800 50  0000 L CNN
F 2 "Resistors_SMD:R_Array_Convex_2x0402" V 7025 3500 50  0001 C CNN
F 3 "~" H 6850 3500 50  0001 C CNN
	1    6850 3500
	1    0    0    -1  
$EndComp
$Comp
L Mechanical:MountingHole H101
U 1 1 5FB5E8C0
P 10900 700
F 0 "H101" H 11000 746 50  0000 L CNN
F 1 "M2" H 11000 655 50  0000 L CNN
F 2 "Mounting_Holes:MountingHole_2.2mm_M2_ISO7380" H 10900 700 50  0001 C CNN
F 3 "~" H 10900 700 50  0001 C CNN
	1    10900 700 
	1    0    0    -1  
$EndComp
Wire Wire Line
	8400 2550 8550 2550
$Comp
L Connector_Generic:Conn_01x01 J101
U 1 1 5F8436A8
P 3700 4650
F 0 "J101" H 3780 4646 50  0000 L CNN
F 1 "~" H 3780 4601 50  0000 L CNN
F 2 "Pin_Headers:Pin_Header_Straight_1x01_Pitch2.54mm" H 3700 4650 50  0001 C CNN
F 3 "~" H 3700 4650 50  0001 C CNN
	1    3700 4650
	1    0    0    -1  
$EndComp
Wire Wire Line
	3500 4650 3450 4650
Wire Wire Line
	3450 4650 3450 5600
Wire Wire Line
	3450 5600 4400 5600
Connection ~ 4400 5600
$Comp
L Device:R_Pack02 RN102
U 1 1 5F85575B
P 5350 5800
AR Path="/5F85575B" Ref="RN102"  Part="1" 
AR Path="/5F6294E6/5F85575B" Ref="RN?"  Part="1" 
F 0 "RN102" V 5150 5800 50  0000 C CNN
F 1 "n.p" V 5550 5750 50  0001 L CNN
F 2 "Resistors_SMD:R_Array_Convex_2x0603" V 5525 5800 50  0001 C CNN
F 3 "~" H 5350 5800 50  0001 C CNN
F 4 "Custom board MMC Bus" H -150 100 50  0001 C CNN "Comment"
	1    5350 5800
	0    1    -1   0   
$EndComp
Wire Wire Line
	7000 5200 7000 5800
Wire Wire Line
	7000 5800 5550 5800
Connection ~ 7000 5200
Wire Wire Line
	5550 5900 6600 5900
Connection ~ 6600 5900
Wire Wire Line
	6600 5900 6600 5150
Wire Wire Line
	3500 4150 3050 4150
Wire Wire Line
	3050 4150 3050 5800
Wire Wire Line
	3050 5800 5150 5800
Wire Wire Line
	3500 4050 3000 4050
Wire Wire Line
	3000 4050 3000 5900
Wire Wire Line
	3000 5900 5150 5900
Wire Wire Line
	8500 3550 8250 3550
Wire Wire Line
	8450 3450 8250 3450
Wire Wire Line
	8250 3350 8400 3350
Wire Wire Line
	8550 2550 8550 3950
$Comp
L Device:C C105
U 1 1 5F8B89BC
P 6400 3500
AR Path="/5F8B89BC" Ref="C105"  Part="1" 
AR Path="/55AE8620/5F8B89BC" Ref="C?"  Part="1" 
AR Path="/5F622C8F/5F8B89BC" Ref="C?"  Part="1" 
AR Path="/5F6294E6/5F8B89BC" Ref="C?"  Part="1" 
F 0 "C105" H 6350 3600 40  0000 R CNN
F 1 "100nF" H 6350 3400 40  0000 R CNN
F 2 "Capacitors_SMD:C_0603" H 6438 3350 30  0001 C CNN
F 3 "~" H 6400 3500 60  0000 C CNN
	1    6400 3500
	1    0    0    -1  
$EndComp
Wire Wire Line
	6400 3250 6400 3350
Connection ~ 6400 3250
Wire Wire Line
	6400 3250 6550 3250
$Comp
L power:GND #PWR?
U 1 1 5F983FD3
P 6400 3700
AR Path="/5F6294E6/5F983FD3" Ref="#PWR?"  Part="1" 
AR Path="/5F983FD3" Ref="#PWR0110"  Part="1" 
F 0 "#PWR0110" H 6400 3450 50  0001 C CNN
F 1 "GND" H 6405 3527 50  0001 C CNN
F 2 "" H 6400 3700 50  0001 C CNN
F 3 "" H 6400 3700 50  0001 C CNN
	1    6400 3700
	1    0    0    -1  
$EndComp
Wire Wire Line
	6400 3650 6400 3700
Wire Wire Line
	8250 3850 8350 3850
Text Notes 7350 4200 0    50   ~ 0
I2C Addr 0x20
NoConn ~ 8250 3650
NoConn ~ 8250 3750
$Comp
L Memory_EEPROM:24AA02-OT U103
U 1 1 5F955E5A
P 9200 4050
F 0 "U103" H 9100 4400 50  0000 R CNN
F 1 "64CW1280" H 9100 4300 50  0000 R CNN
F 2 "TO_SOT_Packages_SMD:SOT-23-5" H 9200 4050 50  0001 C CNN
F 3 "http://ww1.microchip.com/downloads/en/DeviceDoc/21709J.pdf" H 9200 4050 50  0001 C CNN
	1    9200 4050
	-1   0    0    -1  
$EndComp
Text GLabel 9150 3700 0    50   Input ~ 0
VDD_IO
Wire Wire Line
	9150 3700 9200 3700
Wire Wire Line
	9200 3700 9200 3750
$Comp
L power:GND #PWR0117
U 1 1 5F969386
P 9200 4400
F 0 "#PWR0117" H 9200 4150 50  0001 C CNN
F 1 "GND" H 9205 4227 50  0001 C CNN
F 2 "" H 9200 4400 50  0001 C CNN
F 3 "" H 9200 4400 50  0001 C CNN
	1    9200 4400
	1    0    0    -1  
$EndComp
Wire Wire Line
	9200 4350 9200 4400
Text Notes 8550 4350 0    50   ~ 0
I2C Addr 0x50
Wire Wire Line
	8750 2900 8750 3950
Wire Wire Line
	8750 3950 8800 3950
Connection ~ 8750 2900
Wire Wire Line
	8750 2900 8800 2900
Wire Wire Line
	8700 2800 8700 4050
Wire Wire Line
	8700 4050 8800 4050
Connection ~ 8700 2800
Wire Wire Line
	8700 2800 8800 2800
Wire Wire Line
	8550 3950 8250 3950
Wire Wire Line
	8250 4050 8300 4050
Wire Wire Line
	8300 4050 8300 4300
Wire Wire Line
	6550 3250 6550 3300
Wire Wire Line
	6650 3250 6650 3300
$Comp
L Device:R_Pack04 RN110
U 1 1 60A59A88
P 5350 5500
F 0 "RN110" V 5050 5500 50  0000 C CNN
F 1 "10" V 5550 5500 50  0000 C CNN
F 2 "Resistors_SMD:R_Array_Convex_4x0603" V 5625 5500 50  0001 C CNN
F 3 "~" H 5350 5500 50  0001 C CNN
	1    5350 5500
	0    1    1    0   
$EndComp
$Comp
L Device:R_Pack04 RN106
U 1 1 60A59D0C
P 5350 5000
F 0 "RN106" V 5050 5000 50  0000 C CNN
F 1 "10" V 6050 5000 50  0000 C CNN
F 2 "Resistors_SMD:R_Array_Convex_4x0603" V 5625 5000 50  0001 C CNN
F 3 "~" H 5350 5000 50  0001 C CNN
	1    5350 5000
	0    1    1    0   
$EndComp
Wire Wire Line
	5750 4800 5550 4800
Wire Wire Line
	5750 4800 5750 5600
Wire Wire Line
	5150 4800 5100 4800
Wire Wire Line
	5100 4800 5100 4550
Connection ~ 5100 4550
Wire Wire Line
	5100 4550 5150 4550
Wire Wire Line
	4300 4550 5100 4550
Wire Wire Line
	5550 4900 5700 4900
Wire Wire Line
	5700 4900 5700 5300
Connection ~ 5700 5300
Wire Wire Line
	5700 5300 6900 5300
Wire Wire Line
	5550 5000 5650 5000
Wire Wire Line
	5650 5000 5650 5400
Connection ~ 5650 5400
Wire Wire Line
	5650 5400 6800 5400
Wire Wire Line
	5550 5100 5600 5100
Wire Wire Line
	5600 5100 5600 5500
Connection ~ 5600 5500
Wire Wire Line
	5600 5500 6700 5500
Wire Wire Line
	5150 5100 5100 5100
Wire Wire Line
	5100 5100 5100 5500
Connection ~ 5100 5500
Wire Wire Line
	5100 5500 5150 5500
Wire Wire Line
	5150 5000 5050 5000
Wire Wire Line
	5050 5000 5050 5400
Connection ~ 5050 5400
Wire Wire Line
	5050 5400 5150 5400
Wire Wire Line
	5150 4900 5000 4900
Wire Wire Line
	5000 4900 5000 5300
Connection ~ 5000 5300
Wire Wire Line
	5000 5300 5150 5300
Wire Wire Line
	7100 5800 7100 5500
Wire Wire Line
	7100 5500 6700 5500
$Comp
L Device:R_Pack02 RN101
U 1 1 60D5996A
P 6550 3500
AR Path="/60D5996A" Ref="RN101"  Part="1" 
AR Path="/5F6294E6/60D5996A" Ref="RN?"  Part="1" 
F 0 "RN101" V 6550 3800 50  0000 L CNN
F 1 "10k" V 6450 3800 50  0000 L CNN
F 2 "Resistors_SMD:R_Array_Convex_2x0402" V 6725 3500 50  0001 C CNN
F 3 "~" H 6550 3500 50  0001 C CNN
	1    6550 3500
	-1   0    0    -1  
$EndComp
Wire Wire Line
	6550 3700 6550 3850
Wire Wire Line
	6650 3700 6650 3750
$Comp
L Jumper:SolderJumper_2_Open JP101
U 1 1 5F821D4E
P 4650 3250
F 0 "JP101" H 4650 3350 50  0000 C CNN
F 1 "SolderJumper_2_Open" H 4650 3364 50  0001 C CNN
F 2 "Jumper:SolderJumper-2_P1.3mm_Open_RoundedPad1.0x1.5mm" H 4650 3250 50  0001 C CNN
F 3 "~" H 4650 3250 50  0001 C CNN
	1    4650 3250
	1    0    0    -1  
$EndComp
$Comp
L ProjectSymbols:Q_DUAL_NMOS_S1G1D2S2G2D1 Q?
U 1 1 60A46DDA
P 4650 1650
AR Path="/5F6294E6/60A46DDA" Ref="Q?"  Part="1" 
AR Path="/5F622C8F/60A46DDA" Ref="Q?"  Part="1" 
AR Path="/60A46DDA" Ref="Q201"  Part="1" 
F 0 "Q201" V 4900 1650 50  0000 C CNN
F 1 "EM6K34" V 5000 1600 50  0000 C CNN
F 2 "ProjectFootprints:SOT-563" H 4850 1650 50  0001 C CNN
F 3 "~" H 4850 1650 50  0001 C CNN
F 4 "EM6K34" H 4650 1650 50  0001 C CNN "MPN"
F 5 "Rohm" H -2050 -2350 50  0001 C CNN "Manufacturer"
	1    4650 1650
	0    1    -1   0   
$EndComp
$Comp
L ProjectSymbols:Q_DUAL_NMOS_S1G1D2S2G2D1 Q?
U 2 1 60A46DE3
P 4900 1300
AR Path="/5F6294E6/60A46DE3" Ref="Q?"  Part="2" 
AR Path="/5F622C8F/60A46DE3" Ref="Q?"  Part="2" 
AR Path="/60A46DE3" Ref="Q201"  Part="2" 
F 0 "Q201" V 5150 1300 50  0000 C CNN
F 1 "EM6K34" V 5241 1300 50  0001 C CNN
F 2 "ProjectFootprints:SOT-563" H 5100 1300 50  0001 C CNN
F 3 "~" H 5100 1300 50  0001 C CNN
F 4 "EM6K34" H -2050 -2900 50  0001 C CNN "MPN"
F 5 "Rohm" H -2050 -2900 50  0001 C CNN "Manufacturer"
	2    4900 1300
	0    -1   -1   0   
$EndComp
$Comp
L Device:R R?
U 1 1 60A46DEA
P 4450 1900
AR Path="/5F6294E6/60A46DEA" Ref="R?"  Part="1" 
AR Path="/5F622C8F/60A46DEA" Ref="R?"  Part="1" 
AR Path="/60A46DEA" Ref="R207"  Part="1" 
F 0 "R207" V 4300 1900 40  0000 C CNN
F 1 "10k" V 4450 1900 40  0000 C CNN
F 2 "Resistors_SMD:R_0402_NoSilk" V 4380 1900 30  0001 C CNN
F 3 "~" H 4450 1900 30  0000 C CNN
	1    4450 1900
	0    1    -1   0   
$EndComp
Wire Wire Line
	4650 1850 4650 1900
Wire Wire Line
	4650 1900 4900 1900
Wire Wire Line
	4900 1900 4900 1550
Wire Wire Line
	4900 1550 4850 1550
Wire Wire Line
	4900 1500 4900 1550
Connection ~ 4900 1550
$Comp
L power:+3.3V #PWR?
U 1 1 60A46DF8
P 4250 1550
AR Path="/5F622C8F/60A46DF8" Ref="#PWR?"  Part="1" 
AR Path="/60A46DF8" Ref="#PWR0118"  Part="1" 
F 0 "#PWR0118" H 4250 1400 50  0001 C CNN
F 1 "+3.3V" V 4265 1678 50  0000 L CNN
F 2 "" H 4250 1550 50  0001 C CNN
F 3 "" H 4250 1550 50  0001 C CNN
	1    4250 1550
	0    -1   1    0   
$EndComp
Wire Wire Line
	4250 1550 4450 1550
Wire Wire Line
	4650 1200 4700 1200
Wire Wire Line
	4250 1900 4300 1900
Wire Wire Line
	4600 1900 4650 1900
Connection ~ 4650 1900
Text GLabel 4250 950  0    50   Input ~ 0
VDD_IO
Text GLabel 4250 1900 0    50   Input ~ 0
VDD_PWR
$Comp
L Jumper:SolderJumper_2_Open JP102
U 1 1 60BC5DE8
P 4900 950
F 0 "JP102" H 4900 1050 50  0000 C CNN
F 1 "SolderJumper_2_Open" H 4900 1064 50  0001 C CNN
F 2 "Jumper:SolderJumper-2_P1.3mm_Open_RoundedPad1.0x1.5mm" H 4900 950 50  0001 C CNN
F 3 "~" H 4900 950 50  0001 C CNN
	1    4900 950 
	1    0    0    -1  
$EndComp
Wire Wire Line
	4750 950  4650 950 
Wire Wire Line
	4650 950  4650 1200
Wire Wire Line
	4650 950  4250 950 
Connection ~ 4650 950 
Wire Wire Line
	5100 1200 5150 1200
Wire Wire Line
	5150 1200 5150 950 
Wire Wire Line
	5150 950  7550 950 
Wire Wire Line
	5150 950  5050 950 
Connection ~ 5150 950 
Wire Bus Line
	5250 2950 5250 4450
Wire Bus Line
	2800 2950 2800 4150
Wire Bus Line
	5250 1250 5250 2950
$EndSCHEMATC
