(module Module_Teensy_Small (layer F.Cu) (tedit 5F798C1E)
  (fp_text reference REF** (at 0 0.5) (layer F.SilkS)
    (effects (font (size 1 1) (thickness 0.15)))
  )
  (fp_text value Module_Teensy_Small (at 0 -0.5) (layer F.Fab)
    (effects (font (size 1 1) (thickness 0.15)))
  )
  (fp_line (start -8.89 -19.05) (end -6.35 -19.05) (layer F.Fab) (width 0.1))
  (fp_line (start -6.35 -19.05) (end -6.35 16.51) (layer F.Fab) (width 0.1))
  (fp_line (start -6.35 16.51) (end -8.89 16.51) (layer F.Fab) (width 0.1))
  (fp_line (start -8.89 16.51) (end -8.89 -19.05) (layer F.Fab) (width 0.1))
  (fp_line (start 6.35 -19.05) (end 8.89 -19.05) (layer F.Fab) (width 0.1))
  (fp_line (start 8.89 -19.05) (end 8.89 16.51) (layer F.Fab) (width 0.1))
  (fp_line (start 8.89 16.51) (end 6.35 16.51) (layer F.Fab) (width 0.1))
  (fp_line (start 6.35 16.51) (end 6.35 -19.05) (layer F.Fab) (width 0.1))
  (pad 1 thru_hole circle (at -7.62 -17.78) (size 1.508 1.508) (drill 1) (layers *.Cu *.Mask))
  (pad 2 thru_hole circle (at -7.62 -15.24) (size 1.508 1.508) (drill 1) (layers *.Cu *.Mask))
  (pad 3 thru_hole circle (at -7.62 -12.7) (size 1.508 1.508) (drill 1) (layers *.Cu *.Mask))
  (pad 4 thru_hole circle (at -7.62 -10.16) (size 1.508 1.508) (drill 1) (layers *.Cu *.Mask))
  (pad 5 thru_hole circle (at -7.62 -7.62) (size 1.508 1.508) (drill 1) (layers *.Cu *.Mask))
  (pad 6 thru_hole circle (at -7.62 -5.08) (size 1.508 1.508) (drill 1) (layers *.Cu *.Mask))
  (pad 7 thru_hole circle (at -7.62 -2.54) (size 1.508 1.508) (drill 1) (layers *.Cu *.Mask))
  (pad 8 thru_hole circle (at -7.62 0) (size 1.508 1.508) (drill 1) (layers *.Cu *.Mask))
  (pad 9 thru_hole circle (at -7.62 2.54) (size 1.508 1.508) (drill 1) (layers *.Cu *.Mask))
  (pad 10 thru_hole circle (at -7.62 5.08) (size 1.508 1.508) (drill 1) (layers *.Cu *.Mask))
  (pad 11 thru_hole circle (at -7.62 7.62) (size 1.508 1.508) (drill 1) (layers *.Cu *.Mask))
  (pad 12 thru_hole circle (at -7.62 10.16) (size 1.508 1.508) (drill 1) (layers *.Cu *.Mask))
  (pad 13 thru_hole circle (at -7.62 12.7) (size 1.508 1.508) (drill 1) (layers *.Cu *.Mask))
  (pad 14 thru_hole circle (at -7.62 15.24) (size 1.508 1.508) (drill 1) (layers *.Cu *.Mask))
  (pad 15 thru_hole circle (at 7.62 15.24) (size 1.508 1.508) (drill 1) (layers *.Cu *.Mask))
  (pad 16 thru_hole circle (at 7.62 12.7) (size 1.508 1.508) (drill 1) (layers *.Cu *.Mask))
  (pad 17 thru_hole circle (at 7.62 10.16) (size 1.508 1.508) (drill 1) (layers *.Cu *.Mask))
  (pad 18 thru_hole circle (at 7.62 7.62) (size 1.508 1.508) (drill 1) (layers *.Cu *.Mask))
  (pad 19 thru_hole circle (at 7.62 5.08) (size 1.508 1.508) (drill 1) (layers *.Cu *.Mask))
  (pad 20 thru_hole circle (at 7.62 2.54) (size 1.508 1.508) (drill 1) (layers *.Cu *.Mask))
  (pad 21 thru_hole circle (at 7.62 0) (size 1.508 1.508) (drill 1) (layers *.Cu *.Mask))
  (pad 22 thru_hole circle (at 7.62 -2.54) (size 1.508 1.508) (drill 1) (layers *.Cu *.Mask))
  (pad 23 thru_hole circle (at 7.62 -5.08) (size 1.508 1.508) (drill 1) (layers *.Cu *.Mask))
  (pad 24 thru_hole circle (at 7.62 -7.62) (size 1.508 1.508) (drill 1) (layers *.Cu *.Mask))
  (pad 25 thru_hole circle (at 7.62 -10.16) (size 1.508 1.508) (drill 1) (layers *.Cu *.Mask))
  (pad 26 thru_hole circle (at 7.62 -12.7) (size 1.508 1.508) (drill 1) (layers *.Cu *.Mask))
  (pad 27 thru_hole circle (at 7.62 -15.24) (size 1.508 1.508) (drill 1) (layers *.Cu *.Mask))
  (pad 28 thru_hole circle (at 7.62 -17.78) (size 1.508 1.508) (drill 1) (layers *.Cu *.Mask))
)
