{
  "version": 1,
  "isRoot": true,
  "tools": {
    "jetbrains.dotcover.globaltool": {
      "version": "2021.3.3",
      "commands": [
        "dotnet-dotcover"
      ]
    },
    "dotnet-reportgenerator-globaltool": {
      "version": "5.0.3",
      "commands": [
        "reportgenerator"
      ]
    }
  }
}