<?xml version="1.0" encoding="UTF-8"?>
<svg width="50px" height="50px" viewBox="0 0 50 50" version="1.1" xmlns="http://www.w3.org/2000/svg" xmlns:xlink="http://www.w3.org/1999/xlink">
    <!-- Generator: Sketch 43.2 (39069) - http://www.bohemiancoding.com/sketch -->
    <title>menu_client_selected</title>
    <desc>Created with Sketch.</desc>
    <defs></defs>
    <g id="Symbols" stroke="none" stroke-width="1" fill="none" fill-rule="evenodd">
        <g id="menu_client_selected">
            <g id="Group-2">
                <path d="M25,50 C38.8071187,50 50,38.8071187 50,25 C50,11.1928813 38.8071187,0 25,0 C11.1928813,0 0,11.1928813 0,25 C0,38.8071187 11.1928813,50 25,50 Z" id="Oval-7-Copy" fill="#ff5722"></path>
                <path d="M27.2035447,13.496731 C27.2035447,14.2365068 26.952553,14.8705909 26.4505623,15.3990022 C25.9485715,15.9274135 25.3409076,16.1916152 24.6275524,16.1916152 C23.8877765,16.1916152 23.2669025,15.9406236 22.7649118,15.4386329 C22.262921,14.9366421 22.0119294,14.302558 22.0119294,13.5363616 C22.0119294,12.7965858 22.262921,12.1889219 22.7649118,11.7133517 C23.2669025,11.2377815 23.9141967,11 24.7068137,11 C25.4201689,11 26.0146228,11.2377815 26.4901929,11.7133517 C26.9657631,12.1889219 27.2035447,12.7833757 27.2035447,13.496731 Z M30.0569515,36.3579548 C30.0569515,36.5428988 29.9380607,36.6353693 29.7002756,36.6353693 L24.4293991,36.556108 L20.6248567,36.6353693 C20.4663333,36.6353693 20.268182,36.6485794 20.0303969,36.675 L19.6737211,36.675 C19.3566743,36.675 19.1981533,36.5693193 19.1981533,36.3579548 C19.1981533,36.1994314 19.5019852,36.1069608 20.1096582,36.0805402 C21.0079574,36.0541197 21.5363608,35.955044 21.6948842,35.7833104 C21.8534076,35.6115767 21.9326681,35.0897783 21.9326681,34.2178997 L21.9326681,22.843903 C21.9326681,21.8399215 21.8468026,21.2388626 21.6750689,21.0407084 C21.5033352,20.8425541 20.9815369,20.7434785 20.1096582,20.7434785 C19.5548263,20.7434785 19.2311793,20.7302684 19.1387073,20.7038479 C19.0462353,20.6774273 19,20.5849567 19,20.4264333 C19,20.2414893 19.1981513,20.1490187 19.5944598,20.1490187 C22.500722,20.1225982 24.9842179,19.6734553 27.0450221,18.8015766 C27.0978632,19.1186234 27.1639136,19.990489 27.2431753,21.4171996 L27.282806,26.4502922 L27.282806,33.9008545 C27.282806,34.9840977 27.3818816,35.6181817 27.5800358,35.8031257 C27.7781901,35.9880696 28.4585094,36.0805402 29.6210143,36.0805402 C29.9116406,36.0805402 30.0569515,36.1730108 30.0569515,36.3579548 Z" id="i" fill="#FFFFFF"></path>
            </g>
        </g>
    </g>
</svg>