<?xml version="1.0" encoding="UTF-8"?>
<svg width="50px" height="50px" viewBox="0 0 50 50" version="1.1" xmlns="http://www.w3.org/2000/svg" xmlns:xlink="http://www.w3.org/1999/xlink">
    <!-- Generator: Sketch 41.2 (35397) - http://www.bohemiancoding.com/sketch -->
    <title>dtmf_7_over</title>
    <desc>Created with Sketch.</desc>
    <defs></defs>
    <g id="Page-1" stroke="none" stroke-width="1" fill="none" fill-rule="evenodd">
        <g id="dtmf_7_over">
            <ellipse id="Oval-356-Copy-11" fill="#ff5722" cx="25" cy="25" rx="25" ry="25"></ellipse>
            <path d="M32.67,17.66 L32.67,14 L18.33,14 L18.33,17.96 L28.29,17.96 C26.28999,20.3800121 24.6750062,23.0399855 23.445,25.94 C22.2149938,28.8400145 21.4800012,31.8599843 21.24,35 L25.8,35 C25.8200001,33.599993 25.9849984,32.0900081 26.295,30.47 C26.6050016,28.8499919 27.0449972,27.2500079 27.615,25.67 C28.1850028,24.0899921 28.8949957,22.600007 29.745,21.2 C30.5950042,19.799993 31.5699945,18.6200048 32.67,17.66 Z" id="7" fill="#FFFFFF"></path>
        </g>
    </g>
</svg>