<?xml version="1.0" encoding="UTF-8"?>
<svg width="50px" height="50px" viewBox="0 0 50 50" version="1.1" xmlns="http://www.w3.org/2000/svg" xmlns:xlink="http://www.w3.org/1999/xlink">
    <!-- Generator: Sketch 41.2 (35397) - http://www.bohemiancoding.com/sketch -->
    <title>dtmf_6_over</title>
    <desc>Created with Sketch.</desc>
    <defs></defs>
    <g id="Page-1" stroke="none" stroke-width="1" fill="none" fill-rule="evenodd">
        <g id="dtmf_6_over">
            <ellipse id="Oval-356-Copy-11" fill="#ff5722" cx="25" cy="25" rx="25" ry="25"></ellipse>
            <path d="M25.74,24.11 C26.2800027,24.11 26.7549979,24.2249988 27.165,24.455 C27.575002,24.6850011 27.9099987,24.9849981 28.17,25.355 C28.4300013,25.7250019 28.6249993,26.1449977 28.755,26.615 C28.8850006,27.0850023 28.95,27.5699975 28.95,28.07 C28.95,28.5500024 28.8800007,29.0199977 28.74,29.48 C28.5999993,29.9400023 28.3900014,30.3499982 28.11,30.71 C27.8299986,31.0700018 27.495002,31.3599989 27.105,31.58 C26.714998,31.8000011 26.2600026,31.91 25.74,31.91 C25.1999973,31.91 24.7200021,31.8000011 24.3,31.58 C23.8799979,31.3599989 23.5250014,31.0650019 23.235,30.695 C22.9449986,30.3249981 22.7250007,29.9050024 22.575,29.435 C22.4249992,28.9649977 22.35,28.4900024 22.35,28.01 C22.35,27.4899974 22.4199993,26.9950024 22.56,26.525 C22.7000007,26.0549977 22.9099986,25.6400018 23.19,25.28 C23.4700014,24.9199982 23.8249979,24.635001 24.255,24.425 C24.6850021,24.214999 25.1799972,24.11 25.74,24.11 Z M28.8,19.4 L32.85,19.4 C32.7299994,18.4599953 32.4800019,17.6300036 32.1,16.91 C31.7199981,16.1899964 31.230003,15.5850025 30.63,15.095 C30.029997,14.6049976 29.3400039,14.2300013 28.56,13.97 C27.7799961,13.7099987 26.9400045,13.58 26.04,13.58 C24.5399925,13.58 23.2700052,13.9099967 22.23,14.57 C21.1899948,15.2300033 20.3400033,16.0849948 19.68,17.135 C19.0199967,18.1850052 18.5400015,19.3599935 18.24,20.66 C17.9399985,21.9600065 17.79,23.2599935 17.79,24.56 C17.79,25.9000067 17.9099988,27.2149935 18.15,28.505 C18.3900012,29.7950064 18.8199969,30.9499949 19.44,31.97 C20.0600031,32.9900051 20.8899948,33.8149968 21.93,34.445 C22.9700052,35.0750032 24.2799921,35.39 25.86,35.39 C26.9600055,35.39 27.9599955,35.1950019 28.86,34.805 C29.7600045,34.4149981 30.5349968,33.8750035 31.185,33.185 C31.8350032,32.4949965 32.3349982,31.6850046 32.685,30.755 C33.0350017,29.8249953 33.21,28.8200054 33.21,27.74 C33.21,26.8999958 33.0800013,26.0700041 32.82,25.25 C32.5599987,24.4299959 32.1500028,23.7000032 31.59,23.06 C30.989997,22.3999967 30.2600043,21.8750019 29.4,21.485 C28.5399957,21.0949981 27.6600045,20.9 26.76,20.9 C25.7399949,20.9 24.8400039,21.0799982 24.06,21.44 C23.2799961,21.8000018 22.6000029,22.3999958 22.02,23.24 L21.96,23.18 C21.9800001,22.5999971 22.0599993,21.9400037 22.2,21.2 C22.3400007,20.4599963 22.5599985,19.7650032 22.86,19.115 C23.1600015,18.4649968 23.5649974,17.9150023 24.075,17.465 C24.5850025,17.0149977 25.2199962,16.79 25.98,16.79 C26.7200037,16.79 27.3399975,17.0499974 27.84,17.57 C28.3400025,18.0900026 28.6599993,18.6999965 28.8,19.4 Z" id="6" fill="#FFFFFF"></path>
        </g>
    </g>
</svg>