<?xml version="1.0" encoding="UTF-8"?>
<svg width="32px" height="26px" viewBox="0 0 32 26" version="1.1" xmlns="http://www.w3.org/2000/svg" xmlns:xlink="http://www.w3.org/1999/xlink" style="background: transparent;">
    <!-- Generator: Sketch 43.2 (39069) - http://www.bohemiancoding.com/sketch -->
    <title>stat8_light</title>
    <desc>Created with Sketch.</desc>
    <defs></defs>
    <g id="Symbols" stroke="none" stroke-width="1" fill="none" fill-rule="evenodd">
        <g id="stat8_light">
            <g id="Group-5" transform="translate(11.750000, 14.250000) rotate(-180.000000) translate(-11.750000, -14.250000) translate(-2.250000, -0.250000)">
                <path d="M14,24.137931 C19.5990247,24.137931 24.137931,19.5990247 24.137931,14 C24.137931,8.4009753 19.5990247,3.86206897 14,3.86206897 C8.4009753,3.86206897 3.86206897,8.4009753 3.86206897,14" id="Oval" stroke="#FFFFFF" stroke-width="2" stroke-linecap="round" transform="translate(14.000000, 14.000000) rotate(-330.000000) translate(-14.000000, -14.000000) "></path>
                <path d="M21.2413793,14 C21.2413793,10.0006966 17.9993034,6.75862069 14,6.75862069 L21.2413793,14 Z M21.2413793,14 L14,14 L14,6.75862069 L21.2413793,14 Z" id="Combined-Shape" fill="#FFFFFF"></path>
                <path d="M23.1724138,21.2413793 L24.137931,22.2068966" id="Path-2" stroke="#FFFFFF" stroke-width="3" stroke-linecap="round"></path>
                <path d="M15.0749338,27.0363585 L13.0344828,27.0344828" id="Path-2-Copy-2" stroke="#FFFFFF" stroke-width="3" stroke-linecap="round"></path>
            </g>
            <g id="Group-9" transform="translate(23.553301, 9.253048) rotate(-315.000000) translate(-23.553301, -9.253048) translate(20.553301, -1.246952)">
                <rect id="Rectangle-3-Copy-2" fill="#ff5722" x="0.390863992" y="0.309667761" width="5.38168508" height="16.1450552"></rect>
                <polygon id="Path-3" fill="#FFFFFF" points="0.390863992 16.4650151 5.76937384 16.454723 3.08011892 20.0785355"></polygon>
            </g>
        </g>
    </g>
</svg>