<?xml version="1.0" encoding="UTF-8"?>
<svg width="50px" height="50px" viewBox="0 0 50 50" version="1.1" xmlns="http://www.w3.org/2000/svg" xmlns:xlink="http://www.w3.org/1999/xlink">
    <!-- Generator: Sketch 41.2 (35397) - http://www.bohemiancoding.com/sketch -->
    <title>dtmf_1_over</title>
    <desc>Created with Sketch.</desc>
    <defs></defs>
    <g id="Page-1" stroke="none" stroke-width="1" fill="none" fill-rule="evenodd">
        <g id="dtmf_1_over">
            <ellipse id="Oval-356-Copy-11" fill="#ff5722" cx="25" cy="25" rx="25" ry="25"></ellipse>
            <path d="M28.92,35 L28.92,14 L25.53,14 C25.4099994,14.800004 25.1600019,15.4699973 24.78,16.01 C24.3999981,16.5500027 23.9350027,16.9849983 23.385,17.315 C22.8349973,17.6450017 22.2150034,17.8749993 21.525,18.005 C20.8349965,18.1350006 20.1200037,18.1900001 19.38,18.17 L19.38,21.38 L24.66,21.38 L24.66,35 L28.92,35 Z" id="1" fill="#FFFFFF"></path>
        </g>
    </g>
</svg>