<?xml version="1.0" encoding="UTF-8" standalone="no"?>
<svg
        xmlns:dc="http://purl.org/dc/elements/1.1/"
        xmlns:cc="http://creativecommons.org/ns#"
        xmlns:rdf="http://www.w3.org/1999/02/22-rdf-syntax-ns#"
        xmlns:svg="http://www.w3.org/2000/svg"
        xmlns="http://www.w3.org/2000/svg"
        xmlns:xlink="http://www.w3.org/1999/xlink"
        xmlns:sodipodi="http://sodipodi.sourceforge.net/DTD/sodipodi-0.dtd"
        xmlns:inkscape="http://www.inkscape.org/namespaces/inkscape"
        version="1.1"
        preserveAspectRatio="xMidYMid meet"
        viewBox="0 0 80 80"
        width="80"
        height="80"
        id="svg46"
        sodipodi:docname="webrtc_forward_na_logo.svg"
        inkscape:version="0.92.1 r15371">
    <metadata
            id="metadata50">
        <rdf:RDF>
            <cc:Work
                    rdf:about="">
                <dc:format>image/svg+xml</dc:format>
                <dc:type
                        rdf:resource="http://purl.org/dc/dcmitype/StillImage"/>
                <dc:title></dc:title>
            </cc:Work>
        </rdf:RDF>
    </metadata>
    <sodipodi:namedview
            pagecolor="#ffffff"
            bordercolor="#666666"
            borderopacity="1"
            objecttolerance="10"
            gridtolerance="10"
            guidetolerance="10"
            inkscape:pageopacity="0"
            inkscape:pageshadow="2"
            inkscape:window-width="1414"
            inkscape:window-height="786"
            id="namedview48"
            showgrid="false"
            inkscape:zoom="2.95"
            inkscape:cx="45.084746"
            inkscape:cy="40"
            inkscape:window-x="0"
            inkscape:window-y="25"
            inkscape:window-maximized="0"
            inkscape:current-layer="svg46"/>

    <g id="g38">
    </g>
    <path
            d="m 33.426534,43.977738 c -0.0727,-0.165722 -0.0545,-0.310726 0.0545,-0.435018 l 2.18139,-2.386374 c 0.0818,-0.09115 0.19541,-0.13672 0.34084,-0.13672 h 4.36278 v -7.954585 h -2.61767 c -0.36357,0 -0.62715,-0.153291 -0.79075,-0.459875 -0.15452,-0.306583 -0.11362,-0.588305 0.12269,-0.845175 l 4.36278,-4.772751 c 0.1636,-0.182293 0.38628,-0.273437 0.66805,-0.273437 0.28176,0 0.50444,0.09115 0.66805,0.273437 l 4.36277,4.772751 c 0.24541,0.265153 0.28631,0.546878 0.1227,0.845175 -0.16361,0.306584 -0.42719,0.459875 -0.79076,0.459875 h -2.61765 v 10.738691 c 0,0.115994 -0.0409,0.211292 -0.1227,0.285868 -0.0818,0.07457 -0.18632,0.111852 -0.31358,0.111852 h -9.5981 c -0.19087,0 -0.32267,-0.07458 -0.39538,-0.223721 z"
            id="-3"
            inkscape:connector-curvature="0"
            style="display:inline;fill:#ff5722;fill-opacity:1;stroke:none;stroke-width:0.48198739;stroke-opacity:1"/>
</svg>
