<?xml version="1.0" encoding="UTF-8" standalone="no"?>
<svg
   xmlns:dc="http://purl.org/dc/elements/1.1/"
   xmlns:cc="http://creativecommons.org/ns#"
   xmlns:rdf="http://www.w3.org/1999/02/22-rdf-syntax-ns#"
   xmlns:svg="http://www.w3.org/2000/svg"
   xmlns="http://www.w3.org/2000/svg"
   xmlns:sodipodi="http://sodipodi.sourceforge.net/DTD/sodipodi-0.dtd"
   xmlns:inkscape="http://www.inkscape.org/namespaces/inkscape"
   width="60"
   height="60"
   version="1.1"
   id="svg5453"
   sodipodi:docname="fixed_forward_na_logo.svg"
   inkscape:version="0.92.3 (2405546, 2018-03-11)">
  <metadata
     id="metadata5459">
    <rdf:RDF>
      <cc:Work
         rdf:about="">
        <dc:format>image/svg+xml</dc:format>
        <dc:type
           rdf:resource="http://purl.org/dc/dcmitype/StillImage" />
        <dc:title></dc:title>
      </cc:Work>
    </rdf:RDF>
  </metadata>
  <defs
     id="defs5457" />
  <sodipodi:namedview
     pagecolor="#ffffff"
     bordercolor="#666666"
     borderopacity="1"
     objecttolerance="10"
     gridtolerance="10"
     guidetolerance="10"
     inkscape:pageopacity="0"
     inkscape:pageshadow="2"
     inkscape:window-width="1920"
     inkscape:window-height="1012"
     id="namedview5455"
     showgrid="false"
     inkscape:zoom="3.9333333"
     inkscape:cx="30"
     inkscape:cy="30"
     inkscape:window-x="0"
     inkscape:window-y="0"
     inkscape:window-maximized="1"
     inkscape:current-layer="svg5453" />
  <g
     id="g5451">
    <title
       id="title5445">Layer 1</title>
    <g
       id="svg_8"
       fill="#595959">
      <path
         id="svg_5"
         d="m8.263139,16.380236l0,25.752742c0,0.94611 0.819274,1.685467 1.765384,1.685467l2.458338,0l0,-29.170078l-2.458338,0c-0.960031,0.004641 -1.742182,0.77184 -1.765384,1.73187zm0,0" />
      <path
         id="svg_6"
         d="m24.871358,9.104728l-6.57688,0l-2.25726,0c-0.94611,0 -1.70248,0.81618 -1.70248,1.76229l0,36.77917c-0.00515,0.9425 0.75431,1.71074 1.69681,1.71589l8.83981,0c0.95178,0.00052 1.72671,-0.76462 1.73857,-1.71589l0,-36.77917c-0.00825,-0.96054 -0.77802,-1.74115 -1.73857,-1.76229z" />
      <path
         id="svg_7"
         d="m51.110817,14.648366l-22.653008,0l0,29.170078l22.653008,0c0.94611,0 1.765384,-0.739357 1.765384,-1.685467l0,-25.752742c-0.023201,-0.96003 -0.805353,-1.727229 -1.765384,-1.73187zm-3.682351,24.022417l-13.767827,0c-0.510435,0 -0.923939,-0.413504 -0.923939,-0.923939s0.413504,-0.923939 0.923939,-0.923939l13.767827,0c0.510435,0 0.923939,0.413504 0.923939,0.923939s-0.413504,0.923939 -0.923939,0.923939zm0,-5.411643l-13.767827,0c-0.510435,0 -0.923939,-0.413504 -0.923939,-0.923939s0.413504,-0.923939 0.923939,-0.923939l13.767827,0c0.510435,0 0.923939,0.413504 0.923939,0.923939s-0.413504,0.923939 -0.923939,0.923939zm0.82804,-7.523504c0,0.510435 -0.413504,0.923939 -0.923939,0.923939l-13.727096,0c-0.510435,0 -0.923939,-0.413504 -0.923939,-0.923939l0,-5.543635c0,-0.510435 0.413504,-0.923939 0.923939,-0.923939l13.727096,0c0.510435,0 0.923939,0.413504 0.923939,0.923939l0,5.543635zm0,0" />
    </g>
  </g>
  <path
     d="m 35.002806,24.154711 c -0.07272,-0.197844 -0.05454,-0.370956 0.05453,-0.519341 l 2.181387,-2.848953 c 0.08179,-0.108814 0.195415,-0.163222 0.340845,-0.163222 h 4.362773 v -9.496513 h -2.617664 c -0.363567,0 -0.62715,-0.183005 -0.790751,-0.549017 -0.154516,-0.366011 -0.113621,-0.7023429 0.122693,-1.0090049 l 4.362775,-5.697908 c 0.163603,-0.217629 0.386285,-0.326441 0.668049,-0.326441 0.281766,0 0.504446,0.108813 0.668051,0.326441 l 4.362774,5.697908 c 0.245408,0.31655 0.286307,0.6528839 0.122694,1.0090049 -0.163605,0.366012 -0.427186,0.549017 -0.790753,0.549017 h -2.61765 v 12.820294 c 0,0.138479 -0.04088,0.252249 -0.122706,0.341281 -0.08179,0.08903 -0.186322,0.133534 -0.313574,0.133534 h -9.598105 c -0.190872,0 -0.322666,-0.08904 -0.395377,-0.267087 z"
     id="-3"
     inkscape:connector-curvature="0"
     style="display:inline;fill:#ff5722;fill-opacity:1;stroke:none;stroke-width:0.52663416;stroke-opacity:1" />
</svg>
