<?xml version="1.0" encoding="UTF-8"?>
<svg width="32px" height="23px" viewBox="0 0 32 23" version="1.1" xmlns="http://www.w3.org/2000/svg" xmlns:xlink="http://www.w3.org/1999/xlink">
    <!-- Generator: Sketch 43.2 (39069) - http://www.bohemiancoding.com/sketch -->
    <title>answer_yes</title>
    <desc>Created with Sketch.</desc>
    <defs></defs>
    <g id="Symbols" stroke="none" stroke-width="1" fill="none" fill-rule="evenodd">
        <g id="answer_yes">
            <g id="Group-Copy">
                <ellipse id="Oval-3" fill="#959595" cx="7.99811717" cy="6.98800071" rx="4.99811717" ry="4.98800071"></ellipse>
                <path d="M16.422385,22.5508584 C16.422385,17.8283497 12.7461089,14 8.21119249,14 C3.6762761,14 0,17.8283497 0,22.5508584" id="Oval-3-Copy" fill="#959595"></path>
                <path d="M20.0500866,11.6594513 L21.1969399,16.3449703 L25.8627869,12.0101682 C25.8627869,12.0101682 32,11.6594513 32,7.06867211 C32,2.47789289 28.6421356,0.631419149 24.5,0.631419149 C20.3578644,0.631419149 17,3.51347547 17,7.06867211 C17,10.6238688 20.0500866,11.6594513 20.0500866,11.6594513 Z" id="Oval" fill="#2BA41B"></path>
            </g>
        </g>
    </g>
</svg>