<svg width="18" height="18" xmlns="http://www.w3.org/2000/svg">
 <!-- Generator: Sketch 39.1 (31720) - http://www.bohemiancoding.com/sketch -->
 <title>call_statut_incoming</title>
 <desc>Created with Sketch.</desc>

 <g>
  <title>background</title>
  <rect fill="none" id="canvas_background" height="402" width="582" y="-1" x="-1"/>
 </g>
 <g>
  <title>Layer 1</title>
  <g fill-rule="evenodd" fill="none" id="Page-1">
   <g id="ICONS"/>
   <g id="call_statut_incoming">
    <path transform="translate(-6,-12) " fill="#C1C1C1" id="" d="m6,20.889205c0,-0.52273 0.144885,-1.051134 0.434659,-1.585228c0.318184,-0.573866 0.619317,-0.920454 0.903409,-1.039772c0.142046,-0.062501 0.336647,-0.122159 0.583807,-0.178978c0.24716,-0.056818 0.447442,-0.085227 0.600852,-0.085227c0.079546,0 0.139205,0.008523 0.178978,0.025568c0.102273,0.034091 0.252839,0.249998 0.451704,0.647727c0.0625,0.107956 0.147727,0.261363 0.255682,0.460228c0.107955,0.198864 0.207386,0.37926 0.298295,0.541193c0.09091,0.161933 0.178977,0.31392 0.264205,0.455966c0.017045,0.022727 0.066761,0.093749 0.149148,0.213068c0.082386,0.119319 0.143465,0.22017 0.183238,0.302557c0.039773,0.082387 0.059659,0.163352 0.059659,0.242898c0,0.113636 -0.080965,0.255681 -0.242897,0.426136c-0.161933,0.170455 -0.338068,0.326704 -0.528409,0.46875c-0.190342,0.142046 -0.366477,0.292613 -0.52841,0.451705c-0.161932,0.159091 -0.242897,0.289772 -0.242897,0.392045c0,0.051137 0.014204,0.115056 0.042613,0.191761c0.02841,0.076705 0.052557,0.134943 0.072444,0.174716c0.019886,0.039773 0.059658,0.107954 0.119318,0.204546c0.059659,0.096591 0.092329,0.150568 0.098011,0.161932c0.43182,0.778412 0.926134,1.446019 1.482955,2.00284c0.556821,0.556821 1.224428,1.051135 2.002841,1.482955c0.011363,0.005682 0.06534,0.038352 0.161931,0.098011c0.096592,0.05966 0.164773,0.099432 0.204546,0.119319c0.039773,0.019886 0.098011,0.044033 0.174716,0.072443c0.076705,0.028409 0.140624,0.042613 0.191761,0.042613c0.102273,0 0.232954,-0.080965 0.392046,-0.242898c0.159091,-0.161932 0.309658,-0.338067 0.451704,-0.528408c0.142046,-0.190342 0.298295,-0.366477 0.46875,-0.52841c0.170455,-0.161932 0.3125,-0.242897 0.426136,-0.242897c0.079546,0 0.160511,0.019886 0.242898,0.059659c0.082387,0.039773 0.183238,0.100852 0.302557,0.183238c0.119319,0.082387 0.190341,0.132103 0.213068,0.149148c0.142046,0.085228 0.294033,0.173295 0.455966,0.264205c0.161933,0.090909 0.342329,0.19034 0.541193,0.298295c0.198865,0.107955 0.352272,0.193182 0.460227,0.255682c0.39773,0.198864 0.613637,0.349431 0.647728,0.451705c0.017045,0.039772 0.025568,0.099431 0.025568,0.178977c0,0.15341 -0.028409,0.353692 -0.085227,0.600852c-0.056819,0.24716 -0.116477,0.441761 -0.178977,0.583807c-0.119319,0.284092 -0.465907,0.585226 -1.039773,0.903409c-0.534094,0.289774 -1.062498,0.434659 -1.585228,0.434659c-0.153409,0 -0.302556,-0.009943 -0.447443,-0.02983c-0.144887,-0.019886 -0.308237,-0.055397 -0.490057,-0.106534c-0.181819,-0.051136 -0.31676,-0.092329 -0.404829,-0.123579c-0.088069,-0.03125 -0.245738,-0.089488 -0.473011,-0.174716c-0.227274,-0.085228 -0.366477,-0.136364 -0.417614,-0.153409c-0.556821,-0.198865 -1.053975,-0.434658 -1.491477,-0.707386c-0.727277,-0.448866 -1.47869,-1.061076 -2.254262,-1.836648c-0.775572,-0.775572 -1.387782,-1.526985 -1.836647,-2.254262c-0.272729,-0.437502 -0.508522,-0.934656 -0.707387,-1.491477c-0.017045,-0.051137 -0.068181,-0.19034 -0.153409,-0.417613c-0.085228,-0.227274 -0.143466,-0.384943 -0.174716,-0.473012c-0.03125,-0.088069 -0.072443,-0.22301 -0.123579,-0.404829c-0.051137,-0.18182 -0.086648,-0.34517 -0.106534,-0.490057c-0.019887,-0.144887 -0.02983,-0.294034 -0.02983,-0.447443l0,0z"/>
    <g fill="#545454" id="Group-6">
     <path fill="#58acfa" id="Combined-Shape" d="m10.20037,6.239187l5.923236,-5.917559c0.430572,-0.43016 1.127152,-0.428639 1.555855,0.003395c0.428703,0.432035 0.427188,1.130982 -0.003384,1.561142l-5.911709,5.906043l2.636671,0c0.6076,0 1.100158,0.494231 1.100158,1.103896c0,0.609665 -0.492558,1.103896 -1.100158,1.103896l-5.300675,0c-0.000127,0 -0.000254,0 -0.000381,0l-1.09993,0l0,-1.09303c-0.000071,-0.007234 -0.000071,-0.014468 0,-0.021702l0,-5.284749c0,-0.609664 0.492558,-1.103896 1.100158,-1.103896c0.607601,0 1.100159,0.494232 1.100159,1.103896l0,2.638668z"/>
    </g>
   </g>
  </g>
 </g>
</svg>