<?xml version="1.0" encoding="utf-8"?>
<!-- Generator: Adobe Illustrator 26.0.2, SVG Export Plug-In . SVG Version: 6.00 Build 0)  -->
<svg version="1.1" id="Calque_1" xmlns="http://www.w3.org/2000/svg" xmlns:xlink="http://www.w3.org/1999/xlink" x="0px" y="0px"
	 viewBox="0 0 700 700" style="enable-background:new 0 0 700 700;" xml:space="preserve">
<g>
	<path d="M557.5,142.5c-55-55-129.6-85.9-207.5-85.9l0,0c-77.8,0-152.4,30.9-207.5,85.9S56.6,272.1,56.6,349.9s31,152.4,85.9,207.5
		s129.6,85.9,207.5,85.9s152.4-30.9,207.5-85.9c55-55,85.9-129.6,85.9-207.5C643.4,272.1,612.4,197.6,557.5,142.5z M556.1,355
		c0,14.9-12.1,27-27,27H171c-14.9,0-27-12.1-27-27v-10.2c0-14.9,12.1-27,27-27h357.9c14.9,0,27,12.1,27,27V355H556.1z"/>
</g>
</svg>
