<?xml version="1.0" encoding="UTF-8" standalone="no"?>
<!-- Created with Inkscape (http://www.inkscape.org/) -->

<svg
   xmlns:dc="http://purl.org/dc/elements/1.1/"
   xmlns:cc="http://creativecommons.org/ns#"
   xmlns:rdf="http://www.w3.org/1999/02/22-rdf-syntax-ns#"
   xmlns:svg="http://www.w3.org/2000/svg"
   xmlns="http://www.w3.org/2000/svg"
   xmlns:sodipodi="http://sodipodi.sourceforge.net/DTD/sodipodi-0.dtd"
   xmlns:inkscape="http://www.inkscape.org/namespaces/inkscape"
   width="30"
   height="30"
   id="svg3291"
   version="1.1"
   inkscape:version="0.48.5 r10040"
   sodipodi:docname="voicemail.svg">
  <defs
     id="defs3293" />
  <sodipodi:namedview
     id="base"
     pagecolor="#ffffff"
     bordercolor="#666666"
     borderopacity="1.0"
     inkscape:pageopacity="0.0"
     inkscape:pageshadow="2"
     inkscape:zoom="7.9999999"
     inkscape:cx="19.313932"
     inkscape:cy="24.713786"
     inkscape:current-layer="layer1"
     showgrid="true"
     inkscape:grid-bbox="true"
     inkscape:document-units="px"
     inkscape:window-width="1440"
     inkscape:window-height="838"
     inkscape:window-x="1600"
     inkscape:window-y="34"
     inkscape:window-maximized="0" />
  <metadata
     id="metadata3296">
    <rdf:RDF>
      <cc:Work
         rdf:about="">
        <dc:format>image/svg+xml</dc:format>
        <dc:type
           rdf:resource="http://purl.org/dc/dcmitype/StillImage" />
        <dc:title></dc:title>
      </cc:Work>
    </rdf:RDF>
  </metadata>
  <g
     id="layer1"
     inkscape:label="Layer 1"
     inkscape:groupmode="layer"
     transform="translate(0,-18)">
    <path
       style="fill:#9cb913"
       inkscape:connector-curvature="0"
       d="M 20.886858,19.193916 C 15.316992,16.797018 8.8531501,18.105962 4.4922556,22.251787 0.13336108,26.397612 -1.1496079,33.065331 1.0653385,38.597097 3.2922846,44.152862 8.6801543,47.75271 14.610009,47.9887 23.006806,48.322686 29.88664,41.204987 29.999637,32.987334 29.919637,27.010586 26.404724,21.568816 20.886858,19.193916 z M 16.866955,45.448808 C 10.727103,46.513763 4.7322498,42.424935 2.9172937,36.620181 1.042339,30.628434 4.1432641,24.278702 9.6571306,21.562816 15.259993,18.803933 22.187826,21.039839 25.558744,26.131623 c 1.347968,2.033915 1.993953,4.426814 2.023952,6.852711 -0.081,6.259736 -4.57489,11.394519 -10.715741,12.464474 z"
       id="path3024" />
    <path
       style="fill:#9cb913"
       inkscape:connector-curvature="0"
       d="m 21.032854,26.226619 c 0,-0.256989 -0.068,-0.506978 -0.207995,-0.742968 -0.267993,-0.490979 -0.764982,-0.789967 -1.303969,-0.789967 -0.091,0 -0.183995,0.009 -0.274993,0.026 l -8.037806,1.588933 c -0.212994,0.041 -0.413989,0.128995 -0.596985,0.263989 -0.429989,0.286988 -0.6779821,0.748968 -0.6779821,1.246947 v 7.902666 c -0.004,0 -0.008,-9.99e-4 -0.012,-9.99e-4 -1.6659597,0 -3.015927,0.94196 -3.015927,2.105911 0,1.16295 1.3509673,2.106911 3.015927,2.106911 1.6649591,0 3.0149261,-0.943961 3.0149261,-2.106911 0,-0.036 -0.013,-0.069 -0.015,-0.103996 l 0.015,-0.134994 v -8.560639 l 5.093877,-1.007957 v 6.105742 c -0.013,0 -0.026,-0.003 -0.039,-0.003 -1.665959,0 -3.015926,0.94296 -3.015926,2.106911 0,1.162951 1.350967,2.105911 3.015926,2.105911 1.664961,0 3.014928,-0.94296 3.014928,-2.105911 0,-0.018 -0.006,-0.032 -0.006,-0.048 0.008,-0.064 0.033,-0.122995 0.033,-0.188992 v -9.765588 z"
       id="path3288" />
  </g>
</svg>
