<?xml version="1.0" encoding="UTF-8" standalone="no"?>
<svg
   width="80"
   height="80"
   viewBox="0 0 80 80.000001"
   version="1.1"
   id="svg5"
   sodipodi:docname="webrtcmobile_forward_na_logo.svg"
   inkscape:version="1.1.1 (3bf5ae0d25, 2021-09-20)"
   xmlns:inkscape="http://www.inkscape.org/namespaces/inkscape"
   xmlns:sodipodi="http://sodipodi.sourceforge.net/DTD/sodipodi-0.dtd"
   xmlns="http://www.w3.org/2000/svg"
   xmlns:svg="http://www.w3.org/2000/svg">
  <defs
     id="defs9" />
  <sodipodi:namedview
     id="namedview7"
     pagecolor="#ffffff"
     bordercolor="#666666"
     borderopacity="1.0"
     inkscape:pageshadow="2"
     inkscape:pageopacity="0.0"
     inkscape:pagecheckerboard="0"
     showgrid="false"
     inkscape:zoom="4.9371207"
     inkscape:cx="-54.383925"
     inkscape:cy="32.508826"
     inkscape:window-width="2560"
     inkscape:window-height="1376"
     inkscape:window-x="0"
     inkscape:window-y="0"
     inkscape:window-maximized="1"
     inkscape:current-layer="svg5"
     units="mm" />
  <g
     id="surface1"
     transform="matrix(0.58936129,0,0,0.61286558,57.455493,44.200935)">
    <path
       style="fill:#ff5722;fill-opacity:1;fill-rule:nonzero;stroke:none"
       d="M 29.75,0 H 5.25 C 2.351562,0 0,2.351562 0,5.25 v 45.5 C 0,53.648438 2.351562,56 5.25,56 h 24.5 C 32.648438,56 35,53.648438 35,50.75 V 5.25 C 35,2.351562 32.648438,0 29.75,0 Z M 17.5,52.5 C 15.5625,52.5 14,50.9375 14,49 c 0,-1.9375 1.5625,-3.5 3.5,-3.5 1.9375,0 3.5,1.5625 3.5,3.5 0,1.9375 -1.5625,3.5 -3.5,3.5 z M 29.75,40.6875 C 29.75,41.410156 29.160156,42 28.4375,42 H 6.5625 C 5.839844,42 5.25,41.410156 5.25,40.6875 V 6.5625 C 5.25,5.839844 5.839844,5.25 6.5625,5.25 h 21.875 c 0.722656,0 1.3125,0.589844 1.3125,1.3125 z m 0,0"
       id="path2" />
  </g>
  <g
     visibility="inherit"
     id="g11"
     transform="translate(-13.248517,2.4318924)">
    <path
       d="m 59.42,22.01 h 0.1 l 0.09,0.01 0.09,0.01 0.1,0.01 0.09,0.01 0.09,0.02 0.09,0.02 0.08,0.02 0.09,0.02 0.09,0.02 0.08,0.03 0.09,0.02 0.08,0.04 0.08,0.03 0.09,0.03 0.08,0.04 0.08,0.04 0.08,0.04 0.08,0.04 0.07,0.04 0.08,0.05 0.08,0.05 0.07,0.05 0.08,0.05 0.07,0.06 0.08,0.05 0.07,0.06 0.07,0.06 0.07,0.07 0.07,0.06 0.07,0.07 0.06,0.07 0.07,0.07 0.06,0.07 0.06,0.07 0.06,0.07 0.06,0.08 0.06,0.07 0.05,0.07 0.05,0.08 0.05,0.08 0.04,0.07 0.05,0.08 0.04,0.08 0.04,0.08 0.04,0.08 0.04,0.08 0.03,0.08 0.03,0.09 0.03,0.08 0.03,0.09 0.03,0.08 0.02,0.09 0.02,0.09 0.02,0.08 0.02,0.09 0.02,0.09 0.01,0.09 0.01,0.09 0.01,0.1 0.01,0.09 v 0.09 l 0.01,0.1 v 0.09 26.13 0.09 l -0.01,0.1 v 0.09 l -0.01,0.09 -0.01,0.1 -0.01,0.09 -0.01,0.09 -0.02,0.09 -0.02,0.09 -0.02,0.09 -0.02,0.08 -0.02,0.09 -0.03,0.08 -0.03,0.09 -0.03,0.08 -0.03,0.09 -0.03,0.08 -0.04,0.08 -0.04,0.08 -0.04,0.08 -0.04,0.08 -0.05,0.08 -0.04,0.07 -0.05,0.08 -0.05,0.08 -0.05,0.07 -0.06,0.07 -0.06,0.08 -0.06,0.07 -0.06,0.07 -0.06,0.07 -0.07,0.07 -0.06,0.07 -0.07,0.07 -0.07,0.06 -0.07,0.07 -0.07,0.06 -0.07,0.06 -0.08,0.05 -0.07,0.06 -0.08,0.05 -0.07,0.05 -0.08,0.05 -0.08,0.05 -0.07,0.04 -0.08,0.04 -0.08,0.04 -0.08,0.04 -0.08,0.04 -0.09,0.03 -0.08,0.04 -0.08,0.03 -0.09,0.02 -0.08,0.03 -0.09,0.02 -0.09,0.02 -0.08,0.02 -0.09,0.02 -0.09,0.02 -0.09,0.01 -0.1,0.01 -0.09,0.01 -0.09,0.01 h -0.09 l -0.1,0.01 H 59.24 46.17 v 0.05 0.06 l 0.01,0.05 v 0.05 0.06 l 0.01,0.05 v 0.06 l 0.01,0.05 v 0.06 l 0.01,0.05 0.01,0.06 v 0.06 l 0.01,0.05 0.01,0.06 0.01,0.05 0.01,0.06 0.02,0.06 0.01,0.05 0.01,0.06 0.01,0.06 0.02,0.05 0.01,0.06 0.02,0.06 0.02,0.05 0.01,0.06 0.02,0.06 0.02,0.06 0.02,0.06 0.02,0.05 0.02,0.06 0.02,0.06 0.02,0.06 0.03,0.06 0.02,0.06 0.02,0.06 0.03,0.05 0.02,0.06 0.02,0.06 0.03,0.05 0.02,0.06 0.02,0.06 0.03,0.05 0.02,0.06 0.02,0.05 0.03,0.05 0.02,0.06 0.02,0.05 0.03,0.05 0.02,0.06 0.02,0.05 0.03,0.05 0.02,0.05 0.02,0.05 0.03,0.05 0.02,0.05 0.02,0.05 0.03,0.05 0.02,0.04 0.02,0.05 0.03,0.05 0.02,0.05 0.02,0.04 0.03,0.05 0.02,0.04 0.02,0.05 0.03,0.04 0.02,0.05 0.02,0.04 0.02,0.04 0.02,0.04 0.02,0.05 0.02,0.04 0.02,0.04 0.02,0.03 0.02,0.04 0.01,0.04 0.02,0.03 0.01,0.04 0.02,0.04 0.01,0.03 0.02,0.03 0.01,0.03 0.01,0.04 0.01,0.03 0.01,0.03 0.01,0.03 0.01,0.03 0.01,0.02 v 0.03 l 0.01,0.03 0.01,0.02 v 0.03 l 0.01,0.02 v 0.02 0.03 l 0.01,0.02 v 0.02 0.02 0.02 0.04 0.03 0.04 l -0.01,0.04 v 0.03 0.04 l -0.01,0.03 -0.01,0.04 v 0.04 l -0.01,0.03 -0.01,0.04 -0.01,0.03 -0.01,0.03 -0.01,0.04 -0.01,0.03 -0.02,0.03 -0.01,0.04 -0.02,0.03 -0.01,0.03 -0.02,0.03 -0.01,0.03 -0.02,0.04 -0.02,0.03 -0.02,0.03 -0.02,0.03 -0.02,0.03 -0.03,0.03 -0.02,0.03 -0.02,0.03 -0.03,0.02 -0.02,0.03 -0.03,0.03 -0.03,0.03 -0.02,0.03 -0.03,0.02 -0.03,0.03 -0.03,0.02 -0.03,0.03 -0.03,0.02 -0.03,0.02 -0.03,0.02 -0.03,0.02 -0.03,0.02 -0.03,0.02 -0.03,0.02 -0.03,0.02 -0.03,0.01 -0.04,0.02 -0.03,0.01 -0.03,0.02 -0.03,0.01 -0.04,0.01 -0.03,0.01 -0.03,0.01 -0.04,0.01 -0.03,0.01 -0.04,0.01 -0.03,0.01 h -0.04 l -0.04,0.01 h -0.03 l -0.04,0.01 H 46.29 46.25 46.21 46.17 33.88 33.84 33.81 33.77 33.73 L 33.69,61.94 H 33.66 L 33.62,61.93 H 33.59 L 33.55,61.92 33.52,61.91 33.48,61.9 33.45,61.89 33.41,61.88 33.38,61.87 33.35,61.86 33.31,61.85 33.28,61.83 33.25,61.82 33.22,61.8 33.19,61.79 33.15,61.77 33.12,61.75 33.09,61.73 33.06,61.71 33.03,61.69 33,61.67 32.97,61.65 32.94,61.63 32.91,61.6 32.88,61.58 32.86,61.55 32.83,61.53 32.8,61.5 32.77,61.47 32.75,61.44 32.72,61.41 32.7,61.39 32.67,61.36 32.65,61.33 32.63,61.3 32.61,61.27 32.58,61.24 32.57,61.21 32.55,61.18 32.53,61.14 32.51,61.11 32.49,61.08 32.48,61.05 32.46,61.02 32.45,60.98 32.44,60.95 32.43,60.92 32.41,60.88 32.4,60.85 32.39,60.82 V 60.78 L 32.38,60.75 32.37,60.71 32.36,60.67 V 60.64 L 32.35,60.6 V 60.57 60.53 60.49 L 32.34,60.46 V 60.42 60.4 l 0.01,-0.02 v -0.03 -0.02 -0.02 l 0.01,-0.03 v -0.02 l 0.01,-0.03 v -0.02 l 0.01,-0.03 0.01,-0.03 v -0.03 l 0.01,-0.03 0.01,-0.03 0.01,-0.03 0.01,-0.03 0.02,-0.03 0.01,-0.03 0.01,-0.04 0.01,-0.03 0.02,-0.04 0.01,-0.03 0.02,-0.04 0.02,-0.03 0.01,-0.04 0.02,-0.04 0.02,-0.04 0.02,-0.04 0.02,-0.04 0.02,-0.04 0.02,-0.04 0.02,-0.05 0.03,-0.04 0.02,-0.04 0.02,-0.05 0.03,-0.04 0.02,-0.05 0.02,-0.04 0.03,-0.05 0.02,-0.05 0.02,-0.04 0.03,-0.05 0.02,-0.05 0.02,-0.05 0.03,-0.04 0.02,-0.05 0.02,-0.05 0.03,-0.05 0.02,-0.05 0.02,-0.05 0.03,-0.06 0.02,-0.05 0.02,-0.05 0.03,-0.05 0.02,-0.06 0.02,-0.05 0.03,-0.05 0.02,-0.06 0.02,-0.05 0.03,-0.06 0.02,-0.05 0.02,-0.06 0.03,-0.06 0.02,-0.05 0.02,-0.06 0.03,-0.06 0.02,-0.06 0.02,-0.06 0.02,-0.05 0.02,-0.06 0.02,-0.06 0.02,-0.06 0.02,-0.05 0.02,-0.06 0.02,-0.06 0.01,-0.06 0.02,-0.05 0.01,-0.06 0.02,-0.06 0.01,-0.06 0.02,-0.05 0.01,-0.06 0.01,-0.06 0.01,-0.05 0.01,-0.06 0.01,-0.06 0.01,-0.05 0.01,-0.06 v -0.05 l 0.01,-0.06 0.01,-0.06 V 56.2 l 0.01,-0.06 v -0.05 -0.06 l 0.01,-0.06 V 55.92 55.86 55.81 H 20.82 20.72 L 20.63,55.8 h -0.1 L 20.44,55.79 20.35,55.78 20.26,55.77 20.17,55.76 20.08,55.74 19.99,55.72 19.9,55.7 19.81,55.68 19.73,55.66 19.64,55.63 19.56,55.61 19.47,55.58 19.39,55.54 19.31,55.51 19.23,55.47 19.14,55.43 19.07,55.39 18.99,55.35 18.91,55.31 18.83,55.26 18.75,55.21 18.68,55.16 18.6,55.11 18.53,55.05 18.46,55 18.39,54.94 18.31,54.88 18.24,54.81 18.17,54.75 18.11,54.68 18.04,54.61 17.97,54.54 17.91,54.47 17.85,54.4 17.79,54.33 17.73,54.25 17.68,54.18 17.62,54.11 17.57,54.03 17.52,53.95 17.48,53.88 17.43,53.8 17.39,53.72 17.35,53.64 17.31,53.56 17.28,53.48 17.24,53.4 17.21,53.31 17.18,53.23 17.15,53.14 17.13,53.06 17.1,52.97 17.08,52.89 17.06,52.8 17.04,52.71 17.03,52.62 17.01,52.53 17,52.44 16.99,52.34 v -0.09 l -0.01,-0.09 v -0.1 -0.09 -26.13 -0.09 -0.1 l 0.01,-0.09 v -0.09 l 0.01,-0.1 0.01,-0.09 0.02,-0.09 0.01,-0.09 0.02,-0.09 0.02,-0.08 0.02,-0.09 0.03,-0.09 0.02,-0.08 0.03,-0.09 0.03,-0.08 0.03,-0.09 0.04,-0.08 0.03,-0.08 0.04,-0.08 0.04,-0.08 0.04,-0.08 0.05,-0.08 0.04,-0.07 0.05,-0.08 0.05,-0.08 0.06,-0.07 0.05,-0.07 0.06,-0.08 0.06,-0.07 0.06,-0.07 0.06,-0.07 0.07,-0.07 0.07,-0.07 0.06,-0.07 0.07,-0.06 0.07,-0.07 0.08,-0.06 0.07,-0.06 0.07,-0.05 0.07,-0.06 0.08,-0.05 0.07,-0.05 0.08,-0.05 0.08,-0.05 0.08,-0.04 0.08,-0.04 0.07,-0.04 0.09,-0.04 0.08,-0.04 0.08,-0.03 0.08,-0.03 0.09,-0.04 0.08,-0.02 0.09,-0.03 0.08,-0.02 0.09,-0.02 0.09,-0.02 0.09,-0.02 0.09,-0.02 0.09,-0.01 0.09,-0.01 0.09,-0.01 0.09,-0.01 h 0.1 L 20.72,22 h 0.1 38.41 0.1 z m -38.63,3.07 h -0.02 -0.03 -0.02 l -0.03,0.01 h -0.02 -0.03 l -0.02,0.01 -0.02,0.01 h -0.03 l -0.02,0.01 -0.02,0.01 -0.02,0.01 -0.03,0.01 -0.02,0.01 -0.02,0.02 -0.02,0.01 -0.02,0.01 -0.02,0.02 -0.02,0.01 -0.02,0.02 -0.02,0.02 -0.02,0.01 -0.02,0.02 -0.02,0.02 -0.02,0.02 -0.02,0.02 -0.01,0.02 -0.02,0.02 -0.01,0.02 -0.02,0.02 -0.01,0.02 -0.01,0.03 -0.01,0.02 -0.01,0.02 -0.01,0.02 -0.01,0.03 -0.01,0.02 -0.01,0.02 v 0.02 l -0.01,0.03 -0.01,0.02 v 0.03 0.02 l -0.01,0.03 v 0.02 0.03 0.02 19.98 0.03 0.02 0.03 l 0.01,0.02 v 0.03 0.02 l 0.01,0.02 0.01,0.03 v 0.02 l 0.01,0.03 0.01,0.02 0.01,0.02 0.01,0.02 0.01,0.03 0.01,0.02 0.01,0.02 0.01,0.02 0.02,0.02 0.01,0.02 0.02,0.02 0.01,0.02 0.02,0.02 0.02,0.02 0.02,0.02 0.02,0.02 0.02,0.02 0.02,0.01 0.02,0.02 0.02,0.02 0.02,0.01 0.02,0.01 0.02,0.02 0.02,0.01 0.02,0.01 0.02,0.01 0.03,0.01 0.02,0.01 0.02,0.01 0.03,0.01 h 0.02 l 0.02,0.01 h 0.03 l 0.02,0.01 h 0.03 0.02 l 0.03,0.01 h 0.02 0.03 38.41 0.03 0.03 l 0.02,-0.01 h 0.03 0.02 l 0.03,-0.01 h 0.02 l 0.02,-0.01 h 0.03 l 0.02,-0.01 0.02,-0.01 0.03,-0.01 0.02,-0.01 0.02,-0.01 0.02,-0.01 0.02,-0.01 0.02,-0.02 0.03,-0.01 0.02,-0.01 0.02,-0.02 0.02,-0.02 0.02,-0.01 0.02,-0.02 0.01,-0.02 0.02,-0.01 0.01,-0.02 0.01,-0.01 0.01,-0.02 0.01,-0.01 0.02,-0.02 0.01,-0.02 0.01,-0.02 0.01,-0.02 0.01,-0.02 0.01,-0.02 0.01,-0.02 0.01,-0.02 0.01,-0.03 0.01,-0.02 v -0.03 l 0.01,-0.02 0.01,-0.03 0.01,-0.03 0.01,-0.03 V 45.91 L 59.99,45.88 60,45.85 V 45.82 25.84 25.82 25.79 25.77 25.74 L 59.99,25.72 V 25.69 L 59.98,25.67 V 25.64 L 59.97,25.62 59.96,25.6 V 25.58 L 59.95,25.55 59.94,25.53 59.93,25.51 59.91,25.49 59.9,25.46 59.89,25.44 59.87,25.42 59.86,25.4 59.84,25.38 59.83,25.36 59.81,25.34 59.79,25.32 59.77,25.3 59.76,25.28 59.74,25.27 59.72,25.25 59.7,25.23 59.68,25.22 59.66,25.2 59.63,25.19 59.61,25.18 59.59,25.16 59.57,25.15 59.55,25.14 59.53,25.13 59.5,25.12 59.48,25.11 H 59.46 L 59.43,25.1 59.41,25.09 H 59.39 59.36 L 59.34,25.08 H 59.31 59.29 59.26 59.24 20.82 Z"
       id="use5"
       style="fill:#ff5722;fill-opacity:1" />
  </g>
  <path
     d="m 20.130897,46.893311 c -0.0727,-0.16572 -0.0545,-0.31073 0.0545,-0.43502 l 2.18139,-2.38637 c 0.0818,-0.0911 0.19541,-0.13672 0.34084,-0.13672 h 4.36278 v -7.95459 h -2.61767 c -0.36357,0 -0.62715,-0.15329 -0.79075,-0.45987 -0.15452,-0.30658 -0.11362,-0.58831 0.12269,-0.84518 l 4.36278,-4.772748 c 0.1636,-0.182293 0.38628,-0.273437 0.66805,-0.273437 0.28176,0 0.50444,0.09115 0.66805,0.273437 l 4.36277,4.772748 c 0.24541,0.26516 0.28631,0.54688 0.1227,0.84518 -0.16361,0.30658 -0.42719,0.45987 -0.79076,0.45987 h -2.61765 v 10.73869 c 0,0.116 -0.0409,0.2113 -0.1227,0.28587 -0.0818,0.0746 -0.18632,0.11185 -0.31358,0.11185 h -9.5981 c -0.19087,0 -0.32267,-0.0746 -0.39538,-0.22372 z"
     id="-3"
     inkscape:connector-curvature="0"
     style="display:inline;fill:#ff5722;fill-opacity:1;stroke:none;stroke-width:0.481987;stroke-opacity:1" />
  <path
     d="m 62.822254,64.42223 c -0.04308,-0.0984 -0.03229,-0.184502 0.03229,-0.258303 l 1.292424,-1.417007 c 0.04846,-0.0541 0.11577,-0.08118 0.20194,-0.08118 h 2.584847 v -4.723345 h -1.55091 c -0.215406,0 -0.371572,-0.09102 -0.468501,-0.273072 -0.09155,-0.182044 -0.06731,-0.349326 0.0727,-0.501852 l 2.584846,-2.834009 c 0.09693,-0.108247 0.228862,-0.162365 0.395805,-0.162365 0.166937,0 0.298869,0.05409 0.395803,0.162365 l 2.584842,2.834009 c 0.145399,0.157442 0.169632,0.32473 0.0727,0.501852 -0.09695,0.182049 -0.253101,0.273072 -0.468507,0.273072 h -1.550898 v 6.376519 c 0,0.06886 -0.02424,0.125462 -0.0727,0.169746 -0.04846,0.0443 -0.11039,0.06641 -0.185788,0.06641 h -5.686654 c -0.11308,0 -0.191173,-0.04429 -0.234253,-0.132842 z"
     id="-3-3"
     inkscape:connector-curvature="0"
     style="display:inline;fill:#ff5722;fill-opacity:1;stroke:none;stroke-width:0.285881;stroke-opacity:1" />
</svg>
