<?xml version="1.0" encoding="utf-8"?>
<!-- Generator: Adobe Illustrator 26.0.2, SVG Export Plug-In . SVG Version: 6.00 Build 0)  -->
<svg version="1.1" id="Calque_1" xmlns="http://www.w3.org/2000/svg" xmlns:xlink="http://www.w3.org/1999/xlink" x="0px" y="0px"
	 viewBox="0 0 700 700" style="enable-background:new 0 0 700 700;" xml:space="preserve">
<g>
	<g>
		<path d="M620.4,425.3l-0.4-0.7l-0.5-0.5c-27.8-28.9-99.1-77.8-261.8-77.8c-203.1,0-283.2,78.2-283.8,79
			C62.6,436.4,57.3,541,57.3,554c0,17.3,1.4,24,5.9,28.9c3.9,3.4,8.8,5,14,4.6h5.1c20.8-1.9,128.6-25.9,137.6-39
			c4.3-6.2,3.8-15.4,1.9-37.8c-1.4-11.1-1.9-22.2-1.4-33.2c43.4-24.7,92.7-37.3,142.5-36.6c75.8,0.1,109.9,31.6,112.6,36.7
			c0.5,7,0.4,14.2,0,21.1c0,28.6,0,41.1,7.4,48.2c1.9,1.9,8,7.7,74.6,22.2c70.5,15.4,75.2,10.7,79.8,6.1c4.1-5.1,5.8-11.8,4.9-18.4
			C644.4,537,632.5,437.3,620.4,425.3L620.4,425.3z"/>
	</g>
	<path d="M511.2,178l-55.6-32.1L400,113.9c-6.7-4-15.1,1-15.1,8.6v45.2H203.1c0,0,0,0-0.1,0c0,0,0,0-0.1,0
		c-10.6,0-19.1,8.6-19.1,19.1v99.5c0,10.6,8.6,19.1,19.1,19.1c10.6,0,19.1-8.6,19.1-19.1v-80.4h162.8v45c0,7.6,8.4,12.4,15.1,8.6
		l55.6-32.1l55.6-32.1C517.9,191.6,517.9,181.8,511.2,178z"/>
</g>
</svg>
