{
  "properties": [
    {
      "name": "bookshelf",
      "type": "bzh.lautre.bookshelf.config.properties.BookshelfProperties",
      "description": "All properties for the bookshelf app."
    }
  ]
}
