{
  "type": "service_account",
  "project_id": "mobo-f17c4",
  "private_key_id": "0479a7e8239c6ba1758b6100434f3812229d2551",
  "private_key": "-----BEGIN PRIVATE KEY-----\nMIIEuwIBADANBgkqhkiG9w0BAQEFAASCBKUwggShAgEAAoIBAQDSZTx3I4OK47T0\nBNAPVxrQ3nL4AnwbC04xuWty+jjSYloyPMlhGzQq74sMiahOIB3zbBfw9/QAlhcu\no5KKjhgVkH7DykRxy0No0pk9o9zHhVXhQYwWkwTakqEE3JQFiME6GYeJtRVv5Vbb\nJGVTuX20HvtaoHSK1XS6PSLM77w66GW5EPVmDLx8gIijG1qUOBp6fr1qSbLSakPH\ns9M6lL8tMf2GlhA+Kn/GCXf/P455w1LWhT7LHezV82R6OMXBOtls+OQz2VR2ngen\npLG//ppoEleW2SssqJtTrKiS3jQ9o8gtr7zPF7HGpyYfoG+BbGuQahInnhlEthgi\nNCzvY/R9AgMBAAECggEALe6/n2P/tx4E1qRJVxwFZPW3pFkIhq/2a4knQeQKbTXf\nKqoWLe7OOhRvZzaTabD90PO3m1pKqSkbWQmJd9nTPLv9zNlXDX/akOMvZONmEyIT\nMHkKsC/7JovN/v14DGhBhSFnM4N28WWgi3m77GYp4R3FctDmeJvm3rTzqMmq7rIB\n32izTZWD9uKP/r3s+NWHmf+UW2fBeO4tfCX6MH0/0LVZic/lqBsB0oWhTiEduF47\nuN+vSBeGwzDv5eSLc3gBVxjWAibCy41gZCzK8cwq9wzMqy4yC3J4I7UQ14PLa9ia\nEfIOlCwqFVebgwRNwf+5ozVVTU9vg1FpLU/qVMjq0QKBgQD3Qjy/V97rRNIU8+fi\n4pJCOOTsYrWPB3tpYVr8UpznToNDimmgc5H2sXoQPhTYDQa0Xg777ii4czQrahlT\nGM//8jziySil3FJGkJudzR0ua2Gkui7KN95LUFWUplDHPLJC5J7y1kx9ykRMqVCL\nittWcSPfAh3hLI7TPKlaeMlxLQKBgQDZ1WAk0eXzmXsYCdz+hZ57saKmJXGMCz6c\nKghMu49vhao1b2yWAm9iXXfUpupmq26+xfuB8TqYDlFu/Boube/VcDp4u4KB1tqp\ncJVpDWZJPZg7O9ZwcIU8xWW/q/emT37BfO7x7jArduoS6rpRiizELZoiAw7mmCp7\nHHGGMFqCkQKBgQDKyeJ0tCa6IomCccA/Tr/R3EO0tAhgNCy9cwFibIcPFk+F92FG\nHUMbZtfLtn7160kSaQo1CVEQZjvlV3FJu9HsAsp43a6eyaIZCcT3mSBTz/IXXjO9\n2jBQ6KQn9HfP0DILtuG+HJBDor59eWf76niV3tkir+O9qAPDr77d2q6sSQKBgEo6\nR3TEgZMsraFXWxLv/T0xHrd28uZBvqgAOqvLDel2prVmrp2/Xq0qJHc2GZG6wRYI\n6NcymEDQQDeNeG5xz9PvVj1lx+bui7xJPOB7TGuQrZshnMTb0ssOiMlzlAP7+rl8\nFQAjpg5piwG/MpYue2quD2Ofnyg8md0xqA2N1InBAn83e/TRL3sk5K6HtV4SwW1i\nP1/JMiMvQM21aOfO9eu910CpDvG/vVungOKmoTDrk8UV5AiNiFpj1fI/hTSnBE7F\nONs8JGhEjR0qXzFa147ZHTV6SSmlCbqjaFHtZgSuApfMGnKijkxW6JGfnb8o7FtZ\nwnUrU+upnwsJhYz/iqj6\n-----END PRIVATE KEY-----\n",
  "client_email": "dialogflow-nchodk@mobo-f17c4.iam.gserviceaccount.com",
  "client_id": "108542642520084131710",
  "auth_uri": "https://accounts.google.com/o/oauth2/auth",
  "token_uri": "https://oauth2.googleapis.com/token",
  "auth_provider_x509_cert_url": "https://www.googleapis.com/oauth2/v1/certs",
  "client_x509_cert_url": "https://www.googleapis.com/robot/v1/metadata/x509/dialogflow-nchodk%40mobo-f17c4.iam.gserviceaccount.com"
}
