﻿Time (s),ESC signal (µs),Servo 1 (µs),Servo 2 (µs),Servo 3 (µs),Thrust (gf),Voltage (V),Current (A),Motor Electrical Speed (RPM),Motor Optical Speed (RPM),Electrical Power (W),Overall Efficiency (gf/W),App message,
1.3546784500002627,1000,,,,1.0277120894311957,14.840367267776353,0.07623498399734134,0,0,1.1313549852431741,0,,
1.2699826499999034,1100,,,,11.547609880460861,14.838584243886189,0.15944890257733502,1088,0,2.365995471365125,4.879837497065457,,
5.0324144999998754,1147.36842105263,,,,31.82504664283329,14.836768841311107,0.22600643528214853,1665,0,3.3532046521474697,9.495028890453352,,
8.855097149999875,1194.736842105264,,,,55.83467695013081,14.834108856599453,0.34047361673452015,2205,0,5.050622994270842,11.061424070318525,,
12.694457099999845,1242.1052631578934,,,,87.59491431239891,14.830329971399914,0.5011867589018465,2739,0,7.43276341638499,11.786827098167814,,
16.491661499999882,1289.473684210523,,,,124.31166036192874,14.82647795227771,0.7176169894311996,3258,0,10.639731988114463,11.68416439485048,,
20.27673834999993,1336.8421052631593,,,,172.21621109462916,14.821768030667808,1.018441398408727,3780,0,15.095101061573962,11.40900704470616,,
24.075171199999858,1384.2105263157873,,,,221.01296201552438,14.815000190361973,1.4015222142331394,4268,0,20.763551052596203,10.645161227692665,,
27.913893349999896,1431.578947368424,,,,275.55408076852933,14.806706848041294,1.871965592228149,4746,0,27.717646014720113,9.941554343500274,,
31.85252044999988,1478.9473684210516,,,,338.7149082980626,14.796612773079811,2.448208192224661,5227,0,36.225188689412406,9.350496295568856,,
35.69352609999988,1526.315789473682,,,,399.7629575158413,14.785999681590939,3.095343676464893,5670,0,45.767751616261606,8.7347179813852,,
39.53980114999985,1573.684210526318,,,,467.7932198476995,14.772143033304918,3.8532881159364663,6124,0,56.92132427604273,8.218337254845544,,
43.422896549999834,1621.0526315789496,,,,540.9837757049203,14.758556579227031,4.689435566862777,6544,0,69.20929619044523,7.8167140105996795,,
47.339183949999864,1668.4210526315758,,,,609.7443618437369,14.741251849098889,5.607627748052391,6969,0,82.66345126522319,7.376260809670252,,
51.11954739999987,1715.7894736842127,,,,685.9529082162031,14.722354484687655,6.613520059324095,7371,0,97.36658657263577,7.045072620814656,,
60.285958349999916,1763.1578947368441,,,,767.4056664876758,14.702647800118559,7.750574986333802,7760,0,113.95397217456156,6.734353551713511,,
69.91503529999993,1810.526315789474,,,,851.1975841868016,14.68176376089933,8.98931232048217,8165,0,131.9789519557418,6.449502937188409,,
79.85883534999988,1857.8947368421066,,,,938.3861740935502,14.659235636825038,10.37942676962113,8520,0,152.1544451957596,6.167338716973109,,
90.19651299999994,1905.2631578947394,,,,1022.7022835975954,14.636886582296995,11.742494334138696,8866,0,171.87354990253735,5.950334245008071,,
