﻿Time (s),ESC signal (µs),Servo 1 (µs),Servo 2 (µs),Servo 3 (µs),AccX (g),AccY (g),AccZ (g),Torque (gf·m),Thrust (gf),Voltage (V),Current (A),Motor Electrical Speed (RPM),Motor Optical Speed (RPM),Electrical Power (W),Mechanical Power (W),Motor Efficiency (%),Propeller Mech. Efficiency (gf/W),Overall Efficiency (gf/W),Vibration (g),App message,
0.5755553749999496,1000,,,,-0.061962890625,0.040966796875,-0.9845703125,0.00017988694118709132,-0.08321387905601572,8.075079131126405,-0.015969305942708144,0,0,0.12895449184722776,0,0,0,0,0.06279296875,,
0.5964449999999955,1100,,,,-0.049755859375,0.0208984375,-0.9974609375,-0.02256939040499884,3.051312644066131,8.071741390228272,0.03396064314991238,0,0,0.27411998385066083,0,0,0,0,0.09052734375,,
2.976256125000038,1200,,,,-0.0490234375,0.0203125,-0.99287109375,-0.12343397299089545,15.110483634942034,8.06238512992859,0.18874520819634205,5060,0,1.5217369721608986,0.6414523804450001,42.1907640934469,23.783248529445917,9.942937514428579,0.088232421875,,
5.379279625000024,1250,,,,-0.053857421875,0.0236328125,-0.996630859375,-0.19214086113096054,23.79717197784239,8.051757740974427,0.32837450031191096,6225,0,2.643984088997973,1.2284158923638815,46.53098327546128,19.45360082081247,9.018970827817784,0.19794921875,,
7.743324750000016,1300,,,,-0.051904296875,0.02099609375,-0.991796875,-0.2774134570712328,33.91251567503596,8.038896465301514,0.5113597792759539,7338,0,4.110768646160953,2.0905807714533347,50.865655940435595,16.238867000245,8.251312671506003,0.130224609375,,
10.193367375000019,1350,,,,-0.050537109375,0.025341796875,-0.99599609375,-0.3506877969656857,43.67623119796796,8.024385499954224,0.7229904634132984,8311,0,5.801549481820982,2.9930275198283707,51.599723631793516,14.606549698424251,7.529633169556635,0.14501953125,,
12.566929625000002,1400,,,,-0.0478515625,0.0177734375,-0.991748046875,-0.427255575600222,54.39924289843431,8.005042958259583,0.9498319086804992,9203,0,7.60344617447164,4.038145125040713,53.112827122123086,13.479494082101562,7.154987922021577,0.1376953125,,
14.976856875000005,1450,,,,-0.0455078125,0.022021484375,-0.99287109375,-0.507649592166985,65.98796520409056,7.98411762714386,1.2561528486385947,10086,0,10.029272561158432,5.25814338493598,52.436969217372834,12.55201758237053,6.580307878451994,0.10751953125,,
17.352432125,1500,,,,-0.050830078125,0.02294921875,-0.98974609375,-0.6153322531210689,79.34307980542663,7.957831490039825,1.6350550872460015,10992,0,13.011476164543435,6.946186218556027,53.411340164461386,11.426912365631393,6.100322640570246,0.0896484375,,
19.77136850000003,1550,,,,-0.050146484375,0.019677734375,-0.992626953125,-0.70878271123154,92.75025582085917,7.927963387966156,2.0533858400955802,11856,0,16.279165801765867,8.629926189174196,53.014530782798474,10.748856344407743,5.697751361876608,0.094482421875,,
22.178510250000013,1600,,,,-0.05361328125,0.0181640625,-0.9916015625,-0.8052245273437646,106.84553119946335,7.893435215950012,2.5339274865761405,12675,0,20.001386920384743,10.48127624838782,52.40546238067238,10.195971415425896,5.342284413476533,0.104150390625,,
24.597204375000032,1650,,,,-0.05068359375,0.022998046875,-0.991748046875,-0.9034756150107647,120.48830273808429,7.85302563905716,3.0453037602081903,13412,0,23.91482256652867,12.44363945966739,52.03437034484797,9.684262232886,5.038457110479264,0.11318359375,,
26.97535650000002,1700,,,,-0.053662109375,0.02373046875,-0.9951171875,-1.0178254918139436,134.28745612592152,7.812755143642425,3.580760209001601,14110,0,27.975606733514326,14.748177785214091,52.71919047719537,9.106271264322398,4.800262940613268,0.18857421875,,
29.380078625000028,1750,,,,-0.05283203125,0.017724609375,-0.98984375,-1.0905373922258894,146.71731634839486,7.7716935753822325,4.126800606884062,14778,0,32.072206822294696,16.550689048963765,51.60702307516677,8.865774089418808,4.574785484296759,0.179736328125,,
31.798558375000038,1800,,,,-0.053857421875,0.023779296875,-0.986376953125,-1.186320819762146,159.29018523780127,7.725425100326538,4.715336321033538,15352,0,36.427954884943574,18.70295274349409,51.34297206729311,8.517795133858124,4.37286031292232,0.17021484375,,
39.981645375000035,1850,,,,-0.055224609375,0.02294921875,-0.9904296875,-1.2602511909152883,173.24173629195406,7.687881600856781,5.376074050106109,15967,0,41.33061386350069,20.66500645021394,50.0012370054502,8.384037966384735,4.1917449805518565,0.214697265625,,
48.365092625000024,1900,,,,-0.05,0.021337890625,-0.991650390625,-1.3861957045831694,187.17521432340462,7.643288254737854,6.0559464913979175,16497,0,46.287418716285224,23.484293079325294,50.73416550432681,7.971376475646276,4.043784320756062,0.2365234375,,
56.79971237500003,1950,,,,-0.050537109375,0.019921875,-0.991357421875,-1.4462802858270825,198.88414038850593,7.593767786026001,6.76531573358923,17012,0,51.37432617687561,25.26717607128346,49.18306798921533,7.871599275475771,3.8713073449824753,0.24736328125,,
65.4010955,2000,,,,-0.047412109375,0.02451171875,-0.992041015625,-1.5370863007985685,210.32075876787277,7.5412191390991214,7.505164657272395,17524,0,56.59819749934061,27.66166659397485,48.87337201047448,7.603673463459552,3.71603694991361,0.23173828125,,
