﻿Time (s),ESC signal (µs),Servo 1 (µs),Servo 2 (µs),Servo 3 (µs),Thrust (gf),Voltage (V),Current (A),Motor Electrical Speed (RPM),Motor Optical Speed (RPM),Electrical Power (W),Overall Efficiency (gf/W),App message,
0.6593851000015438,1000,,,,0.39065625639455626,7.91172070959521,0.18226434012014803,0,0,1.4420133457874575,0,,
0.6527087000013888,1100,,,,4.356878761911995,7.9148619900147255,0.09994684274089187,0,0,0.7910642153552072,0,,
3.118818800001628,1169.230769230768,,,,12.987818074799025,7.9097345137539925,0.18720484772164928,4163,0,1.480739508004422,8.774358825445507,,
5.6242158000014335,1238.4615384615388,,,,26.65167598544035,7.899933527352674,0.35183281173240677,5685,0,2.77945583160767,9.589596770353813,,
8.126708200001568,1307.6923076923067,,,,43.07255359347027,7.886284804194828,0.5864122874253446,7034,0,4.624612416057263,9.31439519851929,,
10.647906500001625,1376.9230769230774,,,,62.017904898861715,7.865256651980481,0.9294044023739332,8350,0,7.310004699782341,8.484172051597122,,
13.115313300001512,1446.1538461538453,,,,84.3171612685374,7.838669272208948,1.3759121108909935,9615,0,10.785319383267392,7.817730038633546,,
15.620724400001652,1515.3846153846157,,,,104.32591018049985,7.805613857451231,1.8406913909192568,10604,0,14.367732604998775,7.261204807219275,,
18.13597890000149,1584.6153846153848,,,,124.41204115583326,7.769960871749793,2.374148059813359,11593,0,18.447035470011553,6.744306511235776,,
20.678689800001536,1653.846153846155,,,,146.49146024676168,7.722456004120866,3.0813907655063373,12613,0,23.79590026316443,6.156117427256196,,
23.222365200001523,1723.0769230769222,,,,168.5639982645961,7.671913077111192,3.8582945861952034,13426,0,29.60050229157971,5.694675008656265,,
25.755633600001417,1792.307692307692,,,,189.28707449629147,7.618668165083893,4.644560586319564,14081,0,35.38536392660389,5.349314776326982,,
28.27947830000162,1861.5384615384633,,,,208.36967931649653,7.559355087970203,5.54950417520576,14719,0,41.950696642181704,4.967012458118532,,
38.7094374000017,1930.769230769233,,,,230.57782438216378,7.504204504290327,6.595598146173334,15399,0,49.49483039662485,4.658651971479464,,
49.365269500001524,2000,,,,252.26140921520184,7.43026560492858,7.733840878260834,15817,0,57.464635902000545,4.389777505833881,,
