﻿Time (s),ESC signal (µs),Servo 1 (µs),Servo 2 (µs),Servo 3 (µs),Thrust (gf),Voltage (V),Current (A),Motor Electrical Speed (RPM),Motor Optical Speed (RPM),Electrical Power (W),Overall Efficiency (gf/W),App message,
0.6742667999998854,1000,,,,-0.3872954274828374,8.012014420041071,0.02261040158142719,0,0,0.18115377477579447,0,,
0.7019328999999723,1100,,,,3.4983887473868545,8.00866065148168,0.08043057008065295,0,0,0.644140788700366,0,,
3.1850416999998874,1169.230769230768,,,,13.026616335961519,8.003265355785986,0.1654839925572778,4207,0,1.3244117937560036,9.843069976857318,,
5.628438699999955,1238.4615384615388,,,,25.63325679390113,7.994664256946342,0.3273119835561012,5722,0,2.616747694043677,9.79694344968988,,
8.142349499999865,1307.6923076923067,,,,43.014333111522596,7.979449670687256,0.5779511603273366,7148,0,4.611731718228077,9.32783743737949,,
10.647159199999905,1376.9230769230774,,,,63.069611330464696,7.957220002415059,0.9200435528062765,8401,0,7.3209891652183545,8.614968483555437,,
13.173786199999897,1446.1538461538453,,,,84.46806409254471,7.9275497882722235,1.3752906586466924,9679,0,10.90268586205771,7.747470497454163,,
15.682979999999944,1515.3846153846157,,,,104.89328661908993,7.8944140659733595,1.845384509624494,10682,0,14.568228439413465,7.200143834481005,,
18.250311299999897,1584.6153846153848,,,,127.98828208904182,7.853583042899502,2.4140493603546447,11644,0,18.958938296101596,6.750768036569825,,
20.800336199999993,1653.846153846155,,,,150.477081666051,7.802104097940373,3.1404388491741613,12640,0,24.502035506763576,6.141379091454869,,
23.351922799999958,1723.0769230769222,,,,172.0833777152568,7.744679906940287,3.926668945781255,13410,0,30.410811231438334,5.6585177574215795,,
25.844385900000024,1792.307692307692,,,,189.7868581745169,7.689747475686258,4.69170455476613,14146,0,36.07802289999852,5.260452140119695,,
28.36957269999993,1861.5384615384633,,,,210.23823458929616,7.62473484907076,5.605373649844365,14716,0,42.73950137094757,4.919052416516412,,
38.828653299999914,1930.769230769233,,,,233.98099857196698,7.566113272557094,6.655689023665125,15425,0,50.357797155046164,4.646309686097548,,
49.46705099999995,2000,,,,249.29076307830644,7.496878577499358,7.6987568834482465,15997,0,57.71678710765023,4.3192420912017075,,
