﻿Time (s),ESC signal (µs),Servo 1 (µs),Servo 2 (µs),Servo 3 (µs),AccX (g),AccY (g),AccZ (g),Torque (gf·m),Thrust (gf),Voltage (V),Current (A),Motor Electrical Speed (RPM),Motor Optical Speed (RPM),Electrical Power (W),Mechanical Power (W),Motor Efficiency (%),Propeller Mech. Efficiency (gf/W),Overall Efficiency (gf/W),Vibration (g),App message,
0.5473947500000533,1000,,,,-0.0625,0.037255859375,-0.992431640625,0.004354177986122289,-0.0790040320027021,8.108550691604615,0.052430769101819506,0,0,0.4251356935080987,0,0,0,0,0.065478515625,,
0.5581626249998576,1100,,,,-0.05205078125,0.017041015625,-0.99248046875,-0.013547817577511705,-2.317974076966921,8.106067419052124,0.09506294000811,0,0,0.7705855818836348,0,0,0,0,0.083154296875,,
2.8485776249998596,1150,,,,-0.055224609375,0.0224609375,-0.997265625,-0.05482066699506904,-6.2715849359312665,8.102349305152893,0.1536187781012715,3696,0,1.2446715591235147,0.20811558424247747,16.739546319385123,31.083968913641733,5.033349934090984,0.114599609375,,
5.122944874999859,1200,,,,-0.0576171875,0.02470703125,-0.9986328125,-0.09849304311112878,-11.45201705684913,8.097786355018616,0.24201012011534587,4861,0,1.9597462006647977,0.4917050736047277,25.097245391995084,23.689113904961463,5.841226470976547,0.13046875,,
7.373539374999848,1250,,,,-0.06044921875,0.02197265625,-0.99794921875,-0.16003012802092537,-17.525485001372147,8.090858316421508,0.3545972174025241,5895,0,2.8689978507857696,0.9686820946330512,33.76251886648266,18.187877377755868,6.108078465957437,0.221875,,
9.63935749999983,1300,,,,-0.056689453125,0.021875,-0.99091796875,-0.22134752691677778,-24.417101180046867,8.08099286556244,0.506902359983987,6853,0,4.096272339299491,1.557857376515934,38.041762046835785,15.712966316000742,5.962512695958704,0.603955078125,,
11.957551624999839,1350,,,,-0.054150390625,0.016259765625,-0.994677734375,-0.2834565830533183,-32.22353866289502,8.0686514377594,0.6936916230238144,7798,0,5.597155563842303,2.2700916512685447,40.566331368994256,14.206402319618759,5.758458488252392,0.751318359375,,
14.238138124999844,1400,,,,-0.056787109375,0.02060546875,-0.997265625,-0.37800274103914916,-41.156129277406016,8.051885938644409,0.914336621574229,8681,0,7.3621266266815395,3.3699082808959027,45.78131153551479,12.220930229521025,5.591168070398948,0.38720703125,,
16.51284287499986,1450,,,,-0.0591796875,0.020361328125,-0.99267578125,-0.4618619139109862,-49.70133098309092,8.032646369934081,1.1855043916023427,9532,0,9.522727851047723,4.521053531637553,47.4891513050824,10.997936308443625,5.220648198213331,0.27626953125,,
18.785498249999872,1500,,,,-0.052734375,0.017138671875,-0.996533203125,-0.5610486661930059,-60.03368622152794,8.009738326072693,1.4947084842241456,10324,0,11.972205740719579,5.948098761742442,49.68806905267437,10.098516621667223,5.015162103832189,0.17490234375,,
21.11982249999984,1550,,,,-0.055322265625,0.0216796875,-0.995751953125,-0.6580524085364593,-71.58080893373585,7.982620477676392,1.846436500362223,11127,0,14.739390083708372,7.519270595501736,51.02232381676995,9.522431183855403,4.857215258153938,0.13193359375,,
23.420673124999833,1600,,,,-0.05947265625,0.021630859375,-0.994189453125,-0.761725290049779,-81.93422663654981,7.952228033542633,2.2499342588699522,11863,0,17.89198349122775,9.279832032298298,51.868837693936484,8.83147753752412,4.5795458968446905,0.1287109375,,
25.693348874999863,1650,,,,-0.056591796875,0.020703125,-0.995068359375,-0.8582368219586967,-91.76120938971098,7.920879089832306,2.6700991777694894,12517,0,21.14953603016398,11.0324708608517,52.16461049042177,8.321025254929522,4.3388410383149925,0.1650390625,,
27.979051624999848,1700,,,,-0.05810546875,0.019775390625,-0.994384765625,-0.9573403601788291,-103.18352473032026,7.8855129957199095,3.151586785725422,13182,0,24.851878131247595,12.959956771221204,52.15063920856534,7.962495758930269,4.152025146288885,0.161669921875,,
30.259428374999857,1750,,,,-0.048486328125,0.02919921875,-1.007568359375,-1.0033923122498734,-111.44520381668107,7.848859024047852,3.6139737693584637,13800,0,28.365563548407813,14.219491628830847,50.13012084755244,7.84070792663174,3.9289991761442664,0.288427734375,,
32.59785224999985,1800,,,,-0.065380859375,0.01826171875,-0.99189453125,-1.0304855379328053,-119.83628696882057,7.810933816432953,4.103934910706349,14390,0,32.05558370533546,15.228960169422502,47.50796425574675,7.873399249488046,3.7384779748861425,0.342529296875,,
40.707313999999876,1850,,,,-0.05615234375,0.0189453125,-0.99912109375,-1.1117428560975569,-130.93786810495874,7.77812362909317,4.727964177540608,14955,0,36.7747169787197,17.073693790542215,46.42740994965551,7.670061468802612,3.5606041050783306,0.4669921875,,
48.89916637499983,1900,,,,-0.052197265625,0.026806640625,-0.99912109375,-1.2319247214484321,-143.5737634839881,7.738098955154419,5.329114320687124,15447,0,41.23723704301642,19.542053855898775,47.3896420814238,7.348138480054264,3.4816873708469096,0.448046875,,
57.24081699999984,1950,,,,-0.0576171875,0.020849609375,-0.999609375,-1.3111199330435455,-153.35443098097994,7.691550612449646,5.947875156811544,15907,0,45.7484446344517,21.41874344876121,46.81905506771129,7.160427078919393,3.352099456386052,0.622900390625,,
65.69649024999987,2000,,,,-0.0392578125,0.03427734375,-1.016748046875,-1.4097384055010476,-163.34991344915667,7.643084943294525,6.640892544201679,16341,0,50.75696064720354,23.656841878203327,46.608753383434944,6.905463575448291,3.2183413663701326,0.778662109375,,
