﻿Time (s),ESC signal (µs),Servo 1 (µs),Servo 2 (µs),Servo 3 (µs),AccX (g),AccY (g),AccZ (g),Torque (N·m),Thrust (gf),Voltage (V),Current (A),Motor Electrical Speed (RPM),Motor Optical Speed (RPM),Electrical Power (W),Mechanical Power (W),Motor Efficiency (%),Propeller Mech. Efficiency (gf/W),Overall Efficiency (gf/W),Vibration (g),App message,
0.8220688750003464,1000,,,,-0.0625,0.038623046875,-0.998681640625,0.00001690503032483799,-0.023956292508880067,7.41304132938385,0.026148201804608105,0,0,0.19383824022253682,0,0,0,0,0.0658203125,,
0.8591654999991878,1100,,,,-0.061279296875,0.03427734375,-1.00146484375,0.00013784749620259694,1.1158630795941449,7.412647271156311,0.055537065304815766,0,0,0.41167651808094885,0,0,0,0,0.068115234375,,
3.904896249999222,1200,,,,-0.05419921875,0.021923828125,-0.995947265625,0.0005778728384782455,5.278077762380339,7.411402213573456,0.11673668827861547,3553,0,0.8651822989586411,0.21503174611225156,24.888669033177287,24.893330756585502,6.109121179660208,0.101708984375,,
6.95225662499913,1250,,,,-0.052783203125,0.019091796875,-0.995556640625,0.0009200129231064407,8.4659636938989,7.410773003101349,0.16600455790758134,4457,0,1.230221457941815,0.4293770053570355,34.93244739291789,19.913424979753387,6.889700233750436,0.093115234375,,
10.037524249999084,1300,,,,-0.05107421875,0.01767578125,-0.9943359375,0.0012660945502884309,12.205152301917247,7.409775364398956,0.23372456878423692,5344,0,1.7318485198926161,0.708475164614377,40.93961988044183,17.269787769346458,7.051898341863506,0.190869140625,,
13.119594999999112,1350,,,,-0.05712890625,0.023486328125,-0.99833984375,0.0016974844612664107,16.867226283960647,7.4082976341247555,0.3066038765013218,6184,0,2.271410352336246,1.0992245950263446,48.400743907381624,15.378726041025377,7.428453871214947,0.232275390625,,
16.16490974999922,1400,,,,-0.056494140625,0.021630859375,-0.994091796875,0.002155104773767247,22.178190853920775,7.406489825248718,0.4090240575373173,7009,0,3.0294349413033737,1.581887860256535,52.233918254368504,14.035269163268648,7.324251954084733,0.26728515625,,
19.25877587499928,1450,,,,-0.0546875,0.024658203125,-0.993994140625,0.0026620114612539,27.886600510770236,7.405119323730469,0.5085102930665016,7788,0,3.7655816328864864,2.1709259944338797,57.66052032449951,12.8564016040239,7.406556455707869,0.28798828125,,
22.34313624999912,1500,,,,-0.052099609375,0.027734375,-0.99580078125,0.003288971748305357,34.43727667075495,7.403094601631165,0.6412072107195854,8580,0,4.746921133893192,2.955201149309788,62.27350941457013,11.656188702004908,7.256318199818683,0.211767578125,,
25.454591999999106,1550,,,,-0.053857421875,0.019287109375,-0.993603515625,0.003958461248013813,41.57783936753688,7.400501644611358,0.7833825677633286,9363,0,5.797418947197299,3.881144602622359,66.95708956186243,10.715906389186827,7.173168056019466,0.171240234375,,
28.535256249999208,1600,,,,-0.05498046875,0.020361328125,-0.994921875,0.004628197329579597,48.67631926856851,7.398165059089661,0.9431524470448494,10085,0,6.9775973833895595,4.887948880707177,70.06336811032375,9.960945982848363,6.976934599207133,0.244775390625,,
31.617499749999148,1650,,,,-0.057177734375,0.020458984375,-0.9970703125,0.005275543646469965,55.64940029626799,7.395252454280853,1.1273606151342392,10734,0,8.337117020751364,5.930236805567802,71.13161398390437,9.387095098615239,6.675070147676011,0.232666015625,,
34.752313374999204,1700,,,,-0.057080078125,0.02392578125,-0.991748046875,0.0060138391197378065,63.229448399993615,7.391850996017456,1.3208592861890793,11422,0,9.763591969735446,7.193303768638472,73.67821641307862,8.79091205180491,6.476350147849569,0.14794921875,,
37.823036874999126,1750,,,,-0.056884765625,0.011328125,-0.990185546875,0.006814844292027301,72.19508556198,7.388150799274444,1.5713286489248275,12136,0,11.609208743765691,8.66068488552207,74.60262125882993,8.337407927834612,6.219016479207182,0.20625,,
40.91140062499923,1800,,,,-0.055517578125,0.016748046875,-0.9943359375,0.007638863360553257,80.79807585097402,7.384358334541321,1.8349967151880264,12843,0,13.55027665810294,10.273533698594637,75.82219192045208,7.865096567236468,5.963183270485895,0.20078125,,
49.77292787499911,1850,,,,-0.0595703125,0.0349609375,-0.98984375,0.008452674940227693,89.74478478095814,7.379929399490356,2.114907795190811,13518,0,15.607870200613926,11.965671829587787,76.6665251455421,7.500825304680295,5.750101479631579,0.291943359375,,
58.80417537499922,1900,,,,-0.056103515625,0.02802734375,-0.998583984375,0.009294984560105435,98.95328204393047,7.375016808509827,2.4359089136123657,14194,0,17.964871328484556,13.816106595358173,76.90868292311576,7.1627903573703255,5.508260736407507,0.212744140625,,
68.01167274999918,1950,,,,-0.054638671875,0.0220703125,-0.9921875,0.01026843873299966,108.67709445001935,7.369636142253876,2.7746872186660765,14828,0,20.448439714111718,15.945172248026529,77.97916799385659,6.81607960997733,5.314832506060509,0.220947265625,,
77.26295462499911,2000,,,,-0.053515625,0.02373046875,-0.998291015625,0.011216645590033446,118.58079142840452,7.363809716701508,3.1427866160869598,15472,0,23.14287781754656,18.173079243313364,78.52640957101343,6.525518462626802,5.123910187173716,0.2041015625,,
