﻿Time (s),ESC signal (µs),Servo 1 (µs),Servo 2 (µs),Servo 3 (µs),Thrust (gf),Voltage (V),Current (A),Motor Electrical Speed (RPM),Motor Optical Speed (RPM),Electrical Power (W),Overall Efficiency (gf/W),App message,
0.6955211999994516,1000,,,,0.6968085500690147,7.753911861178193,0.10990073420844591,0,0,0.8521501471252317,0,,
0.6725426000013945,1100,,,,4.982548775679108,7.7565387966132935,0.06365762050992746,0,0,0.4937625957602851,0,,
3.173088400001266,1169.230769230768,,,,11.960395060841169,7.752842633793361,0.1308597352740006,4031,0,1.0145346741173462,11.807501176210367,,
5.679576900001281,1238.4615384615388,,,,22.467823069710715,7.74585387804813,0.25569870365106034,5482,0,1.980604786721705,11.345078096027265,,
8.214166000001244,1307.6923076923067,,,,34.677105292245855,7.734300778904442,0.4370077616875254,6791,0,3.3799487538041277,10.260349697036256,,
10.749928300001097,1376.9230769230774,,,,49.609832554534606,7.718243171316783,0.6861928804026778,8111,0,5.296203010545509,9.367132819804786,,
13.270407100001242,1446.1538461538453,,,,66.77063998821615,7.6964924251449744,1.0089220998972934,9306,0,7.765159735706334,8.598533396811218,,
15.814203400000931,1515.3846153846157,,,,82.16740371663231,7.668956348082857,1.3843433578220532,10381,0,10.616469658554957,7.739681280953045,,
18.356901200001317,1584.6153846153848,,,,98.500611780096,7.640033452568385,1.7750641095482096,11326,0,13.561553659434473,7.263225213542946,,
20.89976270000115,1653.846153846155,,,,117.14581327156756,7.602450979465635,2.278937165923298,12239,0,17.325512672707262,6.761505998363506,,
23.443594900001287,1723.0769230769222,,,,134.71268098242598,7.560058059134691,2.8491742145967596,13181,0,21.53993071702751,6.254073416189224,,
25.98581800000131,1792.307692307692,,,,152.04955764789423,7.5164300000455535,3.457239382767435,13909,0,25.98610685019992,5.851137687197348,,
28.529558400001115,1861.5384615384633,,,,168.04636088466773,7.467367569214386,4.128392459315428,14584,0,30.828232834271116,5.451116621996985,,
39.016936600001266,1930.769230769233,,,,188.66962966634154,7.420168552357324,4.951455993717658,15236,0,36.74069882555345,5.135226509964289,,
49.64411360000119,2000,,,,204.7987298737455,7.363963187388053,5.819514063066239,15845,0,42.85476497716928,4.778843507936677,,
