﻿Time (s),ESC signal (µs),Servo 1 (µs),Servo 2 (µs),Servo 3 (µs),AccX (g),AccY (g),AccZ (g),Torque (gf·m),Thrust (gf),Voltage (V),Current (A),Motor Electrical Speed (RPM),Motor Optical Speed (RPM),Electrical Power (W),Mechanical Power (W),Motor Efficiency (%),Propeller Mech. Efficiency (gf/W),Overall Efficiency (gf/W),Vibration (g),App message,
0.48826799999981046,1000,,,,-0.0625,0.02193080357142857,-0.9637834821428571,0.029664382416012026,0.05879085713199206,15.054914365495954,0.01955443030489344,0,0,0.2943879836845595,0,0,0,0,0.05959821428571429,,
0.4898257142851927,1100,,,,-0.06875,0.03604910714285714,-0.9881138392857143,0.13388833104398548,8.073342814935106,15.051615251813615,0.15729476719562496,3649,0,2.3675354831839073,0.5023594750849011,21.84669371457517,16.908346004600393,3.448055084305561,0.11127232142857142,,
2.6320781428566997,1169.2307692307688,,,,-0.07321428571428572,0.03956473214285714,-0.9933035714285714,0.36498321673855566,26.625684980835235,15.043054580688477,0.41555833726589153,6312,0,6.251254514065594,2.366244572039972,37.99549842021059,11.302748991499332,4.2728451017765545,0.166015625,,
4.74587442857083,1238.4615384615388,,,,-0.06411830357142857,0.038392857142857145,-0.9946986607142857,0.7049726594712314,54.34697045082492,15.025530297415598,0.8073397755143901,8846,0,12.130708357098127,6.404243457177764,52.8244723631784,8.489035020354622,4.482500777706635,0.3873883928571429,,
6.8616938571423285,1307.6923076923074,,,,-0.09787946428571428,0.032924107142857144,-0.9912388392857143,1.1189733588469477,88.87382784491139,14.997243554251535,1.3895478724954389,11224,0,20.839330508139625,12.898557911882316,62.013374254851804,6.900038061698351,4.271210370589956,0.23984375,,
8.968795999999609,1376.9230769230774,,,,-0.079296875,0.04252232142857143,-0.9911272321428571,1.63309866884831,129.80767675537086,14.956290217808315,2.1527813025404305,13445,0,32.197590382741964,22.548887169273684,70.06160092263103,5.758880673800035,4.033035473640761,0.31300223214285716,,
11.12046799999949,1446.1538461538457,,,,-0.07611607142857142,0.03800223214285714,-0.9938616071428571,2.153259638218832,172.63622339346583,14.904613740103585,3.1154779093127174,15615,0,46.43490932624142,34.529476793985964,74.38819412759972,5.000101895829378,3.7192005097041196,0.35301339285714284,,
13.236288285713641,1515.3846153846164,,,,-0.07466517857142857,0.048158482142857145,-0.993359375,2.7240552436843433,220.17997329102033,14.840025002615793,4.276278141518789,17598,0,63.45981247256632,49.22911624889462,77.60422352705541,4.473030508025032,3.470842560228414,0.4602678571428571,,
15.349188999999608,1584.6153846153836,,,,-0.08152901785714285,0.04765625,-0.9934709821428571,3.3327104792148328,270.8490111675114,14.762493569510324,5.646573053039611,19512,0,83.35748167609583,66.78202616187731,80.11545255994884,4.055743049511519,3.249255691891826,0.36674107142857143,,
17.51317485714236,1653.8461538461545,,,,-0.07008928571428572,0.03431919642857143,-0.9842075892857143,3.976102682754904,326.0201864915235,14.66875068119594,7.320505959599146,21390,0,107.38259129004442,87.34016674583039,81.34253273442546,3.732833478259408,3.036317435216739,0.47098214285714285,,
19.63290471428518,1723.0769230769224,,,,-0.06986607142857143,0.03270089285714286,-0.9845424107142857,4.676767623736244,384.53364114426086,14.563721656799316,9.195106860521642,23154,0,133.9147149158393,111.20244786062045,83.04531002088338,3.4617020226321054,2.871732845025299,0.4446428571428571,,
33.321142999999445,1792.3076923076933,,,,-0.07639508928571428,0.04447544642857143,-0.998828125,5.514730846239042,457.2821762232909,14.487084906441824,11.612559345742412,25435,0,168.23196801993876,144.04650872768022,85.63240197343372,3.174627570523702,2.7184059797938698,0.39453125,,
47.205821142856564,1861.5384615384612,,,,-0.07790178571428572,0.03800223214285714,-0.99296875,6.318743871005552,526.806804064608,14.371851975577218,14.22323602944079,27342,0,204.41419153020863,177.42017551700113,86.79787525159674,2.9693012475021208,2.5772571395949226,0.27354910714285713,,
61.24316957142808,1930.7692307692325,,,,-0.0796875,0.04966517857142857,-0.9914620535714286,7.059398563991965,590.7750372596618,14.256032780238561,16.740352657815162,29104,0,238.65143350437106,210.99114360870217,88.41076701123663,2.800016587337667,2.4755045005759895,0.2779575892857143,,
75.48018657142809,2000,,,,-0.06662946428571428,0.049051339285714285,-0.9914620535714286,7.823868302519914,657.3585941826659,14.119231714521135,19.66487037108943,30770,0,277.6534239077806,247.22975992516467,89.04264765994779,2.658908734419759,2.3675584128361598,0.5685825892857143,,
