﻿Time (s),ESC signal (µs),Servo 1 (µs),Servo 2 (µs),Servo 3 (µs),Thrust (gf),Voltage (V),Current (A),Motor Electrical Speed (RPM),Motor Optical Speed (RPM),Electrical Power (W),Overall Efficiency (gf/W),App message,
0.8546657499999913,1000,,,,-0.6013495384224165,7.4221638295551715,0.0012419439436200375,0,0,0.021426339502561002,0,,
0.9183212499998978,1100,,,,2.3230331277214185,7.421556310486395,0.08720565527326986,0,0,0.6472006631825387,0,,
4.064745374999894,1200,,,,12.59763035071049,7.4208560051335395,0.2769815946275054,2538,0,2.055440537686495,6.131573314487035,,
7.198852999999883,1250,,,,22.114831295824256,7.418879793555449,0.4083565117262122,3182,0,3.029548985539895,7.301206961078241,,
10.374670124999906,1300,,,,32.44488769720033,7.417079225991907,0.5679604384623931,3801,0,4.212607230735393,7.7021075455058785,,
13.494693374999894,1350,,,,45.75750370819766,7.417046813285888,0.7722565418248061,4450,0,5.727862408333698,7.989054384454785,,
16.608159749999885,1400,,,,60.9246155934466,7.41804212307459,1.0245093385804254,5075,0,7.5998548556270595,8.01735447573783,,
19.602510249999913,1450,,,,77.14196456403707,7.4195821750439706,1.3001210364272193,5683,0,9.64635526073736,7.997209220854812,,
22.777679374999906,1500,,,,96.42566551566738,7.419154806711603,1.6230939458472669,6284,0,12.041987089676756,8.007733057815678,,
25.97360424999984,1550,,,,117.35771646302429,7.418582109694368,2.0070895238850874,6869,0,14.889757936267358,7.881773677885851,,
29.21347599999989,1600,,,,138.3738964867815,7.417808332736328,2.4255386266983003,7450,0,17.992183185615364,7.6908505538806144,,
32.35867287499991,1650,,,,160.47243974769836,7.418973075664658,2.856065255488641,7978,0,21.189071712892165,7.573328829339402,,
35.51273887499989,1700,,,,184.93834947556616,7.419061141037465,3.420053964322336,8529,0,25.373588269887385,7.288689654069075,,
38.63678024999992,1750,,,,213.12246351803992,7.419798668736304,4.041145840181907,9099,0,29.984487911155668,7.107870687436796,,
41.57078337499988,1800,,,,237.8345005286361,7.419259034564559,4.7075269680734495,9635,0,34.92636414922438,6.809637944846214,,
50.53212112499988,1850,,,,266.97883676145847,7.416991371740593,5.49845517184594,10169,0,40.78199363898685,6.546564431050302,,
59.7367587499999,1900,,,,298.84498841236257,7.413825402190561,6.317482724917742,10715,0,46.83671318900523,6.380584627866873,,
68.98229762499992,1950,,,,331.5636815828288,7.409952372690806,7.218695654589861,11245,0,53.490190367889205,6.198594203902865,,
78.23709074999992,2000,,,,368.40305271663715,7.404209150963045,8.276037303786076,11764,0,61.27751067934359,6.012050913403196,,
