﻿Time (s),ESC signal (µs),Servo 1 (µs),Servo 2 (µs),Servo 3 (µs),Thrust (gf),Voltage (V),Current (A),Motor Electrical Speed (RPM),Motor Optical Speed (RPM),Electrical Power (W),Overall Efficiency (gf/W),App message,
0.6481671999999321,1000,,,,0.1406182725436202,7.935089686203267,0.1301159038119547,0,0,1.0324532610909598,0,,
0.7007406000000423,1100,,,,4.092812862926095,7.938027388003073,0.071221888130715,0,0,0.5653611626194969,0,,
3.2053233999999615,1169.230769230768,,,,11.212505364519354,7.934045249240239,0.1502441750275083,4279,0,1.1920440781806265,9.409739160766577,,
5.68383240000002,1238.4615384615388,,,,23.038168513691136,7.926284961545657,0.2764407089530814,5773,0,2.191146500447351,10.517061439426605,,
8.179839600000047,1307.6923076923067,,,,40.511131439700165,7.911580916598255,0.508046168129259,7419,0,4.019447477281709,10.079386064319232,,
10.686813700000048,1376.9230769230774,,,,55.781604988271155,7.89467939152503,0.7607518549759615,8655,0,6.005889401513527,9.288517959524006,,
13.262796200000052,1446.1538461538453,,,,76.35777458079713,7.867473501372248,1.1704160236888326,10104,0,9.208215978465287,8.292553513336038,,
15.799607600000035,1515.3846153846157,,,,94.30395737932672,7.841008760099522,1.5305701073213651,11195,0,12.001215758711332,7.857804548982845,,
18.370162800000028,1584.6153846153848,,,,116.96589243498221,7.799788038978961,2.0745742466353283,12365,0,16.181235588849216,7.228442302901919,,
20.889431100000053,1653.846153846155,,,,139.63760815020856,7.7526385335728545,2.6841209408705837,13464,0,20.80901527813704,6.710450143441405,,
23.464014999999982,1723.0769230769222,,,,161.05184767693038,7.704424518704627,3.328950283520974,14349,0,25.647656510795223,6.279426340031293,,
25.976927299999932,1792.307692307692,,,,180.552351452332,7.650259919196517,4.05485515923027,15226,0,31.020695922239856,5.820421275185251,,
28.486339600000033,1861.5384615384633,,,,202.16487064081196,7.590677667535468,4.851871722476203,15993,0,36.82899930309969,5.489274235289958,,
38.94815330000005,1930.769230769233,,,,222.47433321167745,7.539222867976912,5.792643975612237,16792,0,43.67206913152973,5.09423288332926,,
49.60693879999999,2000,,,,243.39132867311176,7.47142943313361,6.811492413616701,17401,0,50.89169509791104,4.782418449147778,,
