﻿Time (s),ESC signal (µs),Servo 1 (µs),Servo 2 (µs),Servo 3 (µs),Thrust (gf),Voltage (V),Current (A),Motor Electrical Speed (RPM),Motor Optical Speed (RPM),Electrical Power (W),Overall Efficiency (gf/W),App message,
0.9839668749998498,1000,,,,-0.22369855585408832,7.421860731800014,0.0035550290179558594,0,0,0.04696718208974107,0,,
0.9881912499999919,1100,,,,2.9807152124107783,7.421445595811908,0.09288181925396206,0,0,0.6893169175382288,0,,
4.430112499999989,1200,,,,14.547837120101686,7.420496425045023,0.2889501412806859,2528,0,2.1441528396436,6.783290586905644,,
7.832146124999957,1250,,,,23.555981703834597,7.417715556042994,0.43474991084275877,3163,0,3.2248506918404116,7.308317558275763,,
11.12817649999999,1350,,,,47.790434879451105,7.4171922512822075,0.8435380362713222,4410,0,6.256684778725242,7.639009169499822,,
14.413958249999979,1400,,,,63.69600927454343,7.418981260207431,1.1096901918216386,5047,0,8.232769530205779,7.737580213125641,,
17.585880500000012,1450,,,,81.90612584963188,7.419114929466225,1.393284079799398,5647,0,10.33693576584589,7.923716537451718,,
20.915505624999973,1500,,,,99.31749667404623,7.417931511647401,1.744883118717891,6237,0,12.943422427850303,7.673557919458422,,
24.284436249999995,1550,,,,119.51640195535838,7.417634918181629,2.143423979481102,6824,0,15.899135360669499,7.517223509434901,,
27.665614749999992,1600,,,,144.16227378715797,7.417505256438321,2.581918500911854,7374,0,19.15139184729037,7.527590685142494,,
30.776606749999974,1650,,,,166.96246513736756,7.417765659638755,3.081002036632128,7896,0,22.854151154532232,7.305630308258805,,
34.219233625,1700,,,,192.43517109248734,7.417959187484638,3.6675075680488205,8448,0,27.205420904904905,7.0735420003153235,,
37.51303062499999,1750,,,,222.7664520461567,7.417892932462597,4.364906589495026,9004,0,32.37840821087604,6.880130144118873,,
40.65560799999995,1800,,,,250.23670620749445,7.415939167673905,5.123405755449201,9534,0,37.99486652456946,6.586166792024023,,
49.72438362499998,1850,,,,280.6595763888356,7.413731515418759,5.957336467874853,10061,0,44.166095899604684,6.354646931966637,,
58.81876937499997,1900,,,,314.0190174842905,7.410568246663,6.854200245457223,10596,0,50.793517714814314,6.1822840892192925,,
68.21459062499999,1950,,,,349.8695211755054,7.406202512610042,7.846415554753165,11112,0,58.112140098264646,6.02060314935745,,
77.67540362499994,2000,,,,385.02556295993986,7.397133816262205,9.038649368496895,11613,0,66.8600971645338,5.758687989119113,,
