﻿Time (s),ESC signal (µs),Servo 1 (µs),Servo 2 (µs),Servo 3 (µs),Thrust (gf),Voltage (V),Current (A),Motor Electrical Speed (RPM),Motor Optical Speed (RPM),Electrical Power (W),Overall Efficiency (gf/W),App message,
1.8676429999999586,1010,,,,4.300194713750451,11.134125491324744,0.05435459072305635,0,0,0.6051909658199321,0,,
0.7028834999999418,1060.7692307692307,,,,8.10863183339128,11.135817871307614,0.08138990666744811,1776,0,0.9063462599563616,8.976555052621311,,
3.3425883333332753,1086.1538461538466,,,,10.273179602656507,11.134590273056746,0.0972833964579652,2104,0,1.083210062504932,9.529233006942752,,
6.232880833333279,1111.5384615384612,,,,12.602007202600564,11.133354483351768,0.12228884501764546,2435,0,1.3614860923850953,9.26173395145382,,
9.052484999999942,1136.9230769230774,,,,17.567060990202812,11.13283848066524,0.15042938123549565,2767,0,1.6747055510812252,10.49422316329016,,
11.914308499999946,1162.307692307692,,,,22.82466764277304,11.133245759261149,0.19352688208265117,3096,0,2.1545818552430416,10.59864411311874,,
14.706751333333246,1187.692307692308,,,,27.086585175176328,11.132670430179335,0.23639262855425835,3432,0,2.6316794209275907,10.29830184383767,,
17.591085999999947,1213.0769230769226,,,,33.5902909285068,11.132853910867942,0.285015107412163,3759,0,3.1730309486046004,10.5888496235546,,
20.541722833333278,1238.4615384615388,,,,40.579222382218184,11.132447078107143,0.3360006286267947,4089,0,3.740507977316126,10.852959720405831,,
23.31714749999995,1263.8461538461536,,,,48.21620479101392,11.131056643436851,0.4101587634367034,4423,0,4.565499758915014,10.5628387140258,,
26.03401633333326,1289.2307692307688,,,,56.155593761932664,11.130697087266364,0.4894820606102757,4745,0,5.448272935083237,10.307783121045487,,
28.936916499999942,1314.6153846153836,,,,63.628367912700625,11.129226834449184,0.5838951637706362,5074,0,6.49830282750098,9.792223764373874,,
31.85632883333328,1340,,,,72.49819750456265,11.128547850164267,0.6691738840289833,5409,0,7.446933211656605,9.738780795079505,,
34.79803283333327,1365.3846153846164,,,,81.93123002457726,11.128220975557419,0.7619290742294036,5730,0,8.478913985207653,9.663532142220163,,
37.688553666666614,1390.7692307692314,,,,92.00377185190156,11.126751235424603,0.8813626048806474,6074,0,9.806702087113676,9.382057322640904,,
40.627996833333285,1416.1538461538462,,,,102.69021729521938,11.1254623134532,1.0145502816312015,6389,0,11.287336634290684,9.098482871900824,,
43.49380066666661,1441.5384615384612,,,,114.25013391868951,11.12327261502594,1.1838356100999512,6734,0,13.168126853757263,8.676435284258346,,
46.3446621666666,1466.9230769230774,,,,126.43448351436321,11.122760110401067,1.3255547847452123,7054,0,14.743828615572772,8.57590061151942,,
49.1975021666666,1492.3076923076926,,,,139.6373675440325,11.120929281580588,1.5114670564551498,7378,0,16.80891824217229,8.307611674319904,,
52.08880333333328,1517.6923076923074,,,,154.44527346214323,11.120077541156945,1.7244012230279675,7712,0,19.175475021523916,8.054393980352527,,
54.753038833333285,1543.0769230769224,,,,168.98135649800437,11.118928314666828,1.9526417700653966,8038,0,21.711283459706625,7.78321660094523,,
57.67476299999991,1568.4615384615388,,,,183.7496836393031,11.119413133752259,2.192956820709744,8349,0,24.384396624717468,7.535832498842526,,
60.52395399999997,1593.846153846154,,,,197.89390627417828,11.11798989142352,2.445449322153104,8692,0,27.188482086717663,7.278584037530493,,
63.46963899999996,1619.2307692307684,,,,212.6789295025471,11.117301087936431,2.7351061600438125,9034,0,30.4069956140864,6.994465109661228,,
66.38409483333326,1644.6153846153836,,,,228.50346623248555,11.11823968624227,3.0544303650783178,9368,0,33.95988932327232,6.728744418431168,,
69.40317566666661,1670,,,,244.12587938257062,11.118594705580191,3.3964716409996996,9664,0,37.76399645083457,6.464701977680007,,
72.16189399999995,1695.3846153846164,,,,262.56331921604334,11.119083722646577,3.7420743850379936,10013,0,41.6084399267813,6.310378168860884,,
74.90700383333328,1720.7692307692319,,,,281.49800298384315,11.118313046274775,4.143428255990755,10344,0,46.06792656744526,6.110669101757487,,
77.67948816666662,1746.1538461538455,,,,300.81191947173465,11.117336845720477,4.559749449390062,10670,0,50.69226146079,5.9341860418197765,,
80.54558899999992,1796.9230769230776,,,,343.2843560571144,11.109725951807924,5.481699580321521,11332,0,60.900177840709894,5.636870871397968,,
83.45916066666663,1822.307692307693,,,,366.52364274468374,11.106415017992466,6.000607820702483,11637,0,66.64523934188652,5.499677269793137,,
90.89937199999996,1847.692307692307,,,,388.91389441330267,11.101100954495015,6.53313776984863,11997,0,72.52501872819167,5.36249623755944,,
98.19040949999994,1873.0769230769224,,,,408.71907074024506,11.094990324368633,7.065028086020979,12306,0,78.38642186225134,5.214163685433663,,
105.75925683333327,1898.4615384615388,,,,414.28604881215375,11.094479495925334,7.20209151522358,12364,0,79.90345027608754,5.184847209231539,,
113.4304826666666,1923.8461538461545,,,,413.89309993391777,11.094561271712445,7.198087597818445,12353,0,79.85961736638926,5.182769806306462,,
121.20883433333327,1949.230769230768,,,,415.1469398209485,11.094701912556523,7.220051769289674,12330,0,80.10432632823684,5.182575943614001,,
128.94906283333333,1974.6153846153834,,,,414.25021458498986,11.094807202581784,7.2276467888335265,12323,0,80.18934836865478,5.16589137204126,,
136.5297648333333,2000,,,,415.2017486423659,11.095144582744743,7.2335046531483895,12318,0,80.25678074604313,5.173435527785132,,
