simplest
========

Simplest module possible


Variables
---------

### `$SIMPLEST_FOO` ###

A test variable with a short docstring


Functions
---------

### `simplest__baz()` ###

A test function with a short docstring

