DIFF:--- add_inplace.sh.before
DIFF:+++ add_inplace.sh.after
DIFF:@@ -23,7 +23,76 @@
DIFF:     echo $SIMPLE_LIMIT
DIFF: }
DIFF: 
DIFF:-#----- SFDOC EMBEDDED POD PLACEHOLDER -----#
DIFF:+#----- SFDOC EMBEDDED POD BEGIN -----#
DIFF:+#
DIFF:+# !!!!!!!!!!!!!!!!!!!!!!!!!!!!!!!!!!!!!!!!!!!!!!!!!!!
DIFF:+# !! DO NOT EDIT section between this comment      !!
DIFF:+# !! and the end mark or YOUR CHANGES WILL BE LOST !!
DIFF:+# !!!!!!!!!!!!!!!!!!!!!!!!!!!!!!!!!!!!!!!!!!!!!!!!!!!
DIFF:+#
DIFF:+# The end mark should look like this:
DIFF:+#
DIFF:+#     #----- SFDOC EMBEDDED POD END -----#
DIFF:+#
DIFF:+# To update module documentation properly:
DIFF:+#
DIFF:+#  1. Edit in-code docstrings according to Docstrings section
DIFF:+#     of the Shellfu coding style guide:
DIFF:+#
DIFF:+#     <https://gitlab.com/vornet/shellfu/shellfu/-/blob/master/notes/style.md>
DIFF:+#
DIFF:+#  2. Run following command to re-build this section:
DIFF:+#
DIFF:+#         sfembed_pod -n "library/name" -i path/to/lib.sh
DIFF:+#
DIFF:+# Call sfembed_pod --help for more details.
DIFF:+#
DIFF:+# For Fedora-based distributions, sfembed_pod can be found in
DIFF:+# shellfu-devel package in this COPR:
DIFF:+#
DIFF:+# <https://copr.fedorainfracloud.org/coprs/netvor/shellfu/>
DIFF:+#
DIFF:+
DIFF:+#shellcheck disable=SC2217
DIFF:+true <<'=cut'
DIFF:+=pod
DIFF:+
DIFF:+=encoding utf8
DIFF:+
DIFF:+=head1 NAME
DIFF:+
DIFF:+add_inplace - The test module description.
DIFF:+
DIFF:+=head1 DESCRIPTION
DIFF:+
DIFF:+The test module description.
DIFF:+
DIFF:+
DIFF:+=head1 VARIABLES
DIFF:+
DIFF:+=over 8
DIFF:+
DIFF:+
DIFF:+=item I<$SIMPLE_LIMIT>
DIFF:+
DIFF:+A test variable with a short docstring
DIFF:+
DIFF:+=back
DIFF:+
DIFF:+
DIFF:+=head1 FUNCTIONS
DIFF:+
DIFF:+=over 8
DIFF:+
DIFF:+
DIFF:+=item I<simple_foo()>
DIFF:+
DIFF:+A test function with a short docstring
DIFF:+
DIFF:+=back
DIFF:+
DIFF:+=cut
DIFF:+#----- SFDOC EMBEDDED POD END -----#
DIFF: 
DIFF: This part goes on after the embed section and should
DIFF: not be affected.
