%!PS-Adobe-3.0 EPSF-3.0
%%Creator: cairo 1.15.12 (http://cairographics.org)
%%CreationDate: Wed May 23 18:59:51 2018
%%Pages: 1
%%DocumentData: Clean7Bit
%%LanguageLevel: 2
%%BoundingBox: 14 5 411 421
%%EndComments
%%BeginProlog
50 dict begin
/q { gsave } bind def
/Q { grestore } bind def
/cm { 6 array astore concat } bind def
/w { setlinewidth } bind def
/J { setlinecap } bind def
/j { setlinejoin } bind def
/M { setmiterlimit } bind def
/d { setdash } bind def
/m { moveto } bind def
/l { lineto } bind def
/c { curveto } bind def
/h { closepath } bind def
/re { exch dup neg 3 1 roll 5 3 roll moveto 0 rlineto
      0 exch rlineto 0 rlineto closepath } bind def
/S { stroke } bind def
/f { fill } bind def
/f* { eofill } bind def
/n { newpath } bind def
/W { clip } bind def
/W* { eoclip } bind def
/BT { } bind def
/ET { } bind def
/BDC { mark 3 1 roll /BDC pdfmark } bind def
/EMC { mark /EMC pdfmark } bind def
/cairo_store_point { /cairo_point_y exch def /cairo_point_x exch def } def
/Tj { show currentpoint cairo_store_point } bind def
/TJ {
  {
    dup
    type /stringtype eq
    { show } { -0.001 mul 0 cairo_font_matrix dtransform rmoveto } ifelse
  } forall
  currentpoint cairo_store_point
} bind def
/cairo_selectfont { cairo_font_matrix aload pop pop pop 0 0 6 array astore
    cairo_font exch selectfont cairo_point_x cairo_point_y moveto } bind def
/Tf { pop /cairo_font exch def /cairo_font_matrix where
      { pop cairo_selectfont } if } bind def
/Td { matrix translate cairo_font_matrix matrix concatmatrix dup
      /cairo_font_matrix exch def dup 4 get exch 5 get cairo_store_point
      /cairo_font where { pop cairo_selectfont } if } bind def
/Tm { 2 copy 8 2 roll 6 array astore /cairo_font_matrix exch def
      cairo_store_point /cairo_font where { pop cairo_selectfont } if } bind def
/g { setgray } bind def
/rg { setrgbcolor } bind def
/d1 { setcachedevice } bind def
/cairo_data_source {
  CairoDataIndex CairoData length lt
    { CairoData CairoDataIndex get /CairoDataIndex CairoDataIndex 1 add def }
    { () } ifelse
} def
/cairo_flush_ascii85_file { cairo_ascii85_file status { cairo_ascii85_file flushfile } if } def
/cairo_image { image cairo_flush_ascii85_file } def
/cairo_imagemask { imagemask cairo_flush_ascii85_file } def
%%EndProlog
%%BeginSetup
%%EndSetup
%%Page: 1 1
%%BeginPageSetup
%%PageBoundingBox: 14 5 411 421
%%EndPageSetup
q 14 5 397 416 rectclip
1 0 0 -1 0 426 cm q
Q q
125 240 31 22 re W n
127.535 241.773 m 125.559 244.73 l 125 245.57 124.922 246.645 125.359 247.559
 c 132.789 260.41 l 133.312 261.227 134.215 261.723 135.191 261.742 c 152.391
 261.469 l 154.457 261.504 155.895 259.438 155.156 257.516 c 148.527 244.465
 l 148.234 243.695 147.621 243.09 146.855 242.789 c 130.578 240.582 l 130.359
 240.531 130.133 240.508 129.914 240.508 c 128.973 240.508 128.074 240.969
 127.535 241.773 c W n
q
125 240 31 22 re W n
[ 1 0 0 1 0 0 ] concat
  q
0.117647 0.113725 0.321569 rg
153.199 240.305 m 124.922 252.23 l 124.922 240.305 l h
124.922 252.227 m 153.199 240.305 l 155.895 240.305 l 155.895 242.012 l
 124.922 255.07 l h
124.922 255.07 m 155.895 242.012 l 155.895 261.738 l 124.922 261.738 l 
h
124.922 255.07 m f
  Q
Q
Q q
141 259 33 22 re W n
144.117 261.168 m 142.363 264.262 l 141.867 265.137 141.875 266.219 142.379
 267.098 c 150.75 279.355 l 151.336 280.129 152.273 280.559 153.242 280.504
 c 170.379 278.941 l 172.434 278.816 173.719 276.656 172.84 274.789 c 165.246
 262.273 l 164.895 261.531 164.242 260.965 163.461 260.73 c 147.062 259.75
 l 146.906 259.727 146.758 259.711 146.605 259.711 c 145.586 259.711 144.629
 260.258 144.117 261.168 c W n
q
141 259 33 22 re W n
[ 1 0 0 1 0 0 ] concat
  q
0.117647 0.113725 0.321569 rg
166.121 259.559 m 141.867 272 l 141.867 259.559 l h
141.867 272 m 166.121 259.559 l 171.863 259.559 l 141.867 274.945 l h
141.867 274.945 m 171.863 259.559 l 173.715 259.559 l 173.715 280.559 l
 141.867 280.559 l h
141.867 274.945 m f
  Q
Q
Q q
q
0 0 426 426 re W n
[ 1 0 0 1 0 0 ] concat
  q
0.0784314 0.286275 0.619608 rg
128.801 225.438 m 133.586 242.879 l 133.938 243.789 134.715 244.461 135.664
 244.676 c 151.043 248.113 l 153.055 248.562 154.883 246.84 154.555 244.805
 c 149.414 228.453 l 149.285 227.641 148.816 226.922 148.125 226.469 c 141.336
 222.246 l f
0.341176 0.627451 0.843137 rg
136.375 230.258 m 137.055 230.719 137.512 231.445 137.629 232.262 c 139.699
 246.605 l 139.992 248.648 138.133 250.34 136.129 249.859 c 120.812 246.168
 l 119.867 245.938 119.094 245.254 118.758 244.34 c 115.18 228.734 l 114.953
 227.75 115.27 226.715 116 226.02 c 118.582 223.578 l 119.449 222.754 120.738
 222.559 121.812 223.082 c h
136.375 230.258 m f
0.0784314 0.286275 0.619608 rg
176.527 231.98 m 177.277 232.316 177.855 232.949 178.113 233.73 c 182.668
 247.496 l 183.316 249.449 181.781 251.445 179.723 251.32 c 164 250.375 
l 163.023 250.312 162.148 249.777 161.656 248.938 c 156.539 232.93 l 156.141
 232 156.266 230.926 156.871 230.113 c 157.84 228.523 l 158.551 227.562 
159.785 227.141 160.934 227.473 c h
176.527 231.98 m f
  Q
Q
Q q
100 215 24 29 re W n
100.836 222.539 m 101.391 232.316 l 101.449 233.289 101.98 234.164 102.816
 234.664 c 116.383 242.676 l 118.156 243.727 120.43 242.652 120.75 240.617
 c 122.977 226.289 l 123.098 225.477 122.875 224.645 122.359 224.008 c 115.133
 215.078 l h
100.836 222.539 m W n
q
100 215 24 29 re W n
[ 1 0 0 1 0 0 ] concat
  q
0.117647 0.113725 0.321569 rg
123.098 224.867 m 100.836 222.168 l 100.836 215.082 l 123.098 215.082 l
 h
100.836 222.168 m 123.098 224.871 l 123.098 227.41 l 100.836 224.715 l 
h
100.836 224.711 m 123.098 227.414 l 123.098 243.727 l 100.836 243.727 l
 h
100.836 224.711 m f
  Q
Q
Q q
121 203 24 29 re W n
121.625 213.617 m 123.73 223.184 l 123.941 224.133 124.609 224.918 125.516
 225.27 c 140.188 231.02 l 142.105 231.77 144.176 230.348 144.164 228.285
 c 144.078 213.789 l 144.066 212.969 143.719 212.18 143.105 211.633 c 134.547
 203.973 l h
121.625 213.617 m W n
q
121 203 24 29 re W n
[ 1 0 0 1 0 0 ] concat
  q
0.117647 0.113725 0.321569 rg
144.18 212.359 m 121.625 213.25 l 121.625 203.973 l 144.18 203.973 l h
121.621 213.25 m 144.176 212.355 l 144.176 214.887 l 121.621 215.777 l 
h
121.621 215.777 m 144.176 214.883 l 144.176 231.77 l 121.621 231.77 l h
121.621 215.777 m f
  Q
Q
Q q
q
0 0 426 426 re W n
[ 1 0 0 1 0 0 ] concat
  q
0.0784314 0.286275 0.619608 rg
176.836 255.699 m 177.652 255.82 178.375 256.277 178.832 256.965 c 188.191
 268.219 l 189.336 269.934 188.391 272.262 186.375 272.691 c 169.656 276.77
 l 168.707 276.969 167.719 276.684 167.02 276.004 c 156.93 265.113 l 156.301
 264.324 156.137 263.258 156.5 262.312 c 157.77 258.992 l 158.199 257.879
 159.277 257.145 160.473 257.156 c h
176.836 255.699 m f
294.172 216.031 m 294.699 215.449 295.445 215.117 296.227 215.117 c 310.078
 213.648 l 312.043 213.648 313.387 215.625 312.66 217.449 c 307.062 232.832
 l 306.723 233.691 305.969 234.328 305.066 234.52 c 291.117 236.762 l 290.156
 236.84 289.227 236.406 288.672 235.625 c 286.715 232.859 l 286.059 231.934
 286.047 230.691 286.688 229.754 c h
294.172 216.031 m f
322.336 211.469 m 322.539 210.816 323.012 210.281 323.637 209.996 c 334.09
 203.805 l 335.645 203.09 337.43 204.172 337.516 205.883 c 338.66 220.121
 l 338.699 220.926 338.336 221.703 337.688 222.184 c 327.438 229.023 l 326.703
 229.434 325.809 229.43 325.082 229.008 c 322.527 227.527 l 321.668 227.031
 321.211 226.047 321.379 225.07 c h
322.336 211.469 m f
293.215 249.668 m 293.609 249.109 294.223 248.75 294.906 248.672 c 306.766
 246.023 l 308.465 245.824 309.828 247.406 309.379 249.062 c 306.055 262.953
 l 305.844 263.73 305.258 264.352 304.496 264.613 c 292.625 267.941 l 291.805
 268.105 290.953 267.824 290.395 267.195 c 288.426 264.996 l 287.762 264.258
 287.629 263.18 288.094 262.305 c h
293.215 249.668 m f
  Q
Q
Q q
211 246 31 21 re W n
227.734 246.547 m 213.824 251.473 l 212.777 251.727 212 252.605 211.883
 253.676 c 211.516 256.844 l 211.41 257.75 211.793 258.637 212.516 259.188
 c 223.734 266.406 l 224.492 266.844 225.414 266.871 226.199 266.48 c 239.832
 259.195 l 241.488 258.371 241.793 256.133 240.414 254.898 c 229.754 247.199
 l 229.27 246.77 228.648 246.527 228.004 246.527 c 227.914 246.527 227.824
 246.539 227.734 246.547 c W n
q
211 246 31 21 re W n
[ 1 0 0 1 0 0 ] concat
  q
0.117647 0.113725 0.321569 rg
228 246.469 m 211.414 266.297 l 211.414 246.469 l h
211.41 266.297 m 228 246.469 l 231.07 246.469 l 214 266.871 l 211.41 266.871
 l h
214 266.867 m 231.07 246.469 l 241.793 246.469 l 241.793 266.867 l h
214 266.867 m f
  Q
Q
Q q
174 268 34 24 re W n
192.848 268.965 m 177.215 274 l 176.047 274.25 175.152 275.203 174.984 
276.383 c 174.469 279.898 l 174.324 280.906 174.723 281.906 175.508 282.543
 c 187.754 290.938 l 188.582 291.445 189.609 291.504 190.492 291.098 c 205.898
 283.434 l 207.773 282.574 208.184 280.09 206.688 278.672 c 195.074 269.758
 l 194.531 269.242 193.812 268.957 193.07 268.957 c 192.996 268.957 192.922
 268.961 192.848 268.965 c W n
q
174 268 34 24 re W n
[ 1 0 0 1 0 0 ] concat
  q
0.117647 0.113725 0.321569 rg
193.137 268.906 m 174.328 290.098 l 174.328 268.906 l h
174.328 290.098 m 193.137 268.906 l 196.637 268.906 l 176.578 291.504 l
 174.328 291.504 l h
176.582 291.504 m 196.641 268.906 l 207.852 268.906 l 208.184 269.199 l
 208.184 291.504 l h
176.582 291.504 m f
  Q
Q
Q q
q
0 0 426 426 re W n
[ 1 0 0 1 0 0 ] concat
  q
0.341176 0.627451 0.843137 rg
251.672 265.031 m 252.367 264.594 253.219 264.473 254.008 264.699 c 268.434
 267.195 l 270.414 267.758 271.207 270.145 269.949 271.781 c 259.867 285.723
 l 259.277 286.492 258.336 286.918 257.367 286.855 c 242.621 285.105 l 241.629
 284.914 240.812 284.211 240.477 283.254 c 239.293 279.898 l 238.895 278.773
 239.242 277.516 240.164 276.75 c h
251.672 265.031 m f
  Q
Q
Q q
202 269 34 24 re W n
220.039 269.539 m 204.934 275.996 l 203.789 276.352 202.996 277.383 202.934
 278.574 c 202.75 282.125 l 202.695 283.137 203.184 284.102 204.027 284.66
 c 216.992 291.891 l 217.867 292.316 218.895 292.285 219.742 291.797 c 234.371
 282.742 l 236.156 281.715 236.332 279.207 234.715 277.93 c 222.328 270.125
 l 221.812 269.719 221.176 269.5 220.523 269.5 c 220.363 269.5 220.199 269.512
 220.039 269.539 c W n
q
202 269 34 24 re W n
[ 1 0 0 1 0 0 ] concat
  q
0.117647 0.113725 0.321569 rg
220.355 269.406 m 203.531 292.316 l 202.699 292.316 l 202.699 269.406 l
 h
203.527 292.316 m 220.355 269.402 l 223.605 269.402 l 206.781 292.316 l
 h
206.777 292.316 m 223.605 269.402 l 236.332 269.402 l 236.332 292.316 l
 h
206.777 292.316 m f
  Q
Q
Q q
249 241 32 23 re W n
261.371 241.816 m 250.316 253.965 l 249.434 254.766 249.133 256.035 249.574
 257.145 c 250.883 260.449 l 251.258 261.391 252.098 262.062 253.098 262.223
 c 267.898 263.406 l 268.867 263.43 269.793 262.969 270.352 262.176 c 279.895
 247.863 l 281.09 246.18 280.211 243.824 278.203 243.34 c 263.699 241.395
 l 263.473 241.34 263.238 241.312 263.008 241.312 c 262.43 241.312 261.859
 241.484 261.371 241.816 c W n
q
249 241 32 23 re W n
[ 1 0 0 1 0 0 ] concat
  q
0.117647 0.113725 0.321569 rg
251.828 261.789 m 249.812 255.199 250.582 247.641 254.664 241.98 c 259.879
 234.605 269.453 230.258 278.426 231.93 c 283.73 232.863 288.289 237.055
 289.484 242.332 c 291.109 248.602 292.352 255.449 290.113 261.734 c 288.352
 266.809 283.477 270.066 278.434 271.281 c 270.168 273.336 261.551 272.609
 253.164 271.859 c 252.164 271.41 249.262 272.324 250.008 270.586 c 250.617
 267.652 251.223 264.723 251.828 261.789 c h
251.828 261.789 m f
257.066 263.43 m 258.605 256.02 260.141 248.609 261.68 241.199 c 262.57
 241.199 263.461 241.199 264.355 241.199 c 262.816 248.609 261.277 256.02
 259.742 263.43 c 258.852 263.43 257.957 263.43 257.066 263.43 c h
257.066 263.43 m f
261.68 241.199 m 260.141 248.609 258.602 256.02 257.066 263.43 c 254.422
 263.43 251.777 263.43 249.133 263.43 c 249.133 256.02 249.133 248.609 249.133
 241.199 c 253.316 241.199 257.496 241.199 261.68 241.199 c h
261.68 241.199 m f
  Q
Q
Q q
q
0 0 426 426 re W n
[ 1 0 0 1 0 0 ] concat
  q
0.341176 0.627451 0.843137 rg
327.438 141.332 m 327.309 140.715 327.445 140.07 327.812 139.559 c 333.41
 129.824 l 334.34 128.543 336.266 128.602 337.109 129.938 c 344.5 140.875
 l 344.902 141.504 344.961 142.293 344.66 142.977 c 339.516 153.137 l 339.117
 153.801 338.395 154.203 337.617 154.191 c 334.891 154.164 l 333.973 154.152
 333.16 153.574 332.848 152.711 c h
327.438 141.332 m f
  Q
Q
Q q
310 95 18 26 re W n
314.551 96.516 m 310.441 106.965 l 310.152 107.523 310.109 108.18 310.332
 108.773 c 317.352 119.234 l 317.785 120.047 318.676 120.496 319.586 120.375
 c 322.289 120.004 l 323.055 119.898 323.711 119.395 324.012 118.676 c 327.609
 107.875 l 327.805 107.152 327.633 106.387 327.145 105.82 c 318.23 96.086
 l 317.777 95.562 317.16 95.309 316.543 95.309 c 315.75 95.309 314.961 95.727
 314.551 96.516 c W n
q
310 95 18 26 re W n
[ 1 0 0 1 0 0 ] concat
  q
0.117647 0.113725 0.321569 rg
310.109 108.52 m 327.805 116.98 l 327.805 120.5 l 310.109 120.5 l h
327.805 116.98 m 310.109 108.516 l 310.109 106.293 l 327.805 114.754 l 
h
327.805 114.75 m 310.109 106.289 l 310.109 94.887 l 327.805 94.887 l h
327.805 114.75 m f
  Q
Q
Q q
315 172 16 25 re W n
326.152 172.508 m 316.727 178.605 l 316.16 178.887 315.746 179.395 315.574
 180.004 c 315.184 192.605 l 315.062 193.512 315.523 194.398 316.332 194.828
 c 318.742 196.102 l 319.43 196.469 320.258 196.438 320.914 196.031 c 330.141
 189.348 l 330.723 188.879 331.023 188.152 330.961 187.41 c 329.395 174.301
 l 329.285 173.094 328.266 172.266 327.164 172.266 c 326.828 172.266 326.484
 172.34 326.152 172.508 c W n
q
315 172 16 25 re W n
[ 1 0 0 1 0 0 ] concat
  q
0.117647 0.113725 0.321569 rg
315.062 178.793 m 324.773 196.469 l 315.062 196.469 l h
324.773 196.465 m 315.062 178.789 l 315.062 174.617 l 327.066 196.465 l
 h
327.066 196.465 m 315.062 174.617 l 315.062 171.797 l 331.027 171.797 l
 331.027 196.465 l h
327.066 196.465 m f
  Q
Q
Q q
0.341176 0.627451 0.843137 rg
194.719 251.348 m 195.539 251.406 196.301 251.809 196.805 252.461 c 209.039
 264.848 l 210.309 266.477 209.535 268.867 207.551 269.445 c 192.426 273.844
 l 191.492 274.117 190.484 273.902 189.738 273.281 c 178.883 261.508 l 178.195
 260.766 177.957 259.715 178.25 258.746 c 179.273 255.34 l 179.617 254.199
 180.641 253.387 181.836 253.312 c h
194.719 251.348 m f
0.0784314 0.286275 0.619608 rg
113.777 198.23 m 114.336 208.008 l 114.387 208.98 114.926 209.859 115.762
 210.355 c 129.328 218.371 l 131.102 219.418 133.375 218.344 133.691 216.305
 c 135.914 201.984 l 136.039 201.172 135.82 200.34 135.301 199.699 c 128.074
 190.773 l f
93.539 208.648 m 94.098 218.426 l 94.148 219.398 94.688 220.273 95.523 
220.773 c 109.09 228.785 l 110.863 229.836 113.137 228.762 113.453 226.723
 c 115.676 212.398 l 115.801 211.586 115.578 210.754 115.062 210.117 c 107.836
 201.191 l f
Q q
105 199 23 29 re W n
105.309 206.812 m 105.867 216.59 l 105.922 217.562 106.461 218.441 107.297
 218.934 c 120.859 226.953 l 122.637 228.004 124.906 226.926 125.227 224.891
 c 127.449 210.566 l 127.578 209.75 127.352 208.922 126.832 208.285 c 119.609
 199.352 l h
105.309 206.812 m W n
q
105 199 23 29 re W n
[ 1 0 0 1 0 0 ] concat
  q
0.164706 0.2 0.486275 rg
120.844 228 m 125.625 199.355 l 127.574 199.355 l 127.574 228 l h
125.629 199.355 m 120.848 228 l 116.984 228 l 121.766 199.355 l h
121.766 199.355 m 116.984 228 l 105.312 228 l 105.312 199.355 l h
121.766 199.355 m f
  Q
Q
Q q
q
0 0 426 426 re W n
[ 1 0 0 1 0 0 ] concat
  q
0.12549 0.105882 0.329412 rg
91.391 207.801 m 81.059 183.598 77.895 157.035 82.25 130.977 c 91.852 73.469
 136.855 27.98 194.242 17.793 c 195.688 17.512 211.379 14.566 224.094 15.559
 c 220.98 55.828 l 215.191 55.383 205.434 56.766 201.609 57.508 c 160.715
 64.77 128.879 96.941 122.086 137.633 c 119.008 156.066 121.238 174.844 
128.535 191.938 c h
91.391 207.801 m f
205.469 23.848 m 218.504 12.113 l 225.059 6.211 234.086 3.879 242.68 5.875
 c 289 16.641 l 295.098 18.055 299.398 23.508 299.348 29.766 c 299.242 44.43
 l 299.199 50.312 295.312 55.48 289.672 57.156 c 246.074 70.09 l 237.812
 72.539 228.879 70.902 222.023 65.676 c 208.863 55.641 l h
205.469 23.848 m f
  Q
Q
Q q
90 189 23 29 re W n
90.309 196.902 m 90.867 206.684 l 90.918 207.652 91.457 208.535 92.293 
209.027 c 105.855 217.043 l 107.633 218.094 109.906 217.016 110.223 214.98
 c 112.445 200.652 l 112.57 199.844 112.348 199.012 111.832 198.375 c 104.605
 189.449 l h
90.309 196.902 m W n
q
90 189 23 29 re W n
[ 1 0 0 1 0 0 ] concat
  q
0.117647 0.113725 0.321569 rg
112.57 199.234 m 90.309 196.531 l 90.309 189.449 l 112.57 189.449 l h
90.309 196.535 m 112.57 199.234 l 112.57 201.777 l 90.309 199.078 l h
90.309 199.078 m 112.57 201.781 l 112.57 218.094 l 90.309 218.094 l h
90.309 199.078 m f
  Q
Q
Q q
106 181 23 29 re W n
106.457 188.867 m 107.016 198.645 l 107.066 199.617 107.602 200.496 108.441
 200.988 c 122.008 209.008 l 123.781 210.055 126.055 208.977 126.367 206.938
 c 128.594 192.617 l 128.719 191.805 128.496 190.977 127.98 190.332 c 120.754
 181.406 l h
106.457 188.867 m W n
q
106 181 23 29 re W n
[ 1 0 0 1 0 0 ] concat
  q
0.117647 0.113725 0.321569 rg
128.723 191.195 m 106.457 188.492 l 106.457 181.41 l 128.723 181.41 l h
106.457 188.496 m 128.719 191.195 l 128.719 193.738 l 106.457 191.039 l
 h
106.457 191.039 m 128.719 193.742 l 128.719 210.055 l 106.457 210.055 l
 h
106.457 191.039 m f
  Q
Q
Q q
0.0784314 0.286275 0.619608 rg
115.402 172.449 m 115.82 173.156 115.926 174.008 115.688 174.797 c 111.465
 188.66 l 110.867 190.633 108.461 191.375 106.852 190.086 c 94.555 180.238
 l 93.797 179.629 93.387 178.684 93.473 177.715 c 98.527 161.688 l 98.738
 160.699 99.465 159.898 100.422 159.578 c 102.133 158.84 l 103.27 158.465
 104.52 158.836 105.266 159.77 c h
115.402 172.449 m f
104.203 130.34 m 104.305 130.938 104.152 131.555 103.777 132.035 c 97.176
 140.488 l 96.242 141.688 94.383 141.562 93.613 140.246 c 87.738 130.184
 l 87.375 129.559 87.348 128.801 87.66 128.152 c 95.41 118.43 l 95.816 117.801
 96.527 117.441 97.273 117.477 c 98.656 117.422 l 99.539 117.461 100.305
 118.051 100.57 118.891 c h
104.203 130.34 m f
120.418 117.711 m 120.418 118.32 120.16 118.898 119.707 119.305 c 111.742
 126.488 l 110.609 127.508 108.801 127.066 108.273 125.637 c 104.234 114.703
 l 103.984 114.027 104.09 113.273 104.508 112.691 c 113.824 104.453 l 114.336
 103.91 115.098 103.68 115.832 103.84 c 117.195 104.027 l 118.059 104.219
 118.711 104.93 118.828 105.809 c h
120.418 117.711 m f
0.12549 0.105882 0.329412 rg
278.977 38.711 m 276.859 38.711 275.078 37.055 274.949 34.91 c 274.816 
32.684 276.52 30.773 278.742 30.641 c 318.441 28.312 l 333.332 21.355 l 
335.348 20.414 337.758 21.285 338.699 23.305 c 339.645 25.328 338.773 27.73
 336.754 28.672 c 321.152 35.957 l 320.695 36.176 320.191 36.301 319.684
 36.332 c 279.219 38.703 l 279.141 38.711 279.059 38.711 278.977 38.711 
c f
335.039 43.57 m 334.469 43.57 333.895 43.445 333.344 43.191 c 317.75 35.969
 l 315.727 35.031 314.84 32.625 315.781 30.602 c 316.715 28.574 319.117 
27.699 321.141 28.637 c 336.742 35.867 l 338.766 36.805 339.645 39.203 338.707
 41.227 c 338.023 42.703 336.562 43.57 335.039 43.57 c f
14.352 349.965 m 29.645 349.965 l 42.672 389.926 l 42.996 390.91 43.328
 391.93 43.656 392.98 c 43.98 394.031 44.297 395.066 44.594 396.09 c 44.891
 397.105 45.148 398.074 45.387 399 c 45.613 399.918 45.793 400.676 45.918
 401.266 c 46.25 399.953 46.695 398.242 47.254 396.137 c 47.812 394.031 
48.422 391.961 49.086 389.926 c 61.809 349.965 l 76.898 349.965 l 52.332
 419.027 l 38.914 419.027 l 14.352 349.965 l f
80.844 419.023 m 80.844 349.965 l 94.66 341.074 l 94.66 419.023 l h
80.844 419.023 m f
143.301 372.16 m 143.301 369.141 142.391 366.918 140.586 365.504 c 138.773
 364.09 136.324 363.379 133.234 363.379 c 117.355 363.379 l 117.355 381.141
 l 133.434 381.141 l 140.012 381.141 143.301 378.148 143.301 372.16 c 157.504
 371.867 m 157.504 375.883 156.875 379.32 155.633 382.176 c 154.375 385.039
 152.637 387.395 150.402 389.23 c 148.168 391.074 145.52 392.422 142.457
 393.277 c 139.402 394.133 136.098 394.559 132.551 394.559 c 117.355 394.559
 l 117.355 419.027 l 103.539 419.027 l 103.539 349.969 l 133.73 349.969 
l 136.953 349.969 140.012 350.406 142.906 351.297 c 145.793 352.188 148.324
 353.555 150.504 355.391 c 152.672 357.234 154.375 359.52 155.633 362.25
 c 156.875 364.98 157.504 368.188 157.504 371.867 c f
160.758 419.023 m 160.758 349.965 l 208.707 349.965 l 208.707 363.48 l 
174.574 363.48 l 174.574 375.418 l 194.395 375.418 l 194.395 388.832 l 174.574
 388.832 l 174.574 405.508 l 210.18 405.508 l 210.18 419.023 l h
160.758 419.023 m f
256.75 372.16 m 256.75 369.008 255.883 366.754 254.141 365.406 c 252.395
 364.059 249.973 363.379 246.891 363.379 c 228.832 363.379 l 228.832 381.141
 l 246.891 381.141 l 253.461 381.141 256.75 378.148 256.75 372.16 c 255.078
 419.027 m 242.738 394.164 l 228.832 394.164 l 228.832 419.027 l 215.02 
419.027 l 215.02 349.969 l 247.18 349.969 l 250.41 349.969 253.461 350.406
 256.355 351.297 c 259.25 352.188 261.781 353.555 263.953 355.391 c 266.121
 357.234 267.832 359.52 269.082 362.25 c 270.332 364.98 270.961 368.188 
270.961 371.867 c 270.961 377.066 269.852 381.328 267.652 384.641 c 265.449
 387.965 262.145 390.48 257.734 392.191 c 270.961 419.027 l h
255.078 419.027 m f
0.0784314 0.286275 0.619608 rg
305.844 383.277 m 303.664 380.328 300.602 378.859 296.656 378.871 c 291.262
 378.895 288.582 383.312 288.609 392.121 c 288.633 397.449 289.449 401.297
 291.078 403.66 c 292.691 406.016 294.848 407.195 297.547 407.188 c 299.656
 407.18 301.332 406.777 302.578 405.98 c 303.82 405.188 304.934 404.133 
305.922 402.809 c h
305.977 418.891 m 305.965 415.637 l 304.652 416.762 303.129 417.766 301.391
 418.664 c 299.652 419.559 297.527 420.012 295.031 420.02 c 292.273 420.031
 289.672 419.512 287.234 418.473 c 284.797 417.426 282.652 415.777 280.801
 413.516 c 278.953 411.258 277.488 408.395 276.43 404.945 c 275.359 401.496
 274.816 397.336 274.801 392.469 c 274.789 388.59 275.219 385.043 276.094
 381.816 c 276.969 378.586 278.258 375.801 279.957 373.457 c 281.656 371.121
 283.754 369.305 286.25 368.008 c 288.746 366.719 291.605 366.066 294.824
 366.055 c 297.129 366.047 299.219 366.434 301.094 367.215 c 302.973 367.996
 304.539 368.945 305.793 370.059 c 305.734 349.496 l 319.324 342.637 l 319.594
 418.84 l h
305.977 418.891 m f
352.027 386.949 m 351.895 385.766 351.617 384.629 351.223 383.547 c 350.816
 382.465 350.238 381.48 349.477 380.594 c 348.715 379.711 347.766 379.008
 346.637 378.484 c 345.516 377.961 344.195 377.707 342.672 377.711 c 340.16
 377.719 338.176 378.617 336.727 380.398 c 335.273 382.18 334.426 384.387
 334.172 387.02 c h
365.27 392.816 m 365.273 393.805 365.262 394.645 365.234 395.336 c 365.199
 396.023 365.152 396.629 365.09 397.156 c 334.016 397.277 l 334.148 399.055
 334.551 400.566 335.215 401.812 c 335.879 403.062 336.699 404.059 337.695
 404.812 c 338.684 405.566 339.785 406.121 341.004 406.477 c 342.223 406.836
 343.453 407.012 344.703 407.008 c 346.613 407 348.32 406.664 349.832 405.996
 c 351.34 405.34 352.59 404.445 353.566 403.324 c 363.27 411.375 l 361.18
 414.078 358.438 416.16 355.055 417.621 c 351.672 419.074 348.238 419.82
 344.75 419.832 c 341.004 419.848 337.633 419.219 334.645 417.945 c 331.66
 416.672 329.117 414.875 327.02 412.547 c 324.918 410.223 323.297 407.398
 322.141 404.082 c 320.98 400.766 320.395 397.07 320.379 392.992 c 320.367
 389.047 320.949 385.406 322.121 382.082 c 323.293 378.758 324.906 375.891
 326.973 373.48 c 329.031 371.07 331.453 369.207 334.25 367.875 c 337.035
 366.551 340.074 365.883 343.363 365.867 c 346.781 365.855 349.863 366.551
 352.598 367.953 c 355.332 369.363 357.629 371.293 359.477 373.75 c 361.328
 376.211 362.754 379.086 363.75 382.367 c 364.75 385.656 365.258 389.133
 365.27 392.816 c f
392.398 418.562 m 378.395 418.621 l 359.547 366.895 l 374.543 366.836 l
 382.23 390.781 l 382.891 392.75 383.531 394.82 384.129 396.988 c 384.734
 399.16 385.199 400.863 385.531 402.117 c 385.855 400.801 386.305 399.086
 386.895 396.977 c 387.477 394.875 388.094 392.797 388.746 390.758 c 396.25
 366.754 l 410.848 366.699 l h
392.398 418.562 m f
Q Q
showpage
%%Trailer
end
%%EOF
