<?xml version="1.0" encoding="UTF-8" standalone="no"?>
<!-- Created with Inkscape (http://www.inkscape.org/) -->

<svg
   xmlns:dc="http://purl.org/dc/elements/1.1/"
   xmlns:cc="http://creativecommons.org/ns#"
   xmlns:rdf="http://www.w3.org/1999/02/22-rdf-syntax-ns#"
   xmlns:svg="http://www.w3.org/2000/svg"
   xmlns="http://www.w3.org/2000/svg"
   xmlns:sodipodi="http://sodipodi.sourceforge.net/DTD/sodipodi-0.dtd"
   xmlns:inkscape="http://www.inkscape.org/namespaces/inkscape"
   version="1.1"
   id="svg2"
   xml:space="preserve"
   width="793.70667"
   height="1122.52"
   viewBox="0 0 793.70667 1122.52"
   sodipodi:docname="viperdev logo final.ai"><metadata
     id="metadata8"><rdf:RDF><cc:Work
         rdf:about=""><dc:format>image/svg+xml</dc:format><dc:type
           rdf:resource="http://purl.org/dc/dcmitype/StillImage" /></cc:Work></rdf:RDF></metadata><defs
     id="defs6"><clipPath
       clipPathUnits="userSpaceOnUse"
       id="clipPath20"><path
         d="m 100.899,681.049 -0.49,-0.732 c -0.138,-0.208 -0.157,-0.474 -0.049,-0.7 v 0 l 1.839,-3.182 c 0.13,-0.202 0.353,-0.325 0.595,-0.329 v 0 l 4.258,0.067 c 0.512,-0.008 0.868,0.503 0.685,0.979 v 0 l -1.641,3.231 c -0.073,0.191 -0.224,0.341 -0.414,0.415 v 0 l -4.03,0.546 c -0.054,0.013 -0.11,0.019 -0.164,0.019 v 0 c -0.233,0 -0.456,-0.114 -0.589,-0.314"
         id="path18"
         inkscape:connector-curvature="0" /></clipPath><clipPath
       clipPathUnits="userSpaceOnUse"
       id="clipPath40"><path
         d="m 105.004,676.248 -0.434,-0.766 c -0.123,-0.217 -0.121,-0.485 0.004,-0.702 v 0 l 2.072,-3.035 c 0.145,-0.192 0.377,-0.298 0.617,-0.284 v 0 l 4.243,0.386 c 0.509,0.031 0.827,0.566 0.609,1.028 v 0 l -1.88,3.099 c -0.087,0.184 -0.248,0.324 -0.442,0.382 v 0 l -4.06,0.243 c -0.038,0.006 -0.075,0.009 -0.113,0.009 v 0 c -0.252,0 -0.489,-0.135 -0.616,-0.36"
         id="path38"
         inkscape:connector-curvature="0" /></clipPath><clipPath
       clipPathUnits="userSpaceOnUse"
       id="clipPath60"><path
         d="M 0,841.89 H 595.28 V 0 H 0 Z"
         id="path58"
         inkscape:connector-curvature="0" /></clipPath><clipPath
       clipPathUnits="userSpaceOnUse"
       id="clipPath80"><path
         d="m 94.288,685.812 0.138,-2.421 c 0.014,-0.241 0.146,-0.458 0.353,-0.581 v 0 l 3.359,-1.984 c 0.439,-0.26 1.002,0.006 1.081,0.51 v 0 l 0.551,3.547 c 0.03,0.201 -0.025,0.407 -0.153,0.565 v 0 l -1.789,2.211 z"
         id="path78"
         inkscape:connector-curvature="0" /></clipPath><clipPath
       clipPathUnits="userSpaceOnUse"
       id="clipPath100"><path
         d="m 99.435,688.02 0.522,-2.368 c 0.052,-0.235 0.217,-0.429 0.442,-0.516 v 0 l 3.632,-1.424 c 0.475,-0.186 0.988,0.166 0.985,0.677 v 0 l -0.022,3.589 c -0.002,0.203 -0.089,0.398 -0.24,0.534 v 0 l -2.119,1.896 z"
         id="path98"
         inkscape:connector-curvature="0" /></clipPath><clipPath
       clipPathUnits="userSpaceOnUse"
       id="clipPath120"><path
         d="M 0,841.89 H 595.28 V 0 H 0 Z"
         id="path118"
         inkscape:connector-curvature="0" /></clipPath><clipPath
       clipPathUnits="userSpaceOnUse"
       id="clipPath144"><path
         d="m 125.706,679.868 -3.444,-1.22 c -0.259,-0.063 -0.451,-0.28 -0.48,-0.545 v 0 l -0.091,-0.785 c -0.026,-0.224 0.068,-0.444 0.247,-0.58 v 0 l 2.778,-1.787 c 0.187,-0.108 0.416,-0.115 0.61,-0.019 v 0 l 3.375,1.804 c 0.41,0.204 0.486,0.758 0.144,1.064 v 0 l -2.639,1.906 c -0.12,0.107 -0.274,0.166 -0.433,0.166 v 0 c -0.022,0 -0.045,-0.002 -0.067,-0.004"
         id="path142"
         inkscape:connector-curvature="0" /></clipPath><clipPath
       clipPathUnits="userSpaceOnUse"
       id="clipPath164"><path
         d="m 117.069,674.317 -3.871,-1.246 c -0.289,-0.062 -0.51,-0.298 -0.552,-0.59 v 0 l -0.127,-0.871 c -0.036,-0.249 0.062,-0.497 0.257,-0.654 v 0 l 3.032,-2.079 c 0.205,-0.125 0.459,-0.14 0.678,-0.039 v 0 l 3.814,1.897 c 0.464,0.213 0.566,0.828 0.195,1.179 v 0 l -2.875,2.207 c -0.134,0.128 -0.312,0.198 -0.496,0.198 v 0 c -0.018,0 -0.037,-10e-4 -0.055,-0.002"
         id="path162"
         inkscape:connector-curvature="0" /></clipPath><clipPath
       clipPathUnits="userSpaceOnUse"
       id="clipPath184"><path
         d="M 0,841.89 H 595.28 V 0 H 0 Z"
         id="path182"
         inkscape:connector-curvature="0" /></clipPath><clipPath
       clipPathUnits="userSpaceOnUse"
       id="clipPath196"><path
         d="m 123.801,674.175 -3.74,-1.598 c -0.283,-0.088 -0.48,-0.344 -0.495,-0.639 v 0 l -0.046,-0.879 c -0.013,-0.25 0.108,-0.489 0.317,-0.627 v 0 l 3.21,-1.791 c 0.216,-0.105 0.471,-0.097 0.68,0.024 v 0 l 3.622,2.241 c 0.442,0.255 0.486,0.876 0.085,1.192 v 0 l -3.066,1.932 c -0.128,0.101 -0.286,0.155 -0.447,0.155 v 0 c -0.04,0 -0.08,-0.003 -0.12,-0.01"
         id="path194"
         inkscape:connector-curvature="0" /></clipPath><clipPath
       clipPathUnits="userSpaceOnUse"
       id="clipPath216"><path
         d="m 134.034,681.039 -2.737,-3.008 c -0.219,-0.198 -0.293,-0.512 -0.184,-0.787 v 0 l 0.324,-0.818 c 0.093,-0.233 0.301,-0.4 0.549,-0.439 v 0 l 3.664,-0.293 c 0.24,-0.006 0.469,0.108 0.607,0.304 v 0 l 2.363,3.544 c 0.296,0.417 0.078,1 -0.419,1.12 v 0 l -3.591,0.481 c -0.056,0.014 -0.114,0.021 -0.171,0.021 v 0 c -0.143,0 -0.284,-0.043 -0.405,-0.125"
         id="path214"
         inkscape:connector-curvature="0" /></clipPath><clipPath
       clipPathUnits="userSpaceOnUse"
       id="clipPath236"><path
         d="M 0,841.89 H 595.28 V 0 H 0 Z"
         id="path234"
         inkscape:connector-curvature="0" /></clipPath><clipPath
       clipPathUnits="userSpaceOnUse"
       id="clipPath248"><path
         d="m 147.2,717.013 -1.017,-2.587 c -0.072,-0.139 -0.082,-0.301 -0.027,-0.448 v 0 l 1.738,-2.59 c 0.107,-0.201 0.328,-0.313 0.553,-0.283 v 0 l 0.669,0.092 c 0.19,0.026 0.352,0.151 0.427,0.329 v 0 l 0.89,2.674 c 0.049,0.179 0.006,0.369 -0.115,0.509 v 0 l -2.207,2.41 c -0.112,0.13 -0.265,0.192 -0.418,0.192 v 0 c -0.196,0 -0.391,-0.103 -0.493,-0.298"
         id="path246"
         inkscape:connector-curvature="0" /></clipPath><clipPath
       clipPathUnits="userSpaceOnUse"
       id="clipPath268"><path
         d="m 150.073,698.198 -2.334,-1.509 c -0.14,-0.07 -0.243,-0.196 -0.285,-0.347 v 0 l -0.097,-3.119 c -0.03,-0.225 0.084,-0.444 0.284,-0.551 v 0 l 0.597,-0.315 c 0.17,-0.091 0.375,-0.083 0.538,0.017 v 0 l 2.284,1.655 c 0.144,0.116 0.219,0.296 0.203,0.48 v 0 l -0.388,3.245 c -0.027,0.299 -0.279,0.504 -0.552,0.504 v 0 c -0.083,0 -0.168,-0.018 -0.25,-0.06"
         id="path266"
         inkscape:connector-curvature="0" /></clipPath><clipPath
       clipPathUnits="userSpaceOnUse"
       id="clipPath288"><path
         d="M 0,841.89 H 595.28 V 0 H 0 Z"
         id="path286"
         inkscape:connector-curvature="0" /></clipPath><clipPath
       clipPathUnits="userSpaceOnUse"
       id="clipPath308"><path
         d="m 95.396,689.705 0.138,-2.421 c 0.014,-0.24 0.147,-0.458 0.354,-0.58 v 0 l 3.358,-1.985 c 0.44,-0.26 1.002,0.006 1.081,0.51 v 0 l 0.55,3.547 c 0.032,0.202 -0.024,0.407 -0.152,0.565 v 0 l -1.789,2.211 z"
         id="path306"
         inkscape:connector-curvature="0" /></clipPath><clipPath
       clipPathUnits="userSpaceOnUse"
       id="clipPath328"><path
         d="M 0,841.89 H 595.28 V 0 H 0 Z"
         id="path326"
         inkscape:connector-curvature="0" /></clipPath><clipPath
       clipPathUnits="userSpaceOnUse"
       id="clipPath344"><path
         d="m 91.682,692.159 0.138,-2.422 c 0.013,-0.24 0.146,-0.458 0.353,-0.58 v 0 l 3.358,-1.985 c 0.44,-0.26 1.003,0.007 1.081,0.511 v 0 l 0.551,3.547 c 0.031,0.2 -0.024,0.406 -0.152,0.564 v 0 l -1.789,2.21 z"
         id="path342"
         inkscape:connector-curvature="0" /></clipPath><clipPath
       clipPathUnits="userSpaceOnUse"
       id="clipPath364"><path
         d="m 95.68,694.148 0.138,-2.421 c 0.013,-0.24 0.146,-0.458 0.353,-0.58 v 0 l 3.359,-1.985 c 0.439,-0.26 1.002,0.007 1.08,0.512 v 0 l 0.551,3.546 c 0.031,0.201 -0.024,0.406 -0.152,0.565 v 0 l -1.789,2.21 z"
         id="path362"
         inkscape:connector-curvature="0" /></clipPath><clipPath
       clipPathUnits="userSpaceOnUse"
       id="clipPath384"><path
         d="M 0,841.89 H 595.28 V 0 H 0 Z"
         id="path382"
         inkscape:connector-curvature="0" /></clipPath></defs><sodipodi:namedview
     pagecolor="#ffffff"
     bordercolor="#666666"
     borderopacity="1"
     objecttolerance="10"
     gridtolerance="10"
     guidetolerance="10"
     inkscape:pageopacity="0"
     inkscape:pageshadow="2"
     inkscape:window-width="640"
     inkscape:window-height="480"
     id="namedview4"
     showgrid="false" /><g
     id="g10"
     inkscape:groupmode="layer"
     inkscape:label="viperdev logo final"
     transform="matrix(1.3333333,0,0,-1.3333333,0,1122.52)"><path
       d="M 511.421,619.343 H 369.689 v 141.732 h 141.732 z"
       style="fill:#000000;fill-opacity:1;fill-rule:nonzero;stroke:none"
       id="path12"
       inkscape:connector-curvature="0" /><g
       id="g14"><g
         id="g16"
         clip-path="url(#clipPath20)"><g
           id="g22"
           transform="translate(100.2515,677.7574)"><path
             d="M 0,0 7.668,3.233 V -1.651 L 0,-1.651 Z"
             style="fill:#1e1d52;fill-opacity:1;fill-rule:nonzero;stroke:none"
             id="path24"
             inkscape:connector-curvature="0" /></g><g
           id="g26"
           transform="translate(100.2515,678.4612)"><path
             d="M 0,0 7.001,2.952 H 7.668 V 2.529 L 0,-0.704 Z"
             style="fill:#1e1d52;fill-opacity:1;fill-rule:nonzero;stroke:none"
             id="path28"
             inkscape:connector-curvature="0" /></g><g
           id="g30"
           transform="translate(107.2526,681.4129)"><path
             d="M 0,0 -7.001,-2.952 V 0 Z"
             style="fill:#1e1d52;fill-opacity:1;fill-rule:nonzero;stroke:none"
             id="path32"
             inkscape:connector-curvature="0" /></g></g></g><g
       id="g34"><g
         id="g36"
         clip-path="url(#clipPath40)"><g
           id="g42"
           transform="translate(104.4472,672.8371)"><path
             d="M 0,0 7.426,3.809 H 7.885 V -1.39 L 0,-1.39 Z"
             style="fill:#1e1d52;fill-opacity:1;fill-rule:nonzero;stroke:none"
             id="path44"
             inkscape:connector-curvature="0" /></g><g
           id="g46"
           transform="translate(104.4472,673.566)"><path
             d="M 0,0 6.005,3.08 H 7.426 L 0,-0.729 Z"
             style="fill:#1e1d52;fill-opacity:1;fill-rule:nonzero;stroke:none"
             id="path48"
             inkscape:connector-curvature="0" /></g><g
           id="g50"
           transform="translate(110.4519,676.6463)"><path
             d="M 0,0 -6.005,-3.08 V 0 Z"
             style="fill:#1e1d52;fill-opacity:1;fill-rule:nonzero;stroke:none"
             id="path52"
             inkscape:connector-curvature="0" /></g></g></g><g
       id="g54"><g
         id="g56"
         clip-path="url(#clipPath60)"><g
           id="g62"
           transform="translate(101.2125,685.0943)"><path
             d="m 0,0 1.184,-4.319 c 0.087,-0.225 0.28,-0.391 0.515,-0.444 l 3.807,-0.851 c 0.498,-0.112 0.951,0.315 0.87,0.819 L 5.103,-0.747 C 5.071,-0.546 4.955,-0.368 4.784,-0.256 L 3.103,0.79"
             style="fill:#14499e;fill-opacity:1;fill-rule:nonzero;stroke:none"
             id="path64"
             inkscape:connector-curvature="0" /></g><g
           id="g66"
           transform="translate(103.0869,683.9007)"><path
             d="M 0,0 C 0.169,-0.114 0.282,-0.294 0.311,-0.496 L 0.823,-4.048 C 0.896,-4.553 0.436,-4.972 -0.061,-4.853 l -3.792,0.914 c -0.234,0.057 -0.425,0.226 -0.508,0.452 l -0.886,3.864 c -0.056,0.244 0.022,0.5 0.203,0.672 l 0.639,0.605 c 0.215,0.204 0.534,0.252 0.8,0.122 z"
             style="fill:#57a0d7;fill-opacity:1;fill-rule:nonzero;stroke:none"
             id="path68"
             inkscape:connector-curvature="0" /></g><g
           id="g70"
           transform="translate(113.0283,683.4741)"><path
             d="M 0,0 C 0.186,-0.083 0.329,-0.24 0.393,-0.433 L 1.52,-3.841 C 1.681,-4.325 1.301,-4.819 0.791,-4.788 l -3.893,0.234 c -0.241,0.015 -0.458,0.148 -0.58,0.356 l -1.267,3.963 c -0.098,0.23 -0.067,0.496 0.082,0.697 l 0.24,0.394 c 0.176,0.238 0.482,0.342 0.766,0.26 z"
             style="fill:#14499e;fill-opacity:1;fill-rule:nonzero;stroke:none"
             id="path72"
             inkscape:connector-curvature="0" /></g></g></g><g
       id="g74"><g
         id="g76"
         clip-path="url(#clipPath80)"><g
           id="g82"
           transform="translate(94.2882,685.2736)"><path
             d="M 0,0 5.512,-0.669 V -4.708 H 0 Z"
             style="fill:#1e1d52;fill-opacity:1;fill-rule:nonzero;stroke:none"
             id="path84"
             inkscape:connector-curvature="0" /></g><g
           id="g86"
           transform="translate(94.2882,685.9033)"><path
             d="M 0,0 5.512,-0.669 V -1.298 L 0,-0.63 Z"
             style="fill:#1e1d52;fill-opacity:1;fill-rule:nonzero;stroke:none"
             id="path88"
             inkscape:connector-curvature="0" /></g><g
           id="g90"
           transform="translate(99.8005,685.2347)"><path
             d="M 0,0 -5.512,0.669 V 2.423 H 0 Z"
             style="fill:#1e1d52;fill-opacity:1;fill-rule:nonzero;stroke:none"
             id="path92"
             inkscape:connector-curvature="0" /></g></g></g><g
       id="g94"><g
         id="g96"
         clip-path="url(#clipPath100)"><g
           id="g102"
           transform="translate(99.4348,687.4858)"><path
             d="M 0,0 5.584,0.221 V -3.96 H 0 Z"
             style="fill:#1e1d52;fill-opacity:1;fill-rule:nonzero;stroke:none"
             id="path104"
             inkscape:connector-curvature="0" /></g><g
           id="g106"
           transform="translate(99.4348,688.1115)"><path
             d="M 0,0 5.584,0.221 V -0.405 L 0,-0.626 Z"
             style="fill:#1e1d52;fill-opacity:1;fill-rule:nonzero;stroke:none"
             id="path108"
             inkscape:connector-curvature="0" /></g><g
           id="g110"
           transform="translate(105.0192,688.3323)"><path
             d="M 0,0 -5.584,-0.221 V 2.076 H 0 Z"
             style="fill:#1e1d52;fill-opacity:1;fill-rule:nonzero;stroke:none"
             id="path112"
             inkscape:connector-curvature="0" /></g></g></g><g
       id="g114"><g
         id="g116"
         clip-path="url(#clipPath120)"><g
           id="g122"
           transform="translate(113.1045,677.6015)"><path
             d="M 0,0 C 0.202,-0.03 0.381,-0.143 0.494,-0.313 L 2.812,-3.099 C 3.095,-3.524 2.861,-4.1 2.362,-4.207 l -4.139,-1.009 c -0.235,-0.05 -0.48,0.021 -0.653,0.189 l -2.498,2.696 c -0.156,0.196 -0.197,0.46 -0.107,0.694 l 0.315,0.822 c 0.106,0.276 0.373,0.457 0.669,0.454 z"
             style="fill:#14499e;fill-opacity:1;fill-rule:nonzero;stroke:none"
             id="path124"
             inkscape:connector-curvature="0" /></g><g
           id="g126"
           transform="translate(142.1549,687.4231)"><path
             d="M 0,0 C 0.13,0.144 0.315,0.226 0.509,0.226 L 3.938,0.59 c 0.486,0 0.819,-0.49 0.639,-0.941 L 3.191,-4.16 C 3.107,-4.373 2.921,-4.53 2.697,-4.578 l -3.453,-0.555 c -0.238,-0.019 -0.468,0.088 -0.606,0.282 l -0.484,0.684 c -0.163,0.23 -0.166,0.537 -0.007,0.769 z"
             style="fill:#14499e;fill-opacity:1;fill-rule:nonzero;stroke:none"
             id="path128"
             inkscape:connector-curvature="0" /></g><g
           id="g130"
           transform="translate(149.1273,688.5526)"><path
             d="M 0,0 C 0.051,0.161 0.168,0.294 0.322,0.364 L 2.91,1.897 C 3.295,2.074 3.737,1.806 3.759,1.383 l 0.283,-3.525 c 0.01,-0.2 -0.08,-0.392 -0.241,-0.511 L 1.263,-4.346 C 1.082,-4.448 0.86,-4.447 0.68,-4.343 l -0.632,0.367 c -0.213,0.123 -0.326,0.366 -0.285,0.608 z"
             style="fill:#14499e;fill-opacity:1;fill-rule:nonzero;stroke:none"
             id="path132"
             inkscape:connector-curvature="0" /></g><g
           id="g134"
           transform="translate(141.9178,679.0952)"><path
             d="M 0,0 C 0.098,0.138 0.25,0.227 0.419,0.246 L 3.355,0.902 C 3.776,0.951 4.113,0.56 4.002,0.15 L 3.179,-3.289 C 3.127,-3.482 2.982,-3.636 2.793,-3.7 l -2.939,-0.824 c -0.203,-0.041 -0.414,0.029 -0.552,0.184 l -0.488,0.545 c -0.164,0.183 -0.197,0.449 -0.082,0.666 z"
             style="fill:#14499e;fill-opacity:1;fill-rule:nonzero;stroke:none"
             id="path136"
             inkscape:connector-curvature="0" /></g></g></g><g
       id="g138"><g
         id="g140"
         clip-path="url(#clipPath144)"><g
           id="g146"
           transform="translate(122.3061,674.8364)"><path
             d="M 0,0 4.226,5.051 H 6.881 V 0 Z"
             style="fill:#1e1d52;fill-opacity:1;fill-rule:nonzero;stroke:none"
             id="path148"
             inkscape:connector-curvature="0" /></g><g
           id="g150"
           transform="translate(121.665,674.9781)"><path
             d="m 0,0 4.107,4.909 h 0.76 L 0.641,-0.142 H 0 Z"
             style="fill:#1e1d52;fill-opacity:1;fill-rule:nonzero;stroke:none"
             id="path152"
             inkscape:connector-curvature="0" /></g><g
           id="g154"
           transform="translate(125.7723,679.8871)"><path
             d="M 0,0 -4.107,-4.909 V 0 Z"
             style="fill:#1e1d52;fill-opacity:1;fill-rule:nonzero;stroke:none"
             id="path156"
             inkscape:connector-curvature="0" /></g></g></g><g
       id="g158"><g
         id="g160"
         clip-path="url(#clipPath164)"><g
           id="g166"
           transform="translate(113.0416,668.737)"><path
             d="M 0,0 4.966,5.595 H 7.742 L 7.824,5.522 V 0 Z"
             style="fill:#1e1d52;fill-opacity:1;fill-rule:nonzero;stroke:none"
             id="path168"
             inkscape:connector-curvature="0" /></g><g
           id="g170"
           transform="translate(112.4833,669.085)"><path
             d="M 0,0 4.657,5.247 H 5.524 L 0.558,-0.348 H 0 Z"
             style="fill:#1e1d52;fill-opacity:1;fill-rule:nonzero;stroke:none"
             id="path172"
             inkscape:connector-curvature="0" /></g><g
           id="g174"
           transform="translate(117.1407,674.3321)"><path
             d="M 0,0 -4.657,-5.247 V 0 Z"
             style="fill:#1e1d52;fill-opacity:1;fill-rule:nonzero;stroke:none"
             id="path176"
             inkscape:connector-curvature="0" /></g></g></g><g
       id="g178"><g
         id="g180"
         clip-path="url(#clipPath184)"><g
           id="g186"
           transform="translate(131.6322,675.2911)"><path
             d="M 0,0 C 0.173,0.108 0.383,0.138 0.579,0.082 L 4.15,-0.536 c 0.491,-0.139 0.687,-0.73 0.376,-1.135 L 2.029,-5.123 C 1.883,-5.313 1.65,-5.419 1.41,-5.403 l -3.65,0.433 c -0.246,0.048 -0.448,0.222 -0.531,0.459 l -0.293,0.83 c -0.099,0.279 -0.013,0.59 0.215,0.78 z"
             style="fill:#57a0d7;fill-opacity:1;fill-rule:nonzero;stroke:none"
             id="path188"
             inkscape:connector-curvature="0" /></g></g></g><g
       id="g190"><g
         id="g192"
         clip-path="url(#clipPath196)"><g
           id="g198"
           transform="translate(120.518,668.5358)"><path
             d="M 0,0 4.166,5.673 H 7.317 V 0 Z"
             style="fill:#1e1d52;fill-opacity:1;fill-rule:nonzero;stroke:none"
             id="path200"
             inkscape:connector-curvature="0" /></g><g
           id="g202"
           transform="translate(119.7133,668.5358)"><path
             d="M 0,0 4.166,5.673 H 4.971 L 0.805,0 Z"
             style="fill:#1e1d52;fill-opacity:1;fill-rule:nonzero;stroke:none"
             id="path204"
             inkscape:connector-curvature="0" /></g><g
           id="g206"
           transform="translate(123.8797,674.2085)"><path
             d="M 0,0 -4.166,-5.673 H -4.372 V 0 Z"
             style="fill:#1e1d52;fill-opacity:1;fill-rule:nonzero;stroke:none"
             id="path208"
             inkscape:connector-curvature="0" /></g></g></g><g
       id="g210"><g
         id="g212"
         clip-path="url(#clipPath216)"><g
           id="g218"
           transform="translate(133.6307,675.6878)"><path
             d="M 0,0 1.142,5.504 H 5.285 V 0 Z"
             style="fill:#1e1d52;fill-opacity:1;fill-rule:nonzero;stroke:none"
             id="path220"
             inkscape:connector-curvature="0" /></g><g
           id="g222"
           transform="translate(132.9684,675.6878)"><path
             d="M 0,0 1.142,5.504 H 1.804 L 0.662,0 Z"
             style="fill:#1e1d52;fill-opacity:1;fill-rule:nonzero;stroke:none"
             id="path224"
             inkscape:connector-curvature="0" /></g><g
           id="g226"
           transform="translate(134.11,681.1917)"><path
             d="M 0,0 -1.142,-5.504 H -3.106 V 0 Z"
             style="fill:#1e1d52;fill-opacity:1;fill-rule:nonzero;stroke:none"
             id="path228"
             inkscape:connector-curvature="0" /></g></g></g><g
       id="g230"><g
         id="g232"
         clip-path="url(#clipPath236)"><g
           id="g238"
           transform="translate(150.3904,705.9169)"><path
             d="m 0,0 c -0.032,0.153 0.002,0.312 0.093,0.439 l 1.386,2.41 c 0.23,0.317 0.707,0.303 0.916,-0.028 l 1.83,-2.708 c 0.099,-0.156 0.114,-0.351 0.039,-0.52 L 2.991,-2.923 C 2.892,-3.087 2.713,-3.187 2.521,-3.184 l -0.675,0.007 c -0.228,0.003 -0.429,0.146 -0.506,0.36 z"
             style="fill:#57a0d7;fill-opacity:1;fill-rule:nonzero;stroke:none"
             id="path240"
             inkscape:connector-curvature="0" /></g></g></g><g
       id="g242"><g
         id="g244"
         clip-path="url(#clipPath248)"><g
           id="g250"
           transform="translate(150.4819,712.4976)"><path
             d="M 0,0 -4.381,2.095 V 4.918 H 0 Z"
             style="fill:#1e1d52;fill-opacity:1;fill-rule:nonzero;stroke:none"
             id="path252"
             inkscape:connector-curvature="0" /></g><g
           id="g254"
           transform="translate(150.4819,711.9462)"><path
             d="M 0,0 -4.381,2.095 V 2.646 L 0,0.551 Z"
             style="fill:#1e1d52;fill-opacity:1;fill-rule:nonzero;stroke:none"
             id="path256"
             inkscape:connector-curvature="0" /></g><g
           id="g258"
           transform="translate(146.1009,714.0407)"><path
             d="M 0,0 4.381,-2.095 V -2.966 H 0 Z"
             style="fill:#1e1d52;fill-opacity:1;fill-rule:nonzero;stroke:none"
             id="path260"
             inkscape:connector-curvature="0" /></g></g></g><g
       id="g262"><g
         id="g264"
         clip-path="url(#clipPath268)"><g
           id="g270"
           transform="translate(150.2987,692.2668)"><path
             d="M 0,0 -2.972,5.409 V 6.108 H 0.981 L 0.981,0 Z"
             style="fill:#1e1d52;fill-opacity:1;fill-rule:nonzero;stroke:none"
             id="path272"
             inkscape:connector-curvature="0" /></g><g
           id="g274"
           transform="translate(149.7311,692.2668)"><path
             d="M 0,0 -2.404,4.376 V 5.409 L 0.568,0 Z"
             style="fill:#1e1d52;fill-opacity:1;fill-rule:nonzero;stroke:none"
             id="path276"
             inkscape:connector-curvature="0" /></g><g
           id="g278"
           transform="translate(147.3271,696.6424)"><path
             d="M 0,0 2.404,-4.376 H 0 Z"
             style="fill:#1e1d52;fill-opacity:1;fill-rule:nonzero;stroke:none"
             id="path280"
             inkscape:connector-curvature="0" /></g></g></g><g
       id="g282"><g
         id="g284"
         clip-path="url(#clipPath288)"><g
           id="g290"
           transform="translate(117.5325,678.6795)"><path
             d="M 0,0 C 0.203,-0.015 0.391,-0.115 0.516,-0.276 L 3.545,-3.343 C 3.859,-3.746 3.668,-4.338 3.177,-4.481 L -0.568,-5.57 c -0.231,-0.068 -0.481,-0.015 -0.665,0.139 l -2.688,2.915 c -0.17,0.184 -0.229,0.444 -0.157,0.684 l 0.254,0.843 c 0.085,0.283 0.338,0.484 0.634,0.502 z"
             style="fill:#57a0d7;fill-opacity:1;fill-rule:nonzero;stroke:none"
             id="path292"
             inkscape:connector-curvature="0" /></g><g
           id="g294"
           transform="translate(97.4925,691.8298)"><path
             d="m 0,0 0.138,-2.421 c 0.013,-0.24 0.146,-0.458 0.353,-0.581 L 3.85,-4.986 c 0.439,-0.26 1.002,0.006 1.08,0.511 l 0.551,3.546 c 0.031,0.201 -0.024,0.407 -0.152,0.565 L 3.54,1.846"
             style="fill:#14499e;fill-opacity:1;fill-rule:nonzero;stroke:none"
             id="path296"
             inkscape:connector-curvature="0" /></g><g
           id="g298"
           transform="translate(92.4818,689.251)"><path
             d="M 0,0 0.138,-2.421 C 0.151,-2.662 0.284,-2.879 0.491,-3.002 L 3.85,-4.986 c 0.439,-0.26 1.002,0.006 1.08,0.511 l 0.551,3.546 c 0.031,0.201 -0.024,0.407 -0.152,0.565 L 3.54,1.846"
             style="fill:#14499e;fill-opacity:1;fill-rule:nonzero;stroke:none"
             id="path300"
             inkscape:connector-curvature="0" /></g></g></g><g
       id="g302"><g
         id="g304"
         clip-path="url(#clipPath308)"><g
           id="g310"
           transform="translate(99.4706,691.5515)"><path
             d="m 0,0 -1.184,-7.092 h -2.89 V 0 Z"
             style="fill:#2a337c;fill-opacity:1;fill-rule:nonzero;stroke:none"
             id="path312"
             inkscape:connector-curvature="0" /></g><g
           id="g314"
           transform="translate(100.4266,691.5515)"><path
             d="M 0,0 -1.184,-7.092 H -2.14 L -0.956,0 Z"
             style="fill:#2a337c;fill-opacity:1;fill-rule:nonzero;stroke:none"
             id="path316"
             inkscape:connector-curvature="0" /></g><g
           id="g318"
           transform="translate(99.2422,684.4592)"><path
             d="M 0,0 1.184,7.092 H 1.666 V 0 Z"
             style="fill:#2a337c;fill-opacity:1;fill-rule:nonzero;stroke:none"
             id="path320"
             inkscape:connector-curvature="0" /></g></g></g><g
       id="g322"><g
         id="g324"
         clip-path="url(#clipPath328)"><g
           id="g330"
           transform="translate(91.9497,689.4607)"><path
             d="m 0,0 c -2.558,5.992 -3.341,12.568 -2.263,19.02 2.377,14.238 13.52,25.5 27.727,28.022 0.358,0.07 4.243,0.799 7.391,0.553 l -0.771,-9.97 C 30.651,37.736 28.235,37.393 27.288,37.209 17.164,35.412 9.282,27.446 7.6,17.372 6.838,12.808 7.39,8.159 9.197,3.927 Z"
             style="fill:#201b54;fill-opacity:1;fill-rule:nonzero;stroke:none"
             id="path332"
             inkscape:connector-curvature="0" /></g><g
           id="g334"
           transform="translate(120.1936,735.0033)"><path
             d="M 0,0 3.227,2.906 C 4.85,4.367 7.085,4.944 9.213,4.45 L 20.681,1.785 c 1.509,-0.35 2.574,-1.7 2.562,-3.25 l -0.026,-3.63 c -0.011,-1.457 -0.973,-2.736 -2.37,-3.151 l -10.794,-3.202 c -2.045,-0.607 -4.257,-0.201 -5.954,1.093 L 0.84,-7.871 Z"
             style="fill:#201b54;fill-opacity:1;fill-rule:nonzero;stroke:none"
             id="path336"
             inkscape:connector-curvature="0" /></g></g></g><g
       id="g338"><g
         id="g340"
         clip-path="url(#clipPath344)"><g
           id="g346"
           transform="translate(91.6817,691.6202)"><path
             d="M 0,0 5.512,-0.669 V -4.708 H 0 Z"
             style="fill:#1e1d52;fill-opacity:1;fill-rule:nonzero;stroke:none"
             id="path348"
             inkscape:connector-curvature="0" /></g><g
           id="g350"
           transform="translate(91.6817,692.2499)"><path
             d="M 0,0 5.512,-0.669 V -1.298 L 0,-0.63 Z"
             style="fill:#1e1d52;fill-opacity:1;fill-rule:nonzero;stroke:none"
             id="path352"
             inkscape:connector-curvature="0" /></g><g
           id="g354"
           transform="translate(97.194,691.5813)"><path
             d="M 0,0 -5.512,0.669 V 2.423 H 0 Z"
             style="fill:#1e1d52;fill-opacity:1;fill-rule:nonzero;stroke:none"
             id="path356"
             inkscape:connector-curvature="0" /></g></g></g><g
       id="g358"><g
         id="g360"
         clip-path="url(#clipPath364)"><g
           id="g366"
           transform="translate(95.68,693.6105)"><path
             d="M 0,0 5.512,-0.669 V -4.708 H 0 Z"
             style="fill:#1e1d52;fill-opacity:1;fill-rule:nonzero;stroke:none"
             id="path368"
             inkscape:connector-curvature="0" /></g><g
           id="g370"
           transform="translate(95.68,694.2402)"><path
             d="M 0,0 5.512,-0.669 V -1.298 L 0,-0.63 Z"
             style="fill:#1e1d52;fill-opacity:1;fill-rule:nonzero;stroke:none"
             id="path372"
             inkscape:connector-curvature="0" /></g><g
           id="g374"
           transform="translate(101.1923,693.5716)"><path
             d="M 0,0 -5.512,0.669 V 2.423 H 0 Z"
             style="fill:#1e1d52;fill-opacity:1;fill-rule:nonzero;stroke:none"
             id="path376"
             inkscape:connector-curvature="0" /></g></g></g><g
       id="g386"
       transform="translate(97.8946,698.2131)"><path
         d="m 0,0 c 0.104,-0.175 0.13,-0.386 0.071,-0.581 l -1.046,-3.433 c -0.148,-0.488 -0.743,-0.672 -1.142,-0.353 l -3.044,2.438 c -0.188,0.151 -0.289,0.385 -0.268,0.625 l 1.251,3.968 c 0.053,0.245 0.232,0.443 0.469,0.522 l 0.424,0.183 c 0.281,0.093 0.591,10e-4 0.776,-0.23 z"
         style="fill:#14499e;fill-opacity:1;fill-rule:nonzero;stroke:none"
         id="path388"
         inkscape:connector-curvature="0" /></g><g
       id="g390"
       transform="translate(95.1217,708.6385)"><path
         d="m 0,0 c 0.026,-0.148 -0.012,-0.301 -0.105,-0.42 l -1.634,-2.093 c -0.232,-0.297 -0.692,-0.266 -0.882,0.06 l -1.455,2.492 c -0.09,0.154 -0.097,0.342 -0.019,0.502 l 1.918,2.408 c 0.101,0.155 0.277,0.244 0.462,0.236 l 0.342,0.013 c 0.219,-0.01 0.408,-0.156 0.474,-0.364 z"
         style="fill:#14499e;fill-opacity:1;fill-rule:nonzero;stroke:none"
         id="path392"
         inkscape:connector-curvature="0" /></g><g
       id="g394"
       transform="translate(99.1368,711.7651)"><path
         d="m 0,0 c 0,-0.151 -0.064,-0.294 -0.176,-0.395 l -1.972,-1.778 c -0.281,-0.253 -0.728,-0.143 -0.859,0.211 l -1,2.707 c -0.062,0.167 -0.036,0.354 0.068,0.498 l 2.306,2.039 c 0.127,0.135 0.316,0.192 0.497,0.152 L -0.798,3.388 C -0.584,3.34 -0.423,3.164 -0.394,2.947 Z"
         style="fill:#14499e;fill-opacity:1;fill-rule:nonzero;stroke:none"
         id="path396"
         inkscape:connector-curvature="0" /></g><g
       id="g398"
       transform="translate(138.3931,731.3235)"><path
         d="m 0,0 c -0.525,0 -0.966,0.41 -0.997,0.941 -0.033,0.552 0.388,1.025 0.939,1.057 L 9.77,2.575 13.457,4.297 C 13.956,4.53 14.553,4.315 14.786,3.815 15.02,3.314 14.804,2.719 14.304,2.486 L 10.442,0.682 C 10.328,0.628 10.204,0.597 10.078,0.589 L 0.06,0.002 C 0.04,0 0.02,0 0,0"
         style="fill:#201b54;fill-opacity:1;fill-rule:nonzero;stroke:none"
         id="path400"
         inkscape:connector-curvature="0" /></g><g
       id="g402"
       transform="translate(152.273,730.1213)"><path
         d="m 0,0 c -0.141,0 -0.284,0.03 -0.42,0.093 l -3.861,1.789 c -0.501,0.232 -0.72,0.827 -0.487,1.328 0.231,0.502 0.826,0.719 1.327,0.487 L 0.421,1.907 C 0.922,1.675 1.14,1.081 0.908,0.58 0.739,0.214 0.377,0 0,0"
         style="fill:#201b54;fill-opacity:1;fill-rule:nonzero;stroke:none"
         id="path404"
         inkscape:connector-curvature="0" /></g><g
       id="g406"
       transform="translate(72.8762,654.2629)"><path
         d="m 0,0 h 3.787 l 3.225,-9.893 c 0.08,-0.244 0.162,-0.496 0.244,-0.756 0.08,-0.261 0.158,-0.517 0.232,-0.77 0.073,-0.252 0.137,-0.492 0.196,-0.721 0.056,-0.227 0.101,-0.415 0.132,-0.561 0.082,0.325 0.192,0.749 0.33,1.27 0.139,0.521 0.29,1.034 0.454,1.538 L 11.75,0 h 3.736 L 9.404,-17.098 H 6.082 L 0,0"
         style="fill:#201b54;fill-opacity:1;fill-rule:nonzero;stroke:none"
         id="path408"
         inkscape:connector-curvature="0" /></g><g
       id="g410"
       transform="translate(89.3391,637.1653)"><path
         d="m 0,0 v 17.098 l 3.42,2.201 V 0 Z"
         style="fill:#201b54;fill-opacity:1;fill-rule:nonzero;stroke:none"
         id="path412"
         inkscape:connector-curvature="0" /></g><g
       id="g414"
       transform="translate(104.802,648.7678)"><path
         d="m 0,0 c 0,0.748 -0.225,1.298 -0.672,1.648 -0.449,0.35 -1.055,0.526 -1.82,0.526 h -3.932 v -4.397 h 3.981 C -0.814,-2.223 0,-1.482 0,0 M 3.516,0.073 C 3.516,-0.921 3.361,-1.772 3.053,-2.479 2.742,-3.188 2.311,-3.771 1.758,-4.226 1.205,-4.682 0.549,-5.016 -0.209,-5.228 -0.965,-5.44 -1.783,-5.545 -2.662,-5.545 h -3.762 v -6.058 h -3.42 V 5.495 h 7.475 c 0.797,0 1.555,-0.109 2.271,-0.329 C 0.617,4.945 1.244,4.607 1.783,4.152 2.32,3.696 2.742,3.13 3.053,2.454 3.361,1.778 3.516,0.984 3.516,0.073"
         style="fill:#201b54;fill-opacity:1;fill-rule:nonzero;stroke:none"
         id="path416"
         inkscape:connector-curvature="0" /></g><g
       id="g418"
       transform="translate(109.1242,637.1653)"><path
         d="M 0,0 V 17.098 H 11.871 V 13.752 H 3.42 V 10.796 H 8.328 V 7.475 H 3.42 V 3.347 h 8.816 V 0 Z"
         style="fill:#201b54;fill-opacity:1;fill-rule:nonzero;stroke:none"
         id="path420"
         inkscape:connector-curvature="0" /></g><g
       id="g422"
       transform="translate(132.8899,648.7678)"><path
         d="m 0,0 c 0,0.781 -0.215,1.339 -0.646,1.673 -0.432,0.333 -1.032,0.501 -1.795,0.501 h -4.471 v -4.397 h 4.471 C -0.814,-2.223 0,-1.482 0,0 m -0.414,-11.603 -3.055,6.156 h -3.443 v -6.156 h -3.42 V 5.495 h 7.963 c 0.799,0 1.555,-0.109 2.271,-0.329 C 0.619,4.945 1.246,4.607 1.783,4.152 2.32,3.696 2.744,3.13 3.053,2.454 3.363,1.778 3.518,0.984 3.518,0.073 3.518,-1.214 3.244,-2.269 2.699,-3.09 2.154,-3.913 1.336,-4.535 0.244,-4.959 l 3.274,-6.644 z"
         style="fill:#201b54;fill-opacity:1;fill-rule:nonzero;stroke:none"
         id="path424"
         inkscape:connector-curvature="0" /></g><g
       id="g426"
       transform="translate(145.0446,646.0158)"><path
         d="m 0,0 c -0.54,0.73 -1.298,1.094 -2.275,1.091 -1.335,-0.006 -1.999,-1.1 -1.992,-3.281 0.006,-1.319 0.208,-2.271 0.611,-2.856 0.4,-0.584 0.934,-0.876 1.602,-0.874 0.522,0.002 0.937,0.102 1.245,0.299 0.308,0.196 0.584,0.458 0.828,0.785 z M 0.033,-8.817 0.03,-8.012 c -0.325,-0.278 -0.702,-0.527 -1.133,-0.749 -0.43,-0.222 -0.956,-0.334 -1.574,-0.336 -0.683,-0.003 -1.327,0.126 -1.93,0.383 -0.604,0.259 -1.135,0.668 -1.593,1.228 -0.458,0.559 -0.82,1.267 -1.082,2.121 -0.265,0.854 -0.4,1.884 -0.404,3.089 -0.003,0.961 0.104,1.839 0.32,2.638 0.217,0.799 0.536,1.489 0.957,2.069 0.421,0.579 0.94,1.028 1.558,1.349 0.618,0.32 1.326,0.481 2.123,0.484 0.57,0.002 1.088,-0.094 1.552,-0.287 0.465,-0.194 0.853,-0.429 1.163,-0.704 l -0.014,5.091 3.364,1.698 0.067,-18.867 z"
         style="fill:#14499e;fill-opacity:1;fill-rule:nonzero;stroke:none"
         id="path428"
         inkscape:connector-curvature="0" /></g><g
       id="g430"
       transform="translate(156.4792,645.1067)"><path
         d="M 0,0 C -0.033,0.293 -0.102,0.574 -0.2,0.842 -0.3,1.11 -0.443,1.354 -0.632,1.573 -0.821,1.792 -1.056,1.966 -1.335,2.096 -1.613,2.225 -1.94,2.288 -2.317,2.287 -2.939,2.285 -3.43,2.063 -3.789,1.622 -4.148,1.181 -4.358,0.634 -4.421,-0.017 Z M 3.278,-1.453 C 3.279,-1.697 3.276,-1.905 3.269,-2.076 3.261,-2.247 3.249,-2.397 3.234,-2.527 l -7.694,-0.03 c 0.033,-0.44 0.133,-0.814 0.297,-1.123 0.164,-0.309 0.368,-0.556 0.614,-0.743 0.245,-0.186 0.518,-0.324 0.819,-0.412 0.302,-0.089 0.607,-0.132 0.916,-0.131 0.473,0.002 0.896,0.085 1.27,0.25 0.373,0.163 0.683,0.384 0.925,0.662 l 2.402,-1.993 c -0.518,-0.67 -1.196,-1.185 -2.034,-1.547 -0.837,-0.36 -1.688,-0.544 -2.551,-0.547 -0.928,-0.004 -1.762,0.152 -2.502,0.467 -0.739,0.315 -1.369,0.76 -1.888,1.336 -0.52,0.576 -0.922,1.275 -1.208,2.096 -0.287,0.821 -0.432,1.736 -0.436,2.746 -0.003,0.977 0.141,1.878 0.431,2.701 0.29,0.823 0.69,1.533 1.201,2.13 0.51,0.596 1.11,1.058 1.802,1.387 0.69,0.328 1.442,0.494 2.256,0.497 C -1.299,5.222 -0.536,5.05 0.141,4.703 0.818,4.354 1.386,3.876 1.844,3.268 2.302,2.659 2.655,1.947 2.902,1.134 3.149,0.32 3.275,-0.541 3.278,-1.453"
         style="fill:#14499e;fill-opacity:1;fill-rule:nonzero;stroke:none"
         id="path432"
         inkscape:connector-curvature="0" /></g><g
       id="g434"
       transform="translate(166.4743,637.2795)"><path
         d="m 0,0 -3.468,-0.014 -4.666,12.806 3.713,0.015 1.903,-5.929 c 0.164,-0.487 0.322,-1 0.47,-1.536 0.15,-0.538 0.265,-0.96 0.347,-1.27 0.081,0.326 0.192,0.75 0.338,1.273 0.144,0.52 0.297,1.034 0.458,1.539 l 1.858,5.943 3.614,0.014 z"
         style="fill:#14499e;fill-opacity:1;fill-rule:nonzero;stroke:none"
         id="path436"
         inkscape:connector-curvature="0" /></g><g
       id="g438"
       transform="translate(261.1303,680.7978)"><path
         d="M 0,0 C 0.19,-0.074 0.34,-0.224 0.413,-0.415 L 2.055,-3.646 C 2.237,-4.122 1.881,-4.633 1.37,-4.625 l -4.259,-0.067 c -0.241,0.004 -0.464,0.127 -0.595,0.329 l -1.839,3.183 c -0.108,0.225 -0.089,0.492 0.05,0.7 l 0.49,0.731 c 0.165,0.246 0.465,0.364 0.753,0.295 z"
         style="fill:#000000;fill-opacity:1;fill-rule:nonzero;stroke:none"
         id="path440"
         inkscape:connector-curvature="0" /></g><g
       id="g442"
       transform="translate(265.2401,676.3567)"><path
         d="M 0,0 C 0.195,-0.059 0.356,-0.198 0.443,-0.383 L 2.322,-3.481 C 2.54,-3.943 2.223,-4.479 1.713,-4.51 l -4.242,-0.385 c -0.24,-0.015 -0.472,0.091 -0.618,0.283 l -2.072,3.036 c -0.125,0.217 -0.126,0.484 -0.003,0.702 l 0.434,0.766 c 0.145,0.258 0.436,0.398 0.729,0.35 z"
         style="fill:#000000;fill-opacity:1;fill-rule:nonzero;stroke:none"
         id="path444"
         inkscape:connector-curvature="0" /></g><g
       id="g446"
       transform="translate(256.6603,685.0943)"><path
         d="M 0,0 1.183,-4.319 C 1.271,-4.544 1.464,-4.71 1.699,-4.763 l 3.807,-0.851 c 0.498,-0.112 0.951,0.315 0.87,0.819 L 5.103,-0.747 C 5.071,-0.546 4.955,-0.368 4.784,-0.256 L 3.103,0.79"
         style="fill:#000000;fill-opacity:1;fill-rule:nonzero;stroke:none"
         id="path448"
         inkscape:connector-curvature="0" /></g><g
       id="g450"
       transform="translate(257.7454,683.1362)"><path
         d="M 0,0 C 0.169,-0.114 0.282,-0.294 0.311,-0.496 L 0.823,-4.048 C 0.896,-4.553 0.436,-4.972 -0.06,-4.853 l -3.793,0.914 c -0.234,0.057 -0.424,0.226 -0.508,0.452 l -0.886,3.864 c -0.056,0.244 0.022,0.499 0.203,0.672 l 0.639,0.605 c 0.215,0.204 0.534,0.252 0.8,0.122 z"
         style="fill:#000000;fill-opacity:1;fill-rule:nonzero;stroke:none"
         id="path452"
         inkscape:connector-curvature="0" /></g><g
       id="g454"
       transform="translate(258.8344,686.4971)"><path
         d="M 0,0 C 0.169,-0.114 0.282,-0.294 0.311,-0.496 L 0.823,-4.048 C 0.896,-4.553 0.436,-4.972 -0.061,-4.853 l -3.792,0.914 c -0.234,0.057 -0.425,0.226 -0.508,0.452 l -0.886,3.864 c -0.056,0.244 0.021,0.5 0.203,0.672 l 0.639,0.605 c 0.215,0.204 0.534,0.253 0.8,0.122 z"
         style="fill:#000000;fill-opacity:1;fill-rule:nonzero;stroke:none"
         id="path456"
         inkscape:connector-curvature="0" /></g><g
       id="g458"
       transform="translate(268.239,684.496)"><path
         d="M 0,0 C 0.186,-0.082 0.329,-0.24 0.393,-0.433 L 1.52,-3.841 C 1.681,-4.325 1.301,-4.819 0.791,-4.788 l -3.893,0.235 c -0.241,0.014 -0.458,0.147 -0.58,0.355 l -1.268,3.963 c -0.097,0.231 -0.066,0.496 0.083,0.697 l 0.24,0.394 c 0.176,0.239 0.482,0.342 0.766,0.26 z"
         style="fill:#000000;fill-opacity:1;fill-rule:nonzero;stroke:none"
         id="path460"
         inkscape:connector-curvature="0" /></g><g
       id="g462"
       transform="translate(249.736,685.8118)"><path
         d="M 0,0 0.138,-2.421 C 0.151,-2.662 0.284,-2.879 0.491,-3.002 L 3.85,-4.986 c 0.439,-0.26 1.002,0.006 1.08,0.51 l 0.551,3.547 c 0.031,0.201 -0.024,0.406 -0.152,0.565 L 3.54,1.846"
         style="fill:#000000;fill-opacity:1;fill-rule:nonzero;stroke:none"
         id="path464"
         inkscape:connector-curvature="0" /></g><g
       id="g466"
       transform="translate(254.8826,688.0207)"><path
         d="M 0,0 0.522,-2.368 C 0.574,-2.603 0.74,-2.797 0.964,-2.885 l 3.632,-1.423 c 0.475,-0.187 0.988,0.166 0.985,0.676 L 5.559,-0.043 C 5.558,0.161 5.47,0.355 5.319,0.491 L 3.2,2.387"
         style="fill:#000000;fill-opacity:1;fill-rule:nonzero;stroke:none"
         id="path468"
         inkscape:connector-curvature="0" /></g><g
       id="g470"
       transform="translate(268.5523,677.6015)"><path
         d="M 0,0 C 0.202,-0.03 0.381,-0.143 0.494,-0.313 L 2.812,-3.099 C 3.095,-3.524 2.861,-4.1 2.362,-4.207 l -4.139,-1.009 c -0.235,-0.05 -0.48,0.021 -0.653,0.189 l -2.498,2.696 c -0.156,0.196 -0.197,0.46 -0.107,0.694 l 0.315,0.822 c 0.106,0.276 0.373,0.457 0.669,0.454 z"
         style="fill:#000000;fill-opacity:1;fill-rule:nonzero;stroke:none"
         id="path472"
         inkscape:connector-curvature="0" /></g><g
       id="g474"
       transform="translate(297.6027,687.4231)"><path
         d="M 0,0 C 0.13,0.144 0.315,0.226 0.509,0.226 L 3.938,0.59 c 0.486,0 0.819,-0.49 0.639,-0.941 L 3.191,-4.16 C 3.107,-4.373 2.921,-4.53 2.697,-4.578 l -3.453,-0.555 c -0.238,-0.019 -0.468,0.088 -0.606,0.282 l -0.484,0.684 c -0.163,0.23 -0.166,0.537 -0.007,0.769 z"
         style="fill:#000000;fill-opacity:1;fill-rule:nonzero;stroke:none"
         id="path476"
         inkscape:connector-curvature="0" /></g><g
       id="g478"
       transform="translate(304.5751,688.5526)"><path
         d="M 0,0 C 0.051,0.161 0.168,0.294 0.322,0.364 L 2.91,1.897 C 3.295,2.074 3.737,1.806 3.759,1.383 l 0.283,-3.525 c 0.01,-0.2 -0.08,-0.392 -0.241,-0.511 L 1.263,-4.346 C 1.082,-4.448 0.86,-4.447 0.68,-4.343 l -0.632,0.367 c -0.213,0.123 -0.326,0.366 -0.285,0.608 z"
         style="fill:#000000;fill-opacity:1;fill-rule:nonzero;stroke:none"
         id="path480"
         inkscape:connector-curvature="0" /></g><g
       id="g482"
       transform="translate(297.3656,679.0952)"><path
         d="M 0,0 C 0.098,0.138 0.25,0.227 0.418,0.246 L 3.355,0.902 C 3.776,0.951 4.113,0.56 4.002,0.15 L 3.179,-3.289 C 3.127,-3.482 2.982,-3.636 2.793,-3.7 l -2.939,-0.824 c -0.203,-0.041 -0.414,0.029 -0.552,0.184 l -0.488,0.545 c -0.164,0.183 -0.197,0.449 -0.082,0.666 z"
         style="fill:#000000;fill-opacity:1;fill-rule:nonzero;stroke:none"
         id="path484"
         inkscape:connector-curvature="0" /></g><g
       id="g486"
       transform="translate(281.1534,679.868)"><path
         d="M 0,0 C 0.182,0.019 0.364,-0.04 0.5,-0.162 L 3.139,-2.068 C 3.481,-2.374 3.406,-2.928 2.995,-3.132 L -0.38,-4.935 c -0.194,-0.097 -0.422,-0.09 -0.61,0.017 l -2.777,1.788 c -0.179,0.135 -0.274,0.356 -0.248,0.579 l 0.091,0.786 c 0.03,0.265 0.222,0.482 0.48,0.545 z"
         style="fill:#000000;fill-opacity:1;fill-rule:nonzero;stroke:none"
         id="path488"
         inkscape:connector-curvature="0" /></g><g
       id="g490"
       transform="translate(272.5169,674.3168)"><path
         d="m 0,0 c 0.203,0.015 0.403,-0.056 0.551,-0.196 l 2.875,-2.207 c 0.37,-0.351 0.269,-0.965 -0.195,-1.179 l -3.814,-1.897 c -0.219,-0.101 -0.473,-0.086 -0.679,0.04 l -3.031,2.078 c -0.195,0.157 -0.293,0.406 -0.257,0.654 l 0.126,0.871 c 0.043,0.293 0.263,0.529 0.553,0.591 z"
         style="fill:#000000;fill-opacity:1;fill-rule:nonzero;stroke:none"
         id="path492"
         inkscape:connector-curvature="0" /></g><g
       id="g494"
       transform="translate(287.08,675.2911)"><path
         d="M 0,0 C 0.173,0.108 0.383,0.138 0.579,0.082 L 4.15,-0.536 c 0.491,-0.139 0.687,-0.73 0.376,-1.135 L 2.029,-5.123 C 1.883,-5.313 1.65,-5.419 1.41,-5.403 l -3.65,0.433 c -0.246,0.048 -0.448,0.222 -0.531,0.459 l -0.293,0.83 c -0.099,0.279 -0.013,0.59 0.215,0.78 z"
         style="fill:#000000;fill-opacity:1;fill-rule:nonzero;stroke:none"
         id="path496"
         inkscape:connector-curvature="0" /></g><g
       id="g498"
       transform="translate(279.2487,674.1745)"><path
         d="M 0,0 C 0.201,0.034 0.407,-0.018 0.567,-0.144 L 3.633,-2.076 C 4.034,-2.392 3.99,-3.013 3.548,-3.269 l -3.623,-2.24 c -0.208,-0.121 -0.463,-0.13 -0.679,-0.024 l -3.21,1.79 c -0.209,0.139 -0.329,0.377 -0.317,0.627 l 0.046,0.879 c 0.015,0.296 0.213,0.551 0.495,0.64 z"
         style="fill:#000000;fill-opacity:1;fill-rule:nonzero;stroke:none"
         id="path500"
         inkscape:connector-curvature="0" /></g><g
       id="g502"
       transform="translate(289.482,681.0393)"><path
         d="m 0,0 c 0.169,0.115 0.378,0.152 0.576,0.104 l 3.592,-0.481 c 0.496,-0.12 0.714,-0.704 0.418,-1.12 L 2.223,-5.041 C 2.084,-5.238 1.856,-5.352 1.615,-5.345 l -3.664,0.293 c -0.247,0.039 -0.456,0.205 -0.548,0.438 l -0.324,0.818 c -0.11,0.276 -0.036,0.59 0.184,0.788 z"
         style="fill:#000000;fill-opacity:1;fill-rule:nonzero;stroke:none"
         id="path504"
         inkscape:connector-curvature="0" /></g><g
       id="g506"
       transform="translate(305.8382,705.9169)"><path
         d="m 0,0 c -0.032,0.153 0.001,0.312 0.093,0.439 l 1.386,2.41 C 1.709,3.166 2.186,3.152 2.396,2.821 L 4.225,0.113 c 0.099,-0.156 0.114,-0.351 0.039,-0.52 L 2.991,-2.923 C 2.892,-3.087 2.713,-3.187 2.521,-3.184 l -0.675,0.007 c -0.228,0.003 -0.429,0.146 -0.506,0.36 z"
         style="fill:#000000;fill-opacity:1;fill-rule:nonzero;stroke:none"
         id="path508"
         inkscape:connector-curvature="0" /></g><g
       id="g510"
       transform="translate(301.603,713.9779)"><path
         d="M 0,0 C -0.054,0.147 -0.044,0.309 0.028,0.448 L 1.046,3.035 C 1.226,3.383 1.7,3.438 1.956,3.141 L 4.163,0.731 C 4.284,0.592 4.327,0.401 4.278,0.223 L 3.388,-2.453 C 3.313,-2.63 3.151,-2.755 2.961,-2.781 L 2.291,-2.872 C 2.066,-2.903 1.846,-2.791 1.739,-2.59 Z"
         style="fill:#000000;fill-opacity:1;fill-rule:nonzero;stroke:none"
         id="path512"
         inkscape:connector-curvature="0" /></g><g
       id="g514"
       transform="translate(302.9021,696.3417)"><path
         d="M 0,0 C 0.041,0.151 0.144,0.277 0.284,0.348 L 2.619,1.856 C 2.968,2.033 3.386,1.802 3.421,1.412 L 3.809,-1.833 C 3.825,-2.017 3.749,-2.197 3.605,-2.313 L 1.322,-3.968 C 1.159,-4.068 0.954,-4.075 0.784,-3.985 l -0.597,0.316 c -0.201,0.106 -0.314,0.326 -0.284,0.551 z"
         style="fill:#000000;fill-opacity:1;fill-rule:nonzero;stroke:none"
         id="path516"
         inkscape:connector-curvature="0" /></g><g
       id="g518"
       transform="translate(272.9802,678.6795)"><path
         d="M 0,0 C 0.203,-0.015 0.391,-0.115 0.516,-0.276 L 3.545,-3.343 C 3.859,-3.746 3.668,-4.338 3.177,-4.481 L -0.568,-5.57 c -0.231,-0.068 -0.481,-0.015 -0.665,0.139 l -2.688,2.915 c -0.17,0.184 -0.229,0.444 -0.157,0.684 l 0.254,0.843 c 0.085,0.283 0.338,0.484 0.634,0.502 z"
         style="fill:#000000;fill-opacity:1;fill-rule:nonzero;stroke:none"
         id="path520"
         inkscape:connector-curvature="0" /></g><g
       id="g522"
       transform="translate(252.9403,691.8298)"><path
         d="m 0,0 0.138,-2.421 c 0.013,-0.24 0.146,-0.458 0.353,-0.581 L 3.85,-4.986 c 0.439,-0.26 1.002,0.006 1.08,0.511 l 0.551,3.546 c 0.031,0.201 -0.024,0.407 -0.152,0.565 L 3.54,1.846"
         style="fill:#000000;fill-opacity:1;fill-rule:nonzero;stroke:none"
         id="path524"
         inkscape:connector-curvature="0" /></g><g
       id="g526"
       transform="translate(247.9296,689.251)"><path
         d="M 0,0 0.138,-2.421 C 0.151,-2.662 0.284,-2.879 0.491,-3.002 L 3.85,-4.986 c 0.439,-0.26 1.002,0.006 1.08,0.511 l 0.551,3.546 c 0.031,0.201 -0.024,0.407 -0.152,0.565 L 3.54,1.846"
         style="fill:#000000;fill-opacity:1;fill-rule:nonzero;stroke:none"
         id="path528"
         inkscape:connector-curvature="0" /></g><g
       id="g530"
       transform="translate(250.8442,689.7052)"><path
         d="M 0,0 0.138,-2.421 C 0.151,-2.662 0.284,-2.879 0.491,-3.002 L 3.85,-4.986 c 0.439,-0.26 1.002,0.006 1.08,0.51 l 0.551,3.547 c 0.031,0.201 -0.024,0.406 -0.152,0.565 L 3.54,1.846"
         style="fill:#000000;fill-opacity:1;fill-rule:nonzero;stroke:none"
         id="path532"
         inkscape:connector-curvature="0" /></g><g
       id="g534"
       transform="translate(247.3975,689.4607)"><path
         d="m 0,0 c -2.558,5.992 -3.341,12.568 -2.263,19.02 2.377,14.238 13.52,25.5 27.727,28.022 0.358,0.07 4.243,0.799 7.391,0.553 l -0.77,-9.97 C 30.651,37.736 28.235,37.393 27.288,37.209 17.164,35.412 9.282,27.446 7.6,17.372 6.838,12.808 7.39,8.159 9.197,3.927 Z"
         style="fill:#000000;fill-opacity:1;fill-rule:nonzero;stroke:none"
         id="path536"
         inkscape:connector-curvature="0" /></g><g
       id="g538"
       transform="translate(275.6414,735.0033)"><path
         d="M 0,0 3.227,2.906 C 4.85,4.367 7.085,4.944 9.213,4.45 L 20.681,1.785 c 1.509,-0.35 2.574,-1.7 2.562,-3.25 l -0.026,-3.63 c -0.011,-1.457 -0.973,-2.736 -2.37,-3.151 l -10.794,-3.202 c -2.045,-0.607 -4.257,-0.201 -5.954,1.093 L 0.84,-7.871 Z"
         style="fill:#000000;fill-opacity:1;fill-rule:nonzero;stroke:none"
         id="path540"
         inkscape:connector-curvature="0" /></g><g
       id="g542"
       transform="translate(247.1295,692.1584)"><path
         d="M 0,0 0.138,-2.421 C 0.151,-2.662 0.284,-2.879 0.491,-3.002 L 3.85,-4.986 c 0.439,-0.26 1.002,0.006 1.08,0.51 l 0.551,3.547 c 0.031,0.201 -0.024,0.407 -0.152,0.565 L 3.54,1.846"
         style="fill:#000000;fill-opacity:1;fill-rule:nonzero;stroke:none"
         id="path544"
         inkscape:connector-curvature="0" /></g><g
       id="g546"
       transform="translate(251.1278,694.1487)"><path
         d="M 0,0 0.138,-2.421 C 0.151,-2.662 0.284,-2.879 0.491,-3.002 L 3.85,-4.986 c 0.439,-0.26 1.002,0.006 1.08,0.511 l 0.551,3.546 c 0.031,0.201 -0.024,0.407 -0.152,0.565 L 3.54,1.846"
         style="fill:#000000;fill-opacity:1;fill-rule:nonzero;stroke:none"
         id="path548"
         inkscape:connector-curvature="0" /></g><g
       id="g550"
       transform="translate(293.8409,731.3235)"><path
         d="m 0,0 c -0.525,0 -0.966,0.41 -0.997,0.941 -0.033,0.552 0.388,1.025 0.939,1.057 l 9.828,0.577 3.687,1.722 c 0.5,0.233 1.096,0.018 1.329,-0.482 C 15.02,3.314 14.804,2.719 14.304,2.486 L 10.442,0.682 C 10.328,0.628 10.204,0.597 10.078,0.589 L 0.06,0.002 C 0.04,0 0.02,0 0,0"
         style="fill:#000000;fill-opacity:1;fill-rule:nonzero;stroke:none"
         id="path552"
         inkscape:connector-curvature="0" /></g><g
       id="g554"
       transform="translate(307.7207,730.1213)"><path
         d="M 0,0 C -0.141,0 -0.284,0.03 -0.42,0.093 L -4.281,1.882 C -4.782,2.114 -5,2.709 -4.768,3.21 -4.537,3.712 -3.942,3.929 -3.44,3.697 L 0.421,1.907 C 0.922,1.675 1.14,1.081 0.908,0.58 0.739,0.214 0.378,0 0,0"
         style="fill:#000000;fill-opacity:1;fill-rule:nonzero;stroke:none"
         id="path556"
         inkscape:connector-curvature="0" /></g><g
       id="g558"
       transform="translate(228.324,654.2629)"><path
         d="m 0,0 h 3.787 l 3.225,-9.893 c 0.08,-0.244 0.162,-0.496 0.244,-0.756 0.08,-0.261 0.158,-0.517 0.232,-0.77 0.072,-0.252 0.137,-0.492 0.196,-0.721 0.056,-0.227 0.101,-0.415 0.132,-0.561 0.082,0.325 0.192,0.749 0.33,1.27 0.139,0.521 0.289,1.034 0.454,1.538 L 11.75,0 h 3.736 L 9.404,-17.098 H 6.082 L 0,0"
         style="fill:#000000;fill-opacity:1;fill-rule:nonzero;stroke:none"
         id="path560"
         inkscape:connector-curvature="0" /></g><g
       id="g562"
       transform="translate(244.7869,637.1653)"><path
         d="m 0,0 v 17.098 l 3.42,2.201 V 0 Z"
         style="fill:#000000;fill-opacity:1;fill-rule:nonzero;stroke:none"
         id="path564"
         inkscape:connector-curvature="0" /></g><g
       id="g566"
       transform="translate(260.2498,648.7678)"><path
         d="m 0,0 c 0,0.748 -0.225,1.298 -0.672,1.648 -0.449,0.35 -1.055,0.526 -1.82,0.526 h -3.932 v -4.397 h 3.981 C -0.814,-2.223 0,-1.482 0,0 M 3.516,0.073 C 3.516,-0.921 3.361,-1.772 3.053,-2.479 2.742,-3.188 2.311,-3.771 1.758,-4.226 1.205,-4.682 0.549,-5.016 -0.209,-5.228 -0.965,-5.44 -1.783,-5.545 -2.662,-5.545 h -3.762 v -6.058 h -3.42 V 5.495 h 7.475 c 0.797,0 1.555,-0.109 2.271,-0.329 C 0.617,4.945 1.244,4.607 1.783,4.152 2.32,3.696 2.742,3.13 3.053,2.454 3.361,1.778 3.516,0.984 3.516,0.073"
         style="fill:#000000;fill-opacity:1;fill-rule:nonzero;stroke:none"
         id="path568"
         inkscape:connector-curvature="0" /></g><g
       id="g570"
       transform="translate(264.572,637.1653)"><path
         d="M 0,0 V 17.098 H 11.871 V 13.752 H 3.42 V 10.796 H 8.328 V 7.475 H 3.42 V 3.347 h 8.816 V 0 Z"
         style="fill:#000000;fill-opacity:1;fill-rule:nonzero;stroke:none"
         id="path572"
         inkscape:connector-curvature="0" /></g><g
       id="g574"
       transform="translate(288.3377,648.7678)"><path
         d="m 0,0 c 0,0.781 -0.215,1.339 -0.647,1.673 -0.431,0.333 -1.031,0.501 -1.795,0.501 h -4.47 v -4.397 h 4.47 C -0.815,-2.223 0,-1.482 0,0 m -0.414,-11.603 -3.055,6.156 h -3.443 v -6.156 h -3.42 V 5.495 h 7.963 c 0.799,0 1.554,-0.109 2.271,-0.329 C 0.619,4.945 1.246,4.607 1.783,4.152 2.32,3.696 2.744,3.13 3.053,2.454 3.363,1.778 3.517,0.984 3.517,0.073 3.517,-1.214 3.244,-2.269 2.699,-3.09 2.154,-3.913 1.336,-4.535 0.244,-4.959 l 3.273,-6.644 z"
         style="fill:#000000;fill-opacity:1;fill-rule:nonzero;stroke:none"
         id="path576"
         inkscape:connector-curvature="0" /></g><g
       id="g578"
       transform="translate(300.4924,646.0158)"><path
         d="m 0,0 c -0.54,0.73 -1.298,1.094 -2.275,1.091 -1.335,-0.006 -1.999,-1.1 -1.992,-3.281 0.006,-1.319 0.208,-2.271 0.611,-2.856 0.4,-0.584 0.934,-0.876 1.602,-0.874 0.522,0.002 0.937,0.102 1.245,0.299 0.308,0.196 0.584,0.458 0.828,0.785 z M 0.033,-8.817 0.03,-8.012 c -0.325,-0.278 -0.702,-0.527 -1.133,-0.749 -0.43,-0.222 -0.956,-0.334 -1.574,-0.336 -0.683,-0.003 -1.327,0.126 -1.93,0.383 -0.604,0.259 -1.135,0.668 -1.593,1.228 -0.458,0.559 -0.82,1.267 -1.082,2.121 -0.265,0.854 -0.4,1.884 -0.404,3.089 -0.003,0.961 0.104,1.839 0.32,2.638 0.217,0.799 0.536,1.489 0.957,2.069 0.421,0.579 0.94,1.028 1.558,1.349 0.618,0.32 1.326,0.481 2.123,0.484 0.57,0.002 1.088,-0.094 1.552,-0.287 0.465,-0.194 0.853,-0.429 1.163,-0.704 l -0.014,5.091 3.364,1.698 0.067,-18.867 z"
         style="fill:#b3babe;fill-opacity:1;fill-rule:nonzero;stroke:none"
         id="path580"
         inkscape:connector-curvature="0" /></g><g
       id="g582"
       transform="translate(311.927,645.1067)"><path
         d="M 0,0 C -0.033,0.293 -0.102,0.574 -0.2,0.842 -0.3,1.11 -0.443,1.354 -0.632,1.573 -0.821,1.792 -1.056,1.966 -1.335,2.096 -1.613,2.225 -1.94,2.288 -2.317,2.287 -2.94,2.285 -3.43,2.063 -3.789,1.622 -4.148,1.181 -4.358,0.634 -4.421,-0.017 Z M 3.278,-1.453 C 3.279,-1.697 3.276,-1.905 3.268,-2.076 3.261,-2.247 3.249,-2.397 3.234,-2.527 l -7.694,-0.03 c 0.033,-0.44 0.133,-0.814 0.297,-1.123 0.164,-0.309 0.368,-0.556 0.614,-0.743 0.245,-0.186 0.518,-0.324 0.819,-0.412 0.302,-0.089 0.607,-0.132 0.916,-0.131 0.473,0.002 0.896,0.085 1.27,0.25 0.373,0.163 0.683,0.384 0.925,0.662 l 2.402,-1.993 c -0.518,-0.67 -1.196,-1.185 -2.034,-1.547 -0.837,-0.36 -1.688,-0.544 -2.551,-0.547 -0.928,-0.004 -1.762,0.152 -2.502,0.467 -0.739,0.315 -1.369,0.76 -1.888,1.336 -0.52,0.576 -0.922,1.275 -1.208,2.096 -0.287,0.821 -0.432,1.736 -0.436,2.746 -0.003,0.977 0.141,1.878 0.431,2.701 0.29,0.823 0.69,1.533 1.201,2.13 0.51,0.596 1.11,1.058 1.802,1.387 0.69,0.328 1.442,0.494 2.256,0.497 C -1.299,5.222 -0.536,5.05 0.141,4.703 0.818,4.354 1.386,3.876 1.844,3.268 2.302,2.659 2.655,1.947 2.902,1.134 3.149,0.32 3.275,-0.541 3.278,-1.453"
         style="fill:#b3babe;fill-opacity:1;fill-rule:nonzero;stroke:none"
         id="path584"
         inkscape:connector-curvature="0" /></g><g
       id="g586"
       transform="translate(321.9221,637.2795)"><path
         d="m 0,0 -3.468,-0.014 -4.666,12.806 3.713,0.015 1.903,-5.929 c 0.165,-0.487 0.322,-1 0.47,-1.536 0.15,-0.538 0.265,-0.96 0.347,-1.27 0.081,0.326 0.192,0.75 0.338,1.273 0.144,0.52 0.297,1.034 0.458,1.539 l 1.858,5.943 3.614,0.014 z"
         style="fill:#b3babe;fill-opacity:1;fill-rule:nonzero;stroke:none"
         id="path588"
         inkscape:connector-curvature="0" /></g><g
       id="g590"
       transform="translate(424.2787,682.7343)"><path
         d="M 0,0 C 0.19,-0.074 0.34,-0.224 0.413,-0.415 L 2.055,-3.646 C 2.237,-4.122 1.881,-4.633 1.37,-4.625 l -4.259,-0.067 c -0.241,0.004 -0.464,0.127 -0.595,0.329 l -1.839,3.183 c -0.108,0.225 -0.089,0.492 0.05,0.7 l 0.49,0.731 c 0.165,0.246 0.465,0.364 0.753,0.295 z"
         style="fill:#ffffff;fill-opacity:1;fill-rule:nonzero;stroke:none"
         id="path592"
         inkscape:connector-curvature="0" /></g><g
       id="g594"
       transform="translate(428.3886,678.2933)"><path
         d="M 0,0 C 0.195,-0.059 0.356,-0.198 0.443,-0.383 L 2.322,-3.481 C 2.54,-3.943 2.223,-4.479 1.713,-4.51 l -4.242,-0.385 c -0.241,-0.015 -0.472,0.091 -0.618,0.283 l -2.072,3.036 c -0.125,0.217 -0.126,0.484 -0.003,0.702 l 0.434,0.766 c 0.145,0.258 0.436,0.398 0.729,0.35 z"
         style="fill:#ffffff;fill-opacity:1;fill-rule:nonzero;stroke:none"
         id="path596"
         inkscape:connector-curvature="0" /></g><g
       id="g598"
       transform="translate(419.8087,687.0308)"><path
         d="m 0,0 1.184,-4.319 c 0.087,-0.225 0.28,-0.391 0.515,-0.444 l 3.807,-0.851 c 0.498,-0.112 0.951,0.315 0.87,0.819 l -1.273,4.048 c -0.032,0.201 -0.148,0.379 -0.319,0.49 L 3.103,0.79"
         style="fill:#ffffff;fill-opacity:1;fill-rule:nonzero;stroke:none"
         id="path600"
         inkscape:connector-curvature="0" /></g><g
       id="g602"
       transform="translate(420.8939,685.0727)"><path
         d="M 0,0 C 0.169,-0.114 0.282,-0.294 0.311,-0.496 L 0.823,-4.048 C 0.896,-4.553 0.436,-4.972 -0.061,-4.853 l -3.792,0.914 c -0.234,0.057 -0.425,0.226 -0.508,0.452 l -0.886,3.864 c -0.056,0.244 0.021,0.5 0.203,0.672 l 0.639,0.605 c 0.215,0.204 0.534,0.252 0.8,0.122 z"
         style="fill:#ffffff;fill-opacity:1;fill-rule:nonzero;stroke:none"
         id="path604"
         inkscape:connector-curvature="0" /></g><g
       id="g606"
       transform="translate(421.9828,688.4336)"><path
         d="M 0,0 C 0.169,-0.114 0.282,-0.294 0.311,-0.496 L 0.823,-4.048 C 0.896,-4.553 0.436,-4.972 -0.061,-4.853 l -3.792,0.914 c -0.234,0.057 -0.425,0.226 -0.508,0.452 l -0.886,3.864 c -0.056,0.244 0.022,0.5 0.203,0.672 l 0.639,0.605 c 0.215,0.204 0.534,0.252 0.8,0.122 z"
         style="fill:#ffffff;fill-opacity:1;fill-rule:nonzero;stroke:none"
         id="path608"
         inkscape:connector-curvature="0" /></g><g
       id="g610"
       transform="translate(431.6245,686.0475)"><path
         d="M 0,0 C 0.186,-0.082 0.329,-0.24 0.393,-0.433 L 1.52,-3.841 C 1.681,-4.325 1.301,-4.819 0.792,-4.788 l -3.894,0.235 c -0.241,0.014 -0.458,0.147 -0.58,0.355 l -1.267,3.963 c -0.098,0.231 -0.067,0.496 0.082,0.697 l 0.24,0.394 c 0.176,0.239 0.482,0.342 0.766,0.26 z"
         style="fill:#ffffff;fill-opacity:1;fill-rule:nonzero;stroke:none"
         id="path612"
         inkscape:connector-curvature="0" /></g><g
       id="g614"
       transform="translate(412.8844,687.7483)"><path
         d="M 0,0 0.138,-2.421 C 0.151,-2.662 0.284,-2.879 0.491,-3.002 L 3.85,-4.986 c 0.439,-0.26 1.002,0.006 1.08,0.511 l 0.551,3.546 c 0.031,0.201 -0.024,0.407 -0.152,0.565 L 3.54,1.846"
         style="fill:#ffffff;fill-opacity:1;fill-rule:nonzero;stroke:none"
         id="path616"
         inkscape:connector-curvature="0" /></g><g
       id="g618"
       transform="translate(418.031,689.9572)"><path
         d="M 0,0 0.522,-2.368 C 0.574,-2.603 0.74,-2.797 0.964,-2.885 l 3.632,-1.423 c 0.475,-0.187 0.988,0.166 0.985,0.676 L 5.559,-0.043 C 5.558,0.161 5.47,0.355 5.319,0.491 L 3.2,2.387"
         style="fill:#ffffff;fill-opacity:1;fill-rule:nonzero;stroke:none"
         id="path620"
         inkscape:connector-curvature="0" /></g><g
       id="g622"
       transform="translate(431.7007,679.538)"><path
         d="M 0,0 C 0.202,-0.03 0.381,-0.144 0.494,-0.313 L 2.812,-3.099 C 3.095,-3.524 2.861,-4.1 2.362,-4.207 l -4.139,-1.009 c -0.235,-0.05 -0.48,0.021 -0.653,0.189 l -2.498,2.696 c -0.156,0.196 -0.197,0.46 -0.107,0.694 l 0.315,0.822 c 0.106,0.276 0.373,0.457 0.669,0.454 z"
         style="fill:#ffffff;fill-opacity:1;fill-rule:nonzero;stroke:none"
         id="path624"
         inkscape:connector-curvature="0" /></g><g
       id="g626"
       transform="translate(460.7511,689.3596)"><path
         d="M 0,0 C 0.13,0.144 0.315,0.226 0.509,0.226 L 3.938,0.59 c 0.486,0 0.819,-0.49 0.639,-0.941 L 3.191,-4.16 C 3.106,-4.373 2.921,-4.53 2.697,-4.578 l -3.453,-0.555 c -0.238,-0.019 -0.468,0.088 -0.606,0.282 l -0.484,0.684 c -0.163,0.23 -0.166,0.537 -0.007,0.769 z"
         style="fill:#ffffff;fill-opacity:1;fill-rule:nonzero;stroke:none"
         id="path628"
         inkscape:connector-curvature="0" /></g><g
       id="g630"
       transform="translate(467.7235,690.4891)"><path
         d="M 0,0 C 0.051,0.161 0.168,0.294 0.322,0.364 L 2.91,1.897 C 3.295,2.074 3.737,1.806 3.759,1.383 l 0.283,-3.525 c 0.01,-0.2 -0.08,-0.391 -0.241,-0.511 L 1.263,-4.346 C 1.082,-4.448 0.86,-4.447 0.68,-4.342 l -0.632,0.366 c -0.213,0.123 -0.326,0.366 -0.285,0.608 z"
         style="fill:#ffffff;fill-opacity:1;fill-rule:nonzero;stroke:none"
         id="path632"
         inkscape:connector-curvature="0" /></g><g
       id="g634"
       transform="translate(460.514,681.0317)"><path
         d="M 0,0 C 0.098,0.138 0.25,0.227 0.418,0.247 L 3.355,0.902 C 3.776,0.951 4.113,0.56 4.002,0.15 L 3.179,-3.289 C 3.127,-3.482 2.982,-3.636 2.793,-3.7 l -2.939,-0.824 c -0.203,-0.04 -0.414,0.029 -0.552,0.184 l -0.488,0.545 c -0.164,0.183 -0.197,0.449 -0.082,0.666 z"
         style="fill:#ffffff;fill-opacity:1;fill-rule:nonzero;stroke:none"
         id="path636"
         inkscape:connector-curvature="0" /></g><g
       id="g638"
       transform="translate(444.3018,681.8045)"><path
         d="M 0,0 C 0.182,0.019 0.364,-0.04 0.5,-0.162 L 3.139,-2.068 C 3.481,-2.374 3.406,-2.928 2.995,-3.132 L -0.38,-4.935 c -0.194,-0.097 -0.422,-0.09 -0.61,0.017 l -2.777,1.788 c -0.179,0.135 -0.274,0.356 -0.248,0.58 l 0.091,0.785 c 0.03,0.265 0.222,0.482 0.48,0.545 z"
         style="fill:#ffffff;fill-opacity:1;fill-rule:nonzero;stroke:none"
         id="path640"
         inkscape:connector-curvature="0" /></g><g
       id="g642"
       transform="translate(435.6653,676.2533)"><path
         d="m 0,0 c 0.203,0.015 0.403,-0.056 0.551,-0.196 l 2.875,-2.207 c 0.37,-0.351 0.269,-0.965 -0.195,-1.179 l -3.814,-1.897 c -0.219,-0.101 -0.473,-0.086 -0.679,0.04 l -3.031,2.078 c -0.195,0.157 -0.293,0.406 -0.257,0.653 l 0.126,0.872 c 0.043,0.293 0.263,0.529 0.553,0.591 z"
         style="fill:#ffffff;fill-opacity:1;fill-rule:nonzero;stroke:none"
         id="path644"
         inkscape:connector-curvature="0" /></g><g
       id="g646"
       transform="translate(450.2285,677.2276)"><path
         d="M 0,0 C 0.173,0.108 0.383,0.138 0.579,0.082 L 4.15,-0.536 c 0.491,-0.139 0.687,-0.73 0.376,-1.135 L 2.029,-5.123 C 1.883,-5.313 1.65,-5.419 1.41,-5.403 l -3.65,0.432 c -0.246,0.049 -0.448,0.223 -0.531,0.46 l -0.293,0.83 c -0.099,0.279 -0.013,0.59 0.215,0.78 z"
         style="fill:#ffffff;fill-opacity:1;fill-rule:nonzero;stroke:none"
         id="path648"
         inkscape:connector-curvature="0" /></g><g
       id="g650"
       transform="translate(442.3971,676.111)"><path
         d="M 0,0 C 0.201,0.034 0.407,-0.018 0.567,-0.145 L 3.633,-2.076 C 4.034,-2.392 3.99,-3.013 3.548,-3.269 l -3.623,-2.24 c -0.208,-0.121 -0.463,-0.13 -0.679,-0.024 l -3.21,1.79 c -0.209,0.139 -0.329,0.377 -0.317,0.627 l 0.046,0.879 c 0.015,0.296 0.213,0.551 0.495,0.639 z"
         style="fill:#ffffff;fill-opacity:1;fill-rule:nonzero;stroke:none"
         id="path652"
         inkscape:connector-curvature="0" /></g><g
       id="g654"
       transform="translate(452.6304,682.9758)"><path
         d="m 0,0 c 0.169,0.114 0.378,0.152 0.576,0.104 l 3.591,-0.481 c 0.497,-0.121 0.715,-0.704 0.419,-1.12 L 2.223,-5.041 C 2.084,-5.238 1.856,-5.352 1.615,-5.345 l -3.664,0.293 c -0.247,0.039 -0.456,0.205 -0.548,0.438 l -0.324,0.818 c -0.11,0.276 -0.036,0.59 0.184,0.788 z"
         style="fill:#ffffff;fill-opacity:1;fill-rule:nonzero;stroke:none"
         id="path656"
         inkscape:connector-curvature="0" /></g><g
       id="g658"
       transform="translate(468.9866,707.8535)"><path
         d="m 0,0 c -0.032,0.153 0.002,0.312 0.093,0.439 l 1.386,2.41 c 0.23,0.317 0.707,0.302 0.916,-0.028 l 1.83,-2.708 c 0.099,-0.156 0.114,-0.351 0.039,-0.52 L 2.991,-2.923 C 2.892,-3.087 2.713,-3.187 2.521,-3.185 l -0.675,0.008 c -0.228,0.002 -0.429,0.146 -0.506,0.36 z"
         style="fill:#ffffff;fill-opacity:1;fill-rule:nonzero;stroke:none"
         id="path660"
         inkscape:connector-curvature="0" /></g><g
       id="g662"
       transform="translate(464.7515,715.9144)"><path
         d="M 0,0 C -0.054,0.147 -0.044,0.309 0.028,0.448 L 1.045,3.035 C 1.226,3.382 1.7,3.438 1.956,3.141 L 4.163,0.731 C 4.284,0.592 4.327,0.401 4.278,0.223 L 3.388,-2.453 C 3.313,-2.63 3.151,-2.755 2.96,-2.781 L 2.291,-2.872 C 2.066,-2.903 1.846,-2.791 1.739,-2.59 Z"
         style="fill:#ffffff;fill-opacity:1;fill-rule:nonzero;stroke:none"
         id="path664"
         inkscape:connector-curvature="0" /></g><g
       id="g666"
       transform="translate(466.0506,698.2782)"><path
         d="M 0,0 C 0.041,0.151 0.144,0.277 0.284,0.348 L 2.619,1.856 C 2.968,2.033 3.386,1.802 3.421,1.412 L 3.809,-1.833 C 3.825,-2.017 3.749,-2.197 3.605,-2.313 L 1.322,-3.968 C 1.159,-4.068 0.954,-4.075 0.784,-3.985 l -0.597,0.316 c -0.201,0.106 -0.314,0.326 -0.284,0.551 z"
         style="fill:#ffffff;fill-opacity:1;fill-rule:nonzero;stroke:none"
         id="path668"
         inkscape:connector-curvature="0" /></g><g
       id="g670"
       transform="translate(436.1287,680.616)"><path
         d="M 0,0 C 0.203,-0.015 0.391,-0.115 0.516,-0.276 L 3.545,-3.343 C 3.859,-3.746 3.668,-4.338 3.177,-4.481 L -0.568,-5.57 c -0.231,-0.068 -0.481,-0.015 -0.665,0.139 l -2.688,2.915 c -0.17,0.184 -0.23,0.444 -0.157,0.684 l 0.254,0.843 c 0.085,0.283 0.338,0.484 0.634,0.502 z"
         style="fill:#ffffff;fill-opacity:1;fill-rule:nonzero;stroke:none"
         id="path672"
         inkscape:connector-curvature="0" /></g><g
       id="g674"
       transform="translate(416.0887,693.7663)"><path
         d="m 0,0 0.138,-2.421 c 0.013,-0.24 0.146,-0.458 0.353,-0.581 L 3.85,-4.986 c 0.439,-0.26 1.002,0.006 1.08,0.51 l 0.551,3.547 c 0.031,0.201 -0.024,0.406 -0.152,0.565 L 3.54,1.846"
         style="fill:#ffffff;fill-opacity:1;fill-rule:nonzero;stroke:none"
         id="path676"
         inkscape:connector-curvature="0" /></g><g
       id="g678"
       transform="translate(411.078,691.1875)"><path
         d="M 0,0 0.138,-2.421 C 0.151,-2.662 0.284,-2.879 0.491,-3.002 L 3.85,-4.986 c 0.439,-0.26 1.002,0.006 1.08,0.51 l 0.551,3.547 c 0.031,0.201 -0.024,0.406 -0.152,0.565 L 3.54,1.846"
         style="fill:#ffffff;fill-opacity:1;fill-rule:nonzero;stroke:none"
         id="path680"
         inkscape:connector-curvature="0" /></g><g
       id="g682"
       transform="translate(413.9926,691.6417)"><path
         d="M 0,0 0.138,-2.421 C 0.151,-2.662 0.284,-2.879 0.491,-3.002 L 3.85,-4.986 c 0.439,-0.26 1.002,0.006 1.08,0.51 l 0.551,3.547 c 0.031,0.201 -0.024,0.406 -0.152,0.565 L 3.54,1.846"
         style="fill:#ffffff;fill-opacity:1;fill-rule:nonzero;stroke:none"
         id="path684"
         inkscape:connector-curvature="0" /></g><g
       id="g686"
       transform="translate(410.5459,691.3972)"><path
         d="m 0,0 c -2.558,5.992 -3.341,12.568 -2.263,19.019 2.377,14.239 13.52,25.501 27.727,28.023 0.358,0.07 4.243,0.799 7.391,0.553 l -0.77,-9.97 C 30.651,37.736 28.235,37.393 27.288,37.209 17.164,35.412 9.282,27.446 7.6,17.372 6.838,12.808 7.39,8.159 9.197,3.927 Z"
         style="fill:#ffffff;fill-opacity:1;fill-rule:nonzero;stroke:none"
         id="path688"
         inkscape:connector-curvature="0" /></g><g
       id="g690"
       transform="translate(438.7898,736.9398)"><path
         d="M 0,0 3.227,2.906 C 4.85,4.367 7.085,4.944 9.213,4.45 L 20.681,1.785 c 1.509,-0.35 2.574,-1.701 2.562,-3.25 l -0.026,-3.63 c -0.011,-1.457 -0.973,-2.736 -2.37,-3.151 l -10.794,-3.202 c -2.045,-0.607 -4.257,-0.201 -5.954,1.093 L 0.84,-7.871 Z"
         style="fill:#ffffff;fill-opacity:1;fill-rule:nonzero;stroke:none"
         id="path692"
         inkscape:connector-curvature="0" /></g><g
       id="g694"
       transform="translate(410.2779,694.0949)"><path
         d="M 0,0 0.138,-2.421 C 0.151,-2.662 0.284,-2.879 0.491,-3.002 L 3.85,-4.986 c 0.439,-0.26 1.002,0.006 1.08,0.51 l 0.551,3.547 c 0.031,0.201 -0.024,0.406 -0.152,0.565 L 3.54,1.846"
         style="fill:#ffffff;fill-opacity:1;fill-rule:nonzero;stroke:none"
         id="path696"
         inkscape:connector-curvature="0" /></g><g
       id="g698"
       transform="translate(414.2762,696.0852)"><path
         d="M 0,0 0.138,-2.421 C 0.151,-2.662 0.284,-2.879 0.491,-3.002 L 3.85,-4.986 c 0.439,-0.26 1.002,0.006 1.08,0.51 l 0.551,3.547 c 0.031,0.201 -0.024,0.406 -0.152,0.565 L 3.54,1.846"
         style="fill:#ffffff;fill-opacity:1;fill-rule:nonzero;stroke:none"
         id="path700"
         inkscape:connector-curvature="0" /></g><g
       id="g702"
       transform="translate(456.9893,733.26)"><path
         d="m 0,0 c -0.525,0 -0.966,0.41 -0.997,0.941 -0.033,0.552 0.388,1.025 0.939,1.057 l 9.828,0.577 3.687,1.722 c 0.5,0.233 1.096,0.018 1.329,-0.482 C 15.02,3.314 14.804,2.719 14.304,2.486 L 10.442,0.682 C 10.328,0.628 10.204,0.597 10.078,0.589 L 0.06,0.002 C 0.039,0 0.02,0 0,0"
         style="fill:#ffffff;fill-opacity:1;fill-rule:nonzero;stroke:none"
         id="path704"
         inkscape:connector-curvature="0" /></g><g
       id="g706"
       transform="translate(470.8692,732.0578)"><path
         d="m 0,0 c -0.141,0 -0.284,0.03 -0.42,0.093 l -3.861,1.789 c -0.501,0.232 -0.72,0.827 -0.487,1.328 0.231,0.502 0.826,0.719 1.327,0.487 L 0.421,1.907 C 0.922,1.675 1.14,1.081 0.908,0.58 0.739,0.214 0.377,0 0,0"
         style="fill:#ffffff;fill-opacity:1;fill-rule:nonzero;stroke:none"
         id="path708"
         inkscape:connector-curvature="0" /></g><g
       id="g710"
       transform="translate(391.4724,656.1994)"><path
         d="m 0,0 h 3.787 l 3.225,-9.893 c 0.08,-0.244 0.162,-0.496 0.244,-0.756 0.08,-0.261 0.158,-0.517 0.232,-0.77 0.073,-0.252 0.137,-0.492 0.196,-0.721 0.056,-0.227 0.101,-0.415 0.132,-0.561 0.082,0.325 0.192,0.749 0.331,1.27 0.138,0.521 0.289,1.034 0.453,1.538 L 11.75,0 h 3.736 L 9.404,-17.098 H 6.082 L 0,0"
         style="fill:#ffffff;fill-opacity:1;fill-rule:nonzero;stroke:none"
         id="path712"
         inkscape:connector-curvature="0" /></g><g
       id="g714"
       transform="translate(407.9353,639.1018)"><path
         d="m 0,0 v 17.098 l 3.42,2.201 V 0 Z"
         style="fill:#ffffff;fill-opacity:1;fill-rule:nonzero;stroke:none"
         id="path716"
         inkscape:connector-curvature="0" /></g><g
       id="g718"
       transform="translate(423.3982,650.7043)"><path
         d="m 0,0 c 0,0.748 -0.225,1.298 -0.672,1.648 -0.449,0.35 -1.055,0.526 -1.82,0.526 h -3.932 v -4.397 h 3.981 C -0.815,-2.223 0,-1.482 0,0 M 3.516,0.073 C 3.516,-0.921 3.361,-1.771 3.053,-2.479 2.742,-3.188 2.31,-3.771 1.758,-4.226 1.205,-4.682 0.549,-5.016 -0.209,-5.227 -0.965,-5.44 -1.783,-5.545 -2.662,-5.545 h -3.762 v -6.057 h -3.42 V 5.495 h 7.475 c 0.797,0 1.554,-0.109 2.271,-0.329 C 0.617,4.945 1.244,4.607 1.783,4.152 2.32,3.696 2.742,3.13 3.053,2.454 3.361,1.778 3.516,0.984 3.516,0.073"
         style="fill:#ffffff;fill-opacity:1;fill-rule:nonzero;stroke:none"
         id="path720"
         inkscape:connector-curvature="0" /></g><g
       id="g722"
       transform="translate(427.7205,639.1018)"><path
         d="M 0,0 V 17.098 H 11.871 V 13.752 H 3.42 V 10.796 H 8.328 V 7.475 H 3.42 V 3.347 h 8.816 V 0 Z"
         style="fill:#ffffff;fill-opacity:1;fill-rule:nonzero;stroke:none"
         id="path724"
         inkscape:connector-curvature="0" /></g><g
       id="g726"
       transform="translate(451.4861,650.7043)"><path
         d="m 0,0 c 0,0.781 -0.215,1.339 -0.646,1.673 -0.432,0.333 -1.032,0.501 -1.795,0.501 h -4.471 v -4.397 h 4.471 C -0.814,-2.223 0,-1.482 0,0 m -0.414,-11.602 -3.055,6.155 h -3.443 v -6.155 h -3.42 V 5.495 h 7.963 c 0.799,0 1.555,-0.109 2.271,-0.329 C 0.619,4.945 1.246,4.607 1.783,4.152 2.32,3.696 2.744,3.13 3.053,2.454 3.363,1.778 3.518,0.984 3.518,0.073 3.518,-1.214 3.244,-2.269 2.699,-3.09 2.154,-3.913 1.336,-4.535 0.244,-4.959 l 3.274,-6.643 z"
         style="fill:#ffffff;fill-opacity:1;fill-rule:nonzero;stroke:none"
         id="path728"
         inkscape:connector-curvature="0" /></g><g
       id="g730"
       transform="translate(463.6408,647.9523)"><path
         d="m 0,0 c -0.54,0.731 -1.298,1.094 -2.275,1.091 -1.335,-0.006 -1.999,-1.1 -1.992,-3.281 0.006,-1.319 0.208,-2.271 0.611,-2.856 0.4,-0.584 0.934,-0.876 1.602,-0.874 0.522,0.002 0.937,0.102 1.245,0.299 0.308,0.196 0.584,0.458 0.828,0.785 z M 0.033,-8.817 0.03,-8.012 c -0.325,-0.278 -0.702,-0.527 -1.132,-0.749 -0.431,-0.222 -0.957,-0.334 -1.575,-0.336 -0.683,-0.003 -1.327,0.126 -1.93,0.383 -0.604,0.259 -1.135,0.668 -1.593,1.228 -0.458,0.559 -0.82,1.267 -1.082,2.121 -0.265,0.854 -0.4,1.884 -0.403,3.089 -0.004,0.961 0.103,1.84 0.319,2.638 0.217,0.799 0.536,1.489 0.957,2.069 0.421,0.579 0.94,1.028 1.559,1.349 0.617,0.32 1.325,0.481 2.123,0.484 0.569,0.002 1.087,-0.094 1.551,-0.287 0.465,-0.194 0.853,-0.429 1.163,-0.703 l -0.014,5.09 3.364,1.698 0.067,-18.867 z"
         style="fill:#b3babe;fill-opacity:1;fill-rule:nonzero;stroke:none"
         id="path732"
         inkscape:connector-curvature="0" /></g><g
       id="g734"
       transform="translate(475.0754,647.0432)"><path
         d="M 0,0 C -0.033,0.293 -0.102,0.574 -0.2,0.842 -0.3,1.11 -0.443,1.354 -0.632,1.573 -0.821,1.792 -1.056,1.966 -1.335,2.096 -1.613,2.225 -1.94,2.288 -2.317,2.287 -2.939,2.285 -3.43,2.063 -3.789,1.622 -4.147,1.181 -4.358,0.634 -4.421,-0.017 Z M 3.278,-1.453 C 3.279,-1.697 3.276,-1.905 3.269,-2.076 3.261,-2.247 3.249,-2.398 3.234,-2.527 l -7.694,-0.03 c 0.033,-0.44 0.133,-0.814 0.297,-1.123 0.164,-0.309 0.368,-0.556 0.614,-0.743 0.245,-0.186 0.518,-0.324 0.819,-0.412 0.302,-0.089 0.607,-0.132 0.917,-0.131 0.472,0.002 0.895,0.085 1.269,0.25 0.373,0.163 0.683,0.384 0.925,0.662 l 2.402,-1.993 c -0.518,-0.67 -1.196,-1.185 -2.034,-1.547 -0.837,-0.36 -1.687,-0.544 -2.551,-0.547 -0.927,-0.004 -1.761,0.152 -2.502,0.467 -0.739,0.315 -1.369,0.76 -1.888,1.336 -0.52,0.576 -0.922,1.274 -1.208,2.096 -0.286,0.821 -0.432,1.736 -0.436,2.746 -0.003,0.977 0.141,1.878 0.431,2.701 0.29,0.823 0.69,1.533 1.201,2.13 0.51,0.596 1.11,1.058 1.802,1.387 0.69,0.328 1.442,0.494 2.257,0.497 C -1.299,5.222 -0.536,5.05 0.141,4.703 0.818,4.354 1.386,3.876 1.844,3.268 2.302,2.659 2.655,1.947 2.902,1.134 3.149,0.32 3.275,-0.541 3.278,-1.453"
         style="fill:#b3babe;fill-opacity:1;fill-rule:nonzero;stroke:none"
         id="path736"
         inkscape:connector-curvature="0" /></g><g
       id="g738"
       transform="translate(485.0705,639.216)"><path
         d="m 0,0 -3.468,-0.014 -4.666,12.806 3.713,0.015 1.904,-5.929 c 0.164,-0.487 0.321,-1 0.469,-1.536 0.15,-0.538 0.265,-0.96 0.347,-1.27 0.081,0.326 0.192,0.75 0.338,1.273 0.144,0.52 0.297,1.034 0.458,1.539 l 1.858,5.943 3.614,0.014 z"
         style="fill:#b3babe;fill-opacity:1;fill-rule:nonzero;stroke:none"
         id="path740"
         inkscape:connector-curvature="0" /></g><path
       d="M 110.686,485.39 H 72.045 v 35.111 h 38.641 z"
       style="fill:#14499e;fill-opacity:1;fill-rule:nonzero;stroke:none"
       id="path742"
       inkscape:connector-curvature="0" /><path
       d="M 104.781,573.545 H 66.14 v 35.111 h 38.641 z"
       style="fill:#14499e;fill-opacity:1;fill-rule:nonzero;stroke:none"
       id="path744"
       inkscape:connector-curvature="0" /><path
       d="M 110.686,431.89 H 72.045 v 35.111 h 38.641 z"
       style="fill:#201b54;fill-opacity:1;fill-rule:nonzero;stroke:none"
       id="path746"
       inkscape:connector-curvature="0" /><path
       d="m 150.685,573.545 h -48.642 v 35.111 h 48.642 z"
       style="fill:#201b54;fill-opacity:1;fill-rule:nonzero;stroke:none"
       id="path748"
       inkscape:connector-curvature="0" /><path
       d="m 172.899,573.545 h -22.065 v 35.111 h 22.065 z"
       style="fill:#57a0d7;fill-opacity:1;fill-rule:nonzero;stroke:none"
       id="path750"
       inkscape:connector-curvature="0" /><path
       d="m 109.815,384.545 h -36.9 v 35.111 h 36.9 z"
       style="fill:#519ed6;fill-opacity:1;fill-rule:nonzero;stroke:none"
       id="path752"
       inkscape:connector-curvature="0" /><text
       transform="matrix(1,0,0,-1,116.5313,488.8896)"
       style="font-variant:normal;font-weight:normal;font-stretch:normal;font-size:12px;font-family:'Myriad Pro';-inkscape-font-specification:MyriadPro-Regular;writing-mode:lr-tb;fill:#231f20;fill-opacity:1;fill-rule:nonzero;stroke:none"
       id="text760"><tspan
         x="0 6.96 16.608 23.016001 29.52 32.063999 38.220001 44.375999 50.532001 54.647999 60.804001 66.959999 71.075996 77.232002 81.348"
         y="0"
         sodipodi:role="line"
         id="tspan754">CMYK 100/83/0/0</tspan><tspan
         x="0 6.96 16.608 23.016001 29.52 32.063999 38.220001 44.375999 50.532001 54.647999 60.804001 66.959999 73.115997 77.232002 83.388 89.543999 93.660004 99.816002"
         y="57"
         sodipodi:role="line"
         id="tspan756">CMYK 100/100/30/35</tspan><tspan
         x="0 6.96 16.608 23.016001 29.52 32.063999 38.220001 44.375999 48.492001 54.647999 60.804001 64.919998 71.075996 75.192001"
         y="104.34"
         sodipodi:role="line"
         id="tspan758">CMYK 60/65/0/0</tspan></text>
</g></svg>