INFO:sim:172 - Generating IP...
Applying current project options...
Finished applying current project options.
WARNING:sim - A core named 'vid_ram' already exists in the project. Output
   products for this core may be overwritten.
Resolving generics for 'vid_ram'...
WARNING:sim - A core named 'vid_ram' already exists in the project. Output
   products for this core may be overwritten.
Applying external generics to 'vid_ram'...
Delivering associated files for 'vid_ram'...
Delivering EJava files for 'vid_ram'...
Generating implementation netlist for 'vid_ram'...
INFO:sim - Pre-processing HDL files for 'vid_ram'...
Running synthesis for 'vid_ram'
Running ngcbuild...
Writing VEO instantiation template for 'vid_ram'...
Writing Verilog behavioral simulation model for 'vid_ram'...
WARNING:sim - Overwriting existing file D:/Documentacao/Eletronica/FPGA/ZX
   Spectrum Next Cores/Sources/Arcades/Galaxian
   HDMI/synth/ipcore_dir/tmp/_cg/vid_ram/doc/blk_mem_gen_v7_3_vinfo.html with
   file from view xilinx_documentation
Delivered 1 file into directory D:/Documentacao/Eletronica/FPGA/ZX Spectrum Next
Cores/Sources/Arcades/Galaxian HDMI/synth/ipcore_dir/tmp/_cg/vid_ram
Generating ASY schematic symbol...
INFO:sim:949 - Finished generation of ASY schematic symbol.
Generating SYM schematic symbol for 'vid_ram'...
Generating metadata file...
Regenerating ISE project file for 'vid_ram'...
Generating ISE project...
XCO file found: vid_ram.xco
XMDF file found: vid_ram_xmdf.tcl
Adding D:/Documentacao/Eletronica/FPGA/ZX Spectrum Next
Cores/Sources/Arcades/Galaxian HDMI/synth/ipcore_dir/tmp/_cg/vid_ram.asy -view
all -origin_type imported
Adding D:/Documentacao/Eletronica/FPGA/ZX Spectrum Next
Cores/Sources/Arcades/Galaxian HDMI/synth/ipcore_dir/tmp/_cg/vid_ram.ngc -view
all -origin_type created
Checking file "D:/Documentacao/Eletronica/FPGA/ZX Spectrum Next
Cores/Sources/Arcades/Galaxian HDMI/synth/ipcore_dir/tmp/_cg/vid_ram.ngc" for
project device match ...
File "D:/Documentacao/Eletronica/FPGA/ZX Spectrum Next
Cores/Sources/Arcades/Galaxian HDMI/synth/ipcore_dir/tmp/_cg/vid_ram.ngc" device
information matches project device.
Adding D:/Documentacao/Eletronica/FPGA/ZX Spectrum Next
Cores/Sources/Arcades/Galaxian HDMI/synth/ipcore_dir/tmp/_cg/vid_ram.sym -view
all -origin_type imported
Adding D:/Documentacao/Eletronica/FPGA/ZX Spectrum Next
Cores/Sources/Arcades/Galaxian HDMI/synth/ipcore_dir/tmp/_cg/vid_ram.v -view all
-origin_type created
INFO:HDLCompiler:1845 - Analyzing Verilog file
   "D:/Documentacao/Eletronica/FPGA/ZX Spectrum Next
   Cores/Sources/Arcades/Galaxian HDMI/synth/ipcore_dir/tmp/_cg/vid_ram.v" into
   library work
INFO:ProjectMgmt - Parsing design hierarchy completed successfully.
Adding D:/Documentacao/Eletronica/FPGA/ZX Spectrum Next
Cores/Sources/Arcades/Galaxian HDMI/synth/ipcore_dir/tmp/_cg/vid_ram.veo -view
all -origin_type imported
INFO:TclTasksC:2116 - The automatic calculation of top has been turned-off.
   Please set the new top explicitly by running the "project set top" command.
   To re-calculate the new top automatically, set the "Auto Implementation Top"
   property to true.
Top level has been set to "/vid_ram"
Generating README file...
Generating FLIST file...
INFO:sim:948 - Finished FLIST file generation.
Launching README viewer...
Moving files to output directory...
Finished moving files to output directory
Wrote CGP file for project 'vid_ram'.
