ASxxxx Assembler V02.00 + NoICE + SDCC mods  (Zilog Z80 / Hitachi HD64180), page 1.
Hexadecimal [16-Bits]

Symbol Table

    .__.$$$.                                                    =  2710 L
    .__.ABS.                                                    =  0000 G
    .__.CPU.                                                    =  0000 L
    .__.H$L.                                                    =  0000 L
    _HROW0                                                      =  FEFE 
    _HROW1                                                      =  FDFE 
    _HROW2                                                      =  FBFE 
    _HROW3                                                      =  F7FE 
    _HROW4                                                      =  EFFE 
    _HROW5                                                      =  DFFE 
    _HROW6                                                      =  BFFE 
    _HROW7                                                      =  7FFE 
    _JOYPORT                                                    =  263B 
    _REG_NUM                                                    =  243B 
    _REG_VAL                                                    =  253B 
    _SD_CONTROL                                                 =  00E7 
    _SD_DATA                                                    =  00EB 
    _SD_STATUS                                                  =  00E7 
    _ULAPORT                                                    =  00FE 
    ___sdcc_enter_ix                                               **** GX
  1 __bright                                                       0003 GR
  1 __flash                                                        0002 GR
  1 _bg                                                            0005 GR
  1 _caddr                                                         000A GR
  1 _cx                                                            0000 GR
  1 _cy                                                            0001 GR
  1 _faddr                                                         0006 GR
  1 _fg                                                            0004 GR
  0 _font                                                          003D GR
  1 _vaddr                                                         0008 GR
  0 _vdp_cls                                                       03B4 GR
  0 _vdp_gotox                                                     0417 GR
  0 _vdp_gotoxy                                                    03F6 GR
  0 _vdp_init                                                      0000 GR
  0 _vdp_prints                                                    058F GR
  0 _vdp_putchar                                                   0422 GR
  0 _vdp_setbg                                                     03A9 GR
  0 _vdp_setborder                                                 036E GR
  0 _vdp_setcolor                                                  033D GR
  0 _vdp_setfg                                                     038B GR
  0 _vdp_setflash                                                  0378 GR
  1 _vpdc                                                          000C GR
  1 _vpdf                                                          000D GR
  1 _vpdv                                                          000E GR


ASxxxx Assembler V02.00 + NoICE + SDCC mods  (Zilog Z80 / Hitachi HD64180), page 2.
Hexadecimal [16-Bits]

Area Table

   0 _CODE                                      size  5A2   flags    0
   1 _DATA                                      size    F   flags    0
   2 _INITIALIZED                               size    0   flags    0
   3 _DABS                                      size    0   flags    8
   4 _HOME                                      size    0   flags    0
   5 _GSINIT                                    size    0   flags    0
   6 _GSFINAL                                   size    0   flags    0
   7 _INITIALIZER                               size    0   flags    0
   8 _CABS                                      size    0   flags    8

