ASxxxx Assembler V02.00 + NoICE + SDCC mods  (Zilog Z80 / Hitachi HD64180), page 1.
Hexadecimal [16-Bits]

Symbol Table

    .__.$$$.                                                    =  2710 L
    .__.ABS.                                                    =  0000 G
    .__.CPU.                                                    =  0000 L
    .__.H$L.                                                    =  0000 L
    _ChangeDirectory                                               **** GX
    _FileOpen                                                      **** GX
    _FileRead                                                      **** GX
    _FindDrive                                                     **** GX
    _HROW0                                                      =  FEFE 
    _HROW1                                                      =  FDFE 
    _HROW2                                                      =  FBFE 
    _HROW3                                                      =  F7FE 
    _HROW4                                                      =  EFFE 
    _HROW5                                                      =  DFFE 
    _HROW6                                                      =  BFFE 
    _HROW7                                                      =  7FFE 
    _JOYPORT                                                    =  263B 
    _MMC_Init                                                      **** GX
    _NextDirEntry                                                  **** GX
    _REG_NUM                                                    =  243B 
    _REG_VAL                                                    =  253B 
    _SD_CONTROL                                                 =  00E7 
    _SD_DATA                                                    =  00EB 
    _SD_STATUS                                                  =  00E7 
    _ULAPORT                                                    =  00FE 
    ___sdcc_enter_ix                                               **** GX
  0 ___str_0                                                       0047 R
  0 ___str_1                                                       0061 R
  0 ___str_10                                                      096C R
  0 ___str_11                                                      098C R
  0 ___str_2                                                       0481 R
  0 ___str_3                                                       04EE R
  0 ___str_4                                                       050F R
  0 ___str_5                                                       0530 R
  0 ___str_6                                                       0551 R
  0 ___str_7                                                       0915 R
  0 ___str_8                                                       0931 R
  0 ___str_9                                                       094B R
  0 _copyname                                                      017F R
  1 _cursor                                                        0000 R
    _dir_entries                                                   **** GX
  0 _display_error                                                 0000 R
  0 _draw_cursor                                                   0031 R
  0 _draw_menu                                                     0483 GR
  1 _extension                                                     0220 R
  0 _hide_cursor                                                   004B R
  1 _keys                                                          0001 R
  0 _listroms                                                      029D R
    _longfilename                                                  **** GX
  0 _main                                                          0553 GR
  0 _nthfile                                                       01BB R
  0 _readkeyb                                                      0065 R
  1 _romfilenames                                                  0004 R
  1 _romindex                                                      0002 R
  0 _selectdir                                                     025A R
ASxxxx Assembler V02.00 + NoICE + SDCC mods  (Zilog Z80 / Hitachi HD64180), page 2.
Hexadecimal [16-Bits]

Symbol Table

  0 _selectrom                                                     0211 R
    _vdp_cls                                                       **** GX
    _vdp_gotoxy                                                    **** GX
    _vdp_init                                                      **** GX
    _vdp_prints                                                    **** GX
    _vdp_setbg                                                     **** GX
    _vdp_setcolor                                                  **** GX


ASxxxx Assembler V02.00 + NoICE + SDCC mods  (Zilog Z80 / Hitachi HD64180), page 3.
Hexadecimal [16-Bits]

Area Table

   0 _CODE                                      size  9AD   flags    0
   1 _DATA                                      size  22A   flags    0
   2 _INITIALIZED                               size    0   flags    0
   3 _DABS                                      size    0   flags    8
   4 _HOME                                      size    0   flags    0
   5 _GSINIT                                    size    0   flags    0
   6 _GSFINAL                                   size    0   flags    0
   7 _INITIALIZER                               size    0   flags    0
   8 _CABS                                      size    0   flags    8

