blk_mem_gen_v7_3 "./blk_mem_gen_v7_3/blk_mem_gen_v7_3_xst_comp.vhd"
blk_mem_gen_v7_3 "./blk_mem_gen_v7_3/blk_mem_gen_v7_3_defaults.vhd"
blk_mem_gen_v7_3 "./blk_mem_gen_v7_3/blk_mem_gen_v7_3_pkg.vhd"
blk_mem_gen_v7_3 "./blk_mem_gen_v7_3/blk_mem_gen_getinit_pkg.vhd"
blk_mem_gen_v7_3 "./blk_mem_gen_v7_3/blk_mem_min_area_pkg.vhd"
blk_mem_gen_v7_3 "./blk_mem_gen_v7_3/blk_mem_gen_bindec.vhd"
blk_mem_gen_v7_3 "./blk_mem_gen_v7_3/blk_mem_gen_mux.vhd"
blk_mem_gen_v7_3 "./blk_mem_gen_v7_3/blk_mem_gen_prim_wrapper_s6.vhd"
blk_mem_gen_v7_3 "./blk_mem_gen_v7_3/blk_mem_gen_prim_wrapper_s6_init.vhd"
blk_mem_gen_v7_3 "./blk_mem_gen_v7_3/blk_mem_gen_prim_wrapper_s3adsp.vhd"
blk_mem_gen_v7_3 "./blk_mem_gen_v7_3/blk_mem_gen_prim_wrapper_s3adsp_init.vhd"
blk_mem_gen_v7_3 "./blk_mem_gen_v7_3/blk_mem_gen_prim_wrapper_s3a.vhd"
blk_mem_gen_v7_3 "./blk_mem_gen_v7_3/blk_mem_gen_prim_wrapper_s3a_init.vhd"
blk_mem_gen_v7_3 "./blk_mem_gen_v7_3/blk_mem_gen_prim_wrapper_v6.vhd"
blk_mem_gen_v7_3 "./blk_mem_gen_v7_3/blk_mem_gen_prim_wrapper_v6_init.vhd"
blk_mem_gen_v7_3 "./blk_mem_gen_v7_3/blk_mem_gen_prim_wrapper_v5.vhd"
blk_mem_gen_v7_3 "./blk_mem_gen_v7_3/blk_mem_gen_prim_wrapper_v5_init.vhd"
blk_mem_gen_v7_3 "./blk_mem_gen_v7_3/blk_mem_gen_prim_wrapper_v4.vhd"
blk_mem_gen_v7_3 "./blk_mem_gen_v7_3/blk_mem_gen_prim_wrapper_v4_init.vhd"
blk_mem_gen_v7_3 "./blk_mem_gen_v7_3/blk_mem_gen_prim_wrapper_s3.vhd"
blk_mem_gen_v7_3 "./blk_mem_gen_v7_3/blk_mem_gen_prim_wrapper_s3_init.vhd"
blk_mem_gen_v7_3 "./blk_mem_gen_v7_3/blk_mem_gen_prim_width.vhd"
blk_mem_gen_v7_3 "./blk_mem_gen_v7_3/blk_mem_gen_generic_cstr.vhd"
blk_mem_gen_v7_3 "./blk_mem_gen_v7_3/blk_mem_gen_ecc_encoder.vhd"
blk_mem_gen_v7_3 "./blk_mem_gen_v7_3/blk_mem_gen_ecc_decoder.vhd"
blk_mem_gen_v7_3 "./blk_mem_gen_v7_3/blk_mem_input_block.vhd"
blk_mem_gen_v7_3 "./blk_mem_gen_v7_3/blk_mem_output_block.vhd"
blk_mem_gen_v7_3 "./blk_mem_gen_v7_3/blk_mem_axi_read_fsm.vhd"
blk_mem_gen_v7_3 "./blk_mem_gen_v7_3/blk_mem_axi_read_wrapper.vhd"
blk_mem_gen_v7_3 "./blk_mem_gen_v7_3/blk_mem_axi_write_fsm.vhd"
blk_mem_gen_v7_3 "./blk_mem_gen_v7_3/blk_mem_axi_write_wrapper.vhd"
blk_mem_gen_v7_3 "./blk_mem_gen_v7_3/blk_mem_axi_regs_fwd.vhd"
blk_mem_gen_v7_3 "./blk_mem_gen_v7_3/blk_mem_gen_top.vhd"
blk_mem_gen_v7_3 "./blk_mem_gen_v7_3/blk_mem_gen_v7_3_xst.vhd"
blk_mem_gen_v7_3 "./blk_mem_gen_v7_3/blk_mem_gen_v7_3.vhd"
work "rom0.vhd"
nosort
