{
    "rf": {
        "mse": 7647141.008991724,
        "rmse": 1334.5287325367644,
        "mae": 98.97620595773544,
        "r_squared": 0.9999656141681454,
        "mape": 0.029336954301294665
    },
    "lr": {
        "mse": 5309986680.671564,
        "rmse": 72684.77164719328,
        "mae": 49128.35764009913,
        "r_squared": 0.9788057832287913,
        "mape": 105.77108834295802
    },
    "svr": {
        "mse": 11119435358.983173,
        "rmse": 103695.71613063605,
        "mae": 63262.130826607274,
        "r_squared": 0.9556202385853947,
        "mape": 75.51438786344812
    },
    "knn": {
        "mse": 35651643.67786059,
        "rmse": 5318.468249698003,
        "mae": 607.2187654083725,
        "r_squared": 0.9998542090680745,
        "mape": 0.6964405819267734
    }
}