\relax 
\providecommand\hyper@newdestlabel[2]{}
\catcode `:\active 
\catcode `;\active 
\catcode `!\active 
\catcode `?\active 
\providecommand\HyperFirstAtBeginDocument{\AtBeginDocument}
\HyperFirstAtBeginDocument{\ifx\hyper@anchor\@undefined
\global\let\oldcontentsline\contentsline
\gdef\contentsline#1#2#3#4{\oldcontentsline{#1}{#2}{#3}}
\global\let\oldnewlabel\newlabel
\gdef\newlabel#1#2{\newlabelxx{#1}#2}
\gdef\newlabelxx#1#2#3#4#5#6{\oldnewlabel{#1}{{#2}{#3}}}
\AtEndDocument{\ifx\hyper@anchor\@undefined
\let\contentsline\oldcontentsline
\let\newlabel\oldnewlabel
\fi}
\fi}
\global\let\hyper@last\relax 
\gdef\HyperFirstAtBeginDocument#1{#1}
\providecommand\HyField@AuxAddToFields[1]{}
\providecommand\HyField@AuxAddToCoFields[2]{}
\providecommand \oddpage@label [2]{}
\babel@aux{french}{}
\@writefile{toc}{\contentsline {chapter}{\numberline {1}Index des classes}{1}{chapter.1}\protected@file@percent }
\@writefile{lof}{\addvspace {10\p@ }}
\@writefile{lot}{\addvspace {10\p@ }}
\@writefile{toc}{\contentsline {section}{\numberline {1.1}Liste des classes}{1}{section.1.1}\protected@file@percent }
\@writefile{toc}{\contentsline {chapter}{\numberline {2}Index des fichiers}{3}{chapter.2}\protected@file@percent }
\@writefile{lof}{\addvspace {10\p@ }}
\@writefile{lot}{\addvspace {10\p@ }}
\@writefile{toc}{\contentsline {section}{\numberline {2.1}Liste des fichiers}{3}{section.2.1}\protected@file@percent }
\@writefile{toc}{\contentsline {chapter}{\numberline {3}Documentation des classes}{5}{chapter.3}\protected@file@percent }
\@writefile{lof}{\addvspace {10\p@ }}
\@writefile{lot}{\addvspace {10\p@ }}
\@writefile{toc}{\contentsline {section}{\numberline {3.1}R\IeC {\'e}f\IeC {\'e}rence de la classe Affichage}{5}{section.3.1}\protected@file@percent }
\newlabel{class_affichage}{{3.1}{5}{Référence de la classe Affichage}{section.3.1}{}}
\gdef \LT@i {\LT@entry 
    {3}{40.32141pt}\LT@entry 
    {3}{358.81166pt}}
\gdef \LT@ii {\LT@entry 
    {3}{49.32135pt}\LT@entry 
    {3}{108.45491pt}}
\@writefile{toc}{\contentsline {subsection}{\numberline {3.1.1}Description d\IeC {\'e}taill\IeC {\'e}e}{6}{subsection.3.1.1}\protected@file@percent }
\@writefile{toc}{\contentsline {subsection}{\numberline {3.1.2}Documentation des constructeurs et destructeur}{6}{subsection.3.1.2}\protected@file@percent }
\newlabel{class_affichage_ae3d05a64af7e21df009c4483e7209c9a}{{3.1.2}{6}{Documentation des constructeurs et destructeur}{subsection.3.1.2}{}}
\@writefile{toc}{\contentsline {subsubsection}{\numberline {3.1.2.1}Affichage()\hspace  {0.1cm}{\relax \fontsize  {8}{9.5}\selectfont  \abovedisplayskip 6\p@ plus2\p@ minus4\p@ \abovedisplayshortskip \z@ plus\p@ \belowdisplayshortskip 3\p@ plus\p@ minus2\p@ \def \leftmargin \leftmargini \parsep 4\p@ plus2\p@ minus\p@ \topsep 8\p@ plus2\p@ minus4\p@ \itemsep 4\p@ plus2\p@ minus\p@ {\leftmargin \leftmargini \topsep 3\p@ plus\p@ minus\p@ \parsep 2\p@ plus\p@ minus\p@ \itemsep \parsep }\belowdisplayskip \abovedisplayskip \ttfamilyFB  [1/2]}}{6}{subsubsection.3.1.2.1}\protected@file@percent }
\newlabel{class_affichage_a166451c3b02c93f0d263152647f33b29}{{3.1.2.1}{6}{\texorpdfstring {Affichage()}{Affichage()}\hspace {0.1cm}{\footnotesize \ttfamily [1/2]}}{table.3.1}{}}
\@writefile{toc}{\contentsline {subsubsection}{\numberline {3.1.2.2}Affichage()\hspace  {0.1cm}{\relax \fontsize  {8}{9.5}\selectfont  \abovedisplayskip 6\p@ plus2\p@ minus4\p@ \abovedisplayshortskip \z@ plus\p@ \belowdisplayshortskip 3\p@ plus\p@ minus2\p@ \def \leftmargin \leftmargini \parsep 4\p@ plus2\p@ minus\p@ \topsep 8\p@ plus2\p@ minus4\p@ \itemsep 4\p@ plus2\p@ minus\p@ {\leftmargin \leftmargini \topsep 3\p@ plus\p@ minus\p@ \parsep 2\p@ plus\p@ minus\p@ \itemsep \parsep }\belowdisplayskip \abovedisplayskip \ttfamilyFB  [2/2]}}{6}{subsubsection.3.1.2.2}\protected@file@percent }
\newlabel{class_affichage_ae6a4f4db7a0d8d2abc8bd44c1be674c0}{{3.1.2.2}{6}{\texorpdfstring {Affichage()}{Affichage()}\hspace {0.1cm}{\footnotesize \ttfamily [2/2]}}{table.3.2}{}}
\@writefile{toc}{\contentsline {subsubsection}{\numberline {3.1.2.3}$\sim $\discretionary {\unhbox \voidb@x \hbox {\relax \fontsize  {7}{8}\selectfont  $\leftarrow \joinrel  \rhook $}}{}{}Affichage()}{6}{subsubsection.3.1.2.3}\protected@file@percent }
\@writefile{toc}{\contentsline {subsection}{\numberline {3.1.3}Documentation des fonctions membres}{6}{subsection.3.1.3}\protected@file@percent }
\newlabel{class_affichage_a6bf6b2eb6135fdff8ce5877d5b05b3c7}{{3.1.3}{6}{Documentation des fonctions membres}{subsection.3.1.3}{}}
\gdef \LT@iii {\LT@entry 
    {3}{49.32135pt}\LT@entry 
    {3}{90.57237pt}}
\gdef \LT@iv {\LT@entry 
    {3}{58.82523pt}\LT@entry 
    {3}{185.34026pt}}
\gdef \LT@v {\LT@entry 
    {3}{49.32135pt}\LT@entry 
    {3}{90.57237pt}}
\@writefile{toc}{\contentsline {subsubsection}{\numberline {3.1.3.1}do\discretionary {\unhbox \voidb@x \hbox {\relax \fontsize  {7}{8}\selectfont  $\leftarrow \joinrel  \rhook $}}{}{}\_\discretionary {\unhbox \voidb@x \hbox {\relax \fontsize  {7}{8}\selectfont  $\leftarrow \joinrel  \rhook $}}{}{}destroy\discretionary {\unhbox \voidb@x \hbox {\relax \fontsize  {7}{8}\selectfont  $\leftarrow \joinrel  \rhook $}}{}{}\_\discretionary {\unhbox \voidb@x \hbox {\relax \fontsize  {7}{8}\selectfont  $\leftarrow \joinrel  \rhook $}}{}{}window()}{7}{subsubsection.3.1.3.1}\protected@file@percent }
\newlabel{class_affichage_a84112dffae3520e0f39386c163031f06}{{3.1.3.1}{7}{\texorpdfstring {do\+\_\+destroy\+\_\+window()}{do\_destroy\_window()}}{table.3.3}{}}
\@writefile{toc}{\contentsline {subsubsection}{\numberline {3.1.3.2}do\discretionary {\unhbox \voidb@x \hbox {\relax \fontsize  {7}{8}\selectfont  $\leftarrow \joinrel  \rhook $}}{}{}\_\discretionary {\unhbox \voidb@x \hbox {\relax \fontsize  {7}{8}\selectfont  $\leftarrow \joinrel  \rhook $}}{}{}drawing\discretionary {\unhbox \voidb@x \hbox {\relax \fontsize  {7}{8}\selectfont  $\leftarrow \joinrel  \rhook $}}{}{}\_\discretionary {\unhbox \voidb@x \hbox {\relax \fontsize  {7}{8}\selectfont  $\leftarrow \joinrel  \rhook $}}{}{}svg()}{7}{subsubsection.3.1.3.2}\protected@file@percent }
\newlabel{class_affichage_aa8ea1056adc69d6651669513626c06d7}{{3.1.3.2}{7}{\texorpdfstring {do\+\_\+drawing\+\_\+svg()}{do\_drawing\_svg()}}{table.3.4}{}}
\@writefile{toc}{\contentsline {subsubsection}{\numberline {3.1.3.3}do\discretionary {\unhbox \voidb@x \hbox {\relax \fontsize  {7}{8}\selectfont  $\leftarrow \joinrel  \rhook $}}{}{}\_\discretionary {\unhbox \voidb@x \hbox {\relax \fontsize  {7}{8}\selectfont  $\leftarrow \joinrel  \rhook $}}{}{}resize\discretionary {\unhbox \voidb@x \hbox {\relax \fontsize  {7}{8}\selectfont  $\leftarrow \joinrel  \rhook $}}{}{}\_\discretionary {\unhbox \voidb@x \hbox {\relax \fontsize  {7}{8}\selectfont  $\leftarrow \joinrel  \rhook $}}{}{}svg()}{7}{subsubsection.3.1.3.3}\protected@file@percent }
\newlabel{class_affichage_a1fcf8746071f6e4dd471a6c0e308acd2}{{3.1.3.3}{7}{\texorpdfstring {do\+\_\+resize\+\_\+svg()}{do\_resize\_svg()}}{table.3.5}{}}
\@writefile{toc}{\contentsline {subsubsection}{\numberline {3.1.3.4}Draw\discretionary {\unhbox \voidb@x \hbox {\relax \fontsize  {7}{8}\selectfont  $\leftarrow \joinrel  \rhook $}}{}{}Svg()}{7}{subsubsection.3.1.3.4}\protected@file@percent }
\newlabel{class_affichage_ad58baa5d348f161915bbc94be59e6011}{{3.1.3.4}{7}{\texorpdfstring {Draw\+Svg()}{DrawSvg()}}{subsubsection.3.1.3.4}{}}
\gdef \LT@vi {\LT@entry 
    {3}{30.3047pt}\LT@entry 
    {3}{113.71992pt}}
\gdef \LT@vii {\LT@entry 
    {3}{52.82222pt}\LT@entry 
    {3}{215.62718pt}}
\@writefile{toc}{\contentsline {subsubsection}{\numberline {3.1.3.5}Init\discretionary {\unhbox \voidb@x \hbox {\relax \fontsize  {7}{8}\selectfont  $\leftarrow \joinrel  \rhook $}}{}{}Window()}{8}{subsubsection.3.1.3.5}\protected@file@percent }
\newlabel{class_affichage_a714168dff2a0f24bd2428576e77c48e0}{{3.1.3.5}{8}{\texorpdfstring {Init\+Window()}{InitWindow()}}{table.3.6}{}}
\@writefile{toc}{\contentsline {subsubsection}{\numberline {3.1.3.6}on\discretionary {\unhbox \voidb@x \hbox {\relax \fontsize  {7}{8}\selectfont  $\leftarrow \joinrel  \rhook $}}{}{}\_\discretionary {\unhbox \voidb@x \hbox {\relax \fontsize  {7}{8}\selectfont  $\leftarrow \joinrel  \rhook $}}{}{}destroy\discretionary {\unhbox \voidb@x \hbox {\relax \fontsize  {7}{8}\selectfont  $\leftarrow \joinrel  \rhook $}}{}{}\_\discretionary {\unhbox \voidb@x \hbox {\relax \fontsize  {7}{8}\selectfont  $\leftarrow \joinrel  \rhook $}}{}{}event()}{8}{subsubsection.3.1.3.6}\protected@file@percent }
\newlabel{class_affichage_a8e8d9abcdd46dbf3be9e8917cf6fef6f}{{3.1.3.6}{8}{\texorpdfstring {on\+\_\+destroy\+\_\+event()}{on\_destroy\_event()}}{table.3.7}{}}
\@writefile{toc}{\contentsline {subsubsection}{\numberline {3.1.3.7}on\discretionary {\unhbox \voidb@x \hbox {\relax \fontsize  {7}{8}\selectfont  $\leftarrow \joinrel  \rhook $}}{}{}\_\discretionary {\unhbox \voidb@x \hbox {\relax \fontsize  {7}{8}\selectfont  $\leftarrow \joinrel  \rhook $}}{}{}draw\discretionary {\unhbox \voidb@x \hbox {\relax \fontsize  {7}{8}\selectfont  $\leftarrow \joinrel  \rhook $}}{}{}\_\discretionary {\unhbox \voidb@x \hbox {\relax \fontsize  {7}{8}\selectfont  $\leftarrow \joinrel  \rhook $}}{}{}event()}{8}{subsubsection.3.1.3.7}\protected@file@percent }
\gdef \LT@viii {\LT@entry 
    {3}{52.82222pt}\LT@entry 
    {3}{235.38896pt}}
\gdef \LT@ix {\LT@entry 
    {3}{52.82222pt}\LT@entry 
    {3}{215.62718pt}}
\newlabel{class_affichage_ab5f5202529d0048b48f0bb6f1e7d7d11}{{3.1.3.7}{9}{\texorpdfstring {on\+\_\+draw\+\_\+event()}{on\_draw\_event()}}{table.3.8}{}}
\@writefile{toc}{\contentsline {subsubsection}{\numberline {3.1.3.8}on\discretionary {\unhbox \voidb@x \hbox {\relax \fontsize  {7}{8}\selectfont  $\leftarrow \joinrel  \rhook $}}{}{}\_\discretionary {\unhbox \voidb@x \hbox {\relax \fontsize  {7}{8}\selectfont  $\leftarrow \joinrel  \rhook $}}{}{}resize\discretionary {\unhbox \voidb@x \hbox {\relax \fontsize  {7}{8}\selectfont  $\leftarrow \joinrel  \rhook $}}{}{}\_\discretionary {\unhbox \voidb@x \hbox {\relax \fontsize  {7}{8}\selectfont  $\leftarrow \joinrel  \rhook $}}{}{}event()}{9}{subsubsection.3.1.3.8}\protected@file@percent }
\newlabel{class_affichage_a0dc36ac09ca1f65b4300e61307887c54}{{3.1.3.8}{9}{\texorpdfstring {on\+\_\+resize\+\_\+event()}{on\_resize\_event()}}{table.3.9}{}}
\@writefile{toc}{\contentsline {subsubsection}{\numberline {3.1.3.9}Start()}{9}{subsubsection.3.1.3.9}\protected@file@percent }
\newlabel{class_affichage_a7f9731dfc1c3b445fb4705849308efe9}{{3.1.3.9}{9}{\texorpdfstring {Start()}{Start()}}{subsubsection.3.1.3.9}{}}
\@writefile{toc}{\contentsline {subsubsection}{\numberline {3.1.3.10}Stop()}{9}{subsubsection.3.1.3.10}\protected@file@percent }
\newlabel{class_affichage_a83912b3afb42dd6e743cf0d754bdfc7d}{{3.1.3.10}{9}{\texorpdfstring {Stop()}{Stop()}}{subsubsection.3.1.3.10}{}}
\gdef \LT@x {\LT@entry 
    {3}{61.03925pt}\LT@entry 
    {3}{215.62718pt}}
\@writefile{toc}{\contentsline {subsubsection}{\numberline {3.1.3.11}Tick\discretionary {\unhbox \voidb@x \hbox {\relax \fontsize  {7}{8}\selectfont  $\leftarrow \joinrel  \rhook $}}{}{}Clock()}{10}{subsubsection.3.1.3.11}\protected@file@percent }
\@writefile{toc}{\contentsline {section}{\numberline {3.2}R\IeC {\'e}f\IeC {\'e}rence de la structure global\discretionary {\unhbox \voidb@x \hbox {\relax \fontsize  {7}{8}\selectfont  $\leftarrow \joinrel  \rhook $}}{}{}\_\discretionary {\unhbox \voidb@x \hbox {\relax \fontsize  {7}{8}\selectfont  $\leftarrow \joinrel  \rhook $}}{}{}data}{10}{section.3.2}\protected@file@percent }
\newlabel{structglobal__data}{{3.2}{10}{Référence de la structure global\+\_\+data}{section.3.2}{}}
\@writefile{toc}{\contentsline {subsection}{\numberline {3.2.1}Description d\IeC {\'e}taill\IeC {\'e}e}{10}{subsection.3.2.1}\protected@file@percent }
\@writefile{toc}{\contentsline {subsection}{\numberline {3.2.2}Documentation des donn\IeC {\'e}es membres}{10}{subsection.3.2.2}\protected@file@percent }
\newlabel{structglobal__data_a1e4c98265125000c3e1d9b9d5505624a}{{3.2.2}{10}{Documentation des données membres}{subsection.3.2.2}{}}
\@writefile{toc}{\contentsline {subsubsection}{\numberline {3.2.2.1}client\discretionary {\unhbox \voidb@x \hbox {\relax \fontsize  {7}{8}\selectfont  $\leftarrow \joinrel  \rhook $}}{}{}\_\discretionary {\unhbox \voidb@x \hbox {\relax \fontsize  {7}{8}\selectfont  $\leftarrow \joinrel  \rhook $}}{}{}data}{11}{subsubsection.3.2.2.1}\protected@file@percent }
\newlabel{structglobal__data_af6104ca34e17809883bd4549474bbdb7}{{3.2.2.1}{11}{\texorpdfstring {client\+\_\+data}{client\_data}}{subsubsection.3.2.2.1}{}}
\@writefile{toc}{\contentsline {subsubsection}{\numberline {3.2.2.2}draw\discretionary {\unhbox \voidb@x \hbox {\relax \fontsize  {7}{8}\selectfont  $\leftarrow \joinrel  \rhook $}}{}{}\_\discretionary {\unhbox \voidb@x \hbox {\relax \fontsize  {7}{8}\selectfont  $\leftarrow \joinrel  \rhook $}}{}{}area}{11}{subsubsection.3.2.2.2}\protected@file@percent }
\newlabel{structglobal__data_a34a4b1f3b213efc91ac33ce1754412b1}{{3.2.2.2}{11}{\texorpdfstring {draw\+\_\+area}{draw\_area}}{subsubsection.3.2.2.2}{}}
\@writefile{toc}{\contentsline {subsubsection}{\numberline {3.2.2.3}error}{11}{subsubsection.3.2.2.3}\protected@file@percent }
\newlabel{structglobal__data_a5286e964937343115aebb48fd116c004}{{3.2.2.3}{11}{\texorpdfstring {error}{error}}{subsubsection.3.2.2.3}{}}
\@writefile{toc}{\contentsline {subsubsection}{\numberline {3.2.2.4}filepath}{11}{subsubsection.3.2.2.4}\protected@file@percent }
\newlabel{structglobal__data_a5aeb1d5c8a59ecd3c81742763c2c4089}{{3.2.2.4}{11}{\texorpdfstring {filepath}{filepath}}{subsubsection.3.2.2.4}{}}
\@writefile{toc}{\contentsline {subsubsection}{\numberline {3.2.2.5}parseur\discretionary {\unhbox \voidb@x \hbox {\relax \fontsize  {7}{8}\selectfont  $\leftarrow \joinrel  \rhook $}}{}{}\_\discretionary {\unhbox \voidb@x \hbox {\relax \fontsize  {7}{8}\selectfont  $\leftarrow \joinrel  \rhook $}}{}{}threads}{11}{subsubsection.3.2.2.5}\protected@file@percent }
\newlabel{structglobal__data_abd8359b2412e180a4aede926ba81a3ec}{{3.2.2.5}{11}{\texorpdfstring {parseur\+\_\+threads}{parseur\_threads}}{subsubsection.3.2.2.5}{}}
\@writefile{toc}{\contentsline {subsubsection}{\numberline {3.2.2.6}svg\discretionary {\unhbox \voidb@x \hbox {\relax \fontsize  {7}{8}\selectfont  $\leftarrow \joinrel  \rhook $}}{}{}\_\discretionary {\unhbox \voidb@x \hbox {\relax \fontsize  {7}{8}\selectfont  $\leftarrow \joinrel  \rhook $}}{}{}document}{12}{subsubsection.3.2.2.6}\protected@file@percent }
\newlabel{structglobal__data_ac43f1ea601c065459114c70089e43d57}{{3.2.2.6}{12}{\texorpdfstring {svg\+\_\+document}{svg\_document}}{subsubsection.3.2.2.6}{}}
\@writefile{toc}{\contentsline {subsubsection}{\numberline {3.2.2.7}svg\discretionary {\unhbox \voidb@x \hbox {\relax \fontsize  {7}{8}\selectfont  $\leftarrow \joinrel  \rhook $}}{}{}\_\discretionary {\unhbox \voidb@x \hbox {\relax \fontsize  {7}{8}\selectfont  $\leftarrow \joinrel  \rhook $}}{}{}driven}{12}{subsubsection.3.2.2.7}\protected@file@percent }
\newlabel{structglobal__data_a29f5422d00442f4cf611cc55b2f094ff}{{3.2.2.7}{12}{\texorpdfstring {svg\+\_\+driven}{svg\_driven}}{subsubsection.3.2.2.7}{}}
\@writefile{toc}{\contentsline {subsubsection}{\numberline {3.2.2.8}svg\discretionary {\unhbox \voidb@x \hbox {\relax \fontsize  {7}{8}\selectfont  $\leftarrow \joinrel  \rhook $}}{}{}\_\discretionary {\unhbox \voidb@x \hbox {\relax \fontsize  {7}{8}\selectfont  $\leftarrow \joinrel  \rhook $}}{}{}handle}{12}{subsubsection.3.2.2.8}\protected@file@percent }
\newlabel{structglobal__data_a4fb4fc96f3ea35e2107f728faa010530}{{3.2.2.8}{12}{\texorpdfstring {svg\+\_\+handle}{svg\_handle}}{subsubsection.3.2.2.8}{}}
\@writefile{toc}{\contentsline {subsubsection}{\numberline {3.2.2.9}window}{12}{subsubsection.3.2.2.9}\protected@file@percent }
\@writefile{toc}{\contentsline {section}{\numberline {3.3}R\IeC {\'e}f\IeC {\'e}rence de la classe Parsage}{12}{section.3.3}\protected@file@percent }
\newlabel{class_parsage}{{3.3}{12}{Référence de la classe Parsage}{section.3.3}{}}
\gdef \LT@xi {\LT@entry 
    {3}{40.32141pt}\LT@entry 
    {3}{358.81166pt}}
\@writefile{toc}{\contentsline {subsection}{\numberline {3.3.1}Description d\IeC {\'e}taill\IeC {\'e}e}{13}{subsection.3.3.1}\protected@file@percent }
\@writefile{toc}{\contentsline {subsection}{\numberline {3.3.2}Documentation des constructeurs et destructeur}{13}{subsection.3.3.2}\protected@file@percent }
\newlabel{class_parsage_a64af028b786d98300f79ef5193fabc81}{{3.3.2}{13}{Documentation des constructeurs et destructeur}{subsection.3.3.2}{}}
\@writefile{toc}{\contentsline {subsubsection}{\numberline {3.3.2.1}Parsage()\hspace  {0.1cm}{\relax \fontsize  {8}{9.5}\selectfont  \abovedisplayskip 6\p@ plus2\p@ minus4\p@ \abovedisplayshortskip \z@ plus\p@ \belowdisplayshortskip 3\p@ plus\p@ minus2\p@ \def \leftmargin \leftmargini \parsep 4\p@ plus2\p@ minus\p@ \topsep 8\p@ plus2\p@ minus4\p@ \itemsep 4\p@ plus2\p@ minus\p@ {\leftmargin \leftmargini \topsep 3\p@ plus\p@ minus\p@ \parsep 2\p@ plus\p@ minus\p@ \itemsep \parsep }\belowdisplayskip \abovedisplayskip \ttfamilyFB  [1/2]}}{13}{subsubsection.3.3.2.1}\protected@file@percent }
\newlabel{class_parsage_a34ebfb0a8ec6de4f66574f030d89ce60}{{3.3.2.1}{13}{\texorpdfstring {Parsage()}{Parsage()}\hspace {0.1cm}{\footnotesize \ttfamily [1/2]}}{table.3.11}{}}
\gdef \LT@xii {\LT@entry 
    {3}{45.31642pt}\LT@entry 
    {3}{104.09006pt}}
\gdef \LT@xiii {\LT@entry 
    {3}{37.21646pt}\LT@entry 
    {3}{81.92357pt}}
\@writefile{toc}{\contentsline {subsubsection}{\numberline {3.3.2.2}Parsage()\hspace  {0.1cm}{\relax \fontsize  {8}{9.5}\selectfont  \abovedisplayskip 6\p@ plus2\p@ minus4\p@ \abovedisplayshortskip \z@ plus\p@ \belowdisplayshortskip 3\p@ plus\p@ minus2\p@ \def \leftmargin \leftmargini \parsep 4\p@ plus2\p@ minus\p@ \topsep 8\p@ plus2\p@ minus4\p@ \itemsep 4\p@ plus2\p@ minus\p@ {\leftmargin \leftmargini \topsep 3\p@ plus\p@ minus\p@ \parsep 2\p@ plus\p@ minus\p@ \itemsep \parsep }\belowdisplayskip \abovedisplayskip \ttfamilyFB  [2/2]}}{14}{subsubsection.3.3.2.2}\protected@file@percent }
\newlabel{class_parsage_ae2d049bf2188528ea5ae6c90d8088157}{{3.3.2.2}{14}{\texorpdfstring {Parsage()}{Parsage()}\hspace {0.1cm}{\footnotesize \ttfamily [2/2]}}{table.3.12}{}}
\@writefile{toc}{\contentsline {subsubsection}{\numberline {3.3.2.3}$\sim $\discretionary {\unhbox \voidb@x \hbox {\relax \fontsize  {7}{8}\selectfont  $\leftarrow \joinrel  \rhook $}}{}{}Parsage()}{14}{subsubsection.3.3.2.3}\protected@file@percent }
\@writefile{toc}{\contentsline {subsection}{\numberline {3.3.3}Documentation des fonctions membres}{14}{subsection.3.3.3}\protected@file@percent }
\newlabel{class_parsage_a5b19556a4e9d80dd106937c1608bd989}{{3.3.3}{14}{Documentation des fonctions membres}{subsection.3.3.3}{}}
\@writefile{toc}{\contentsline {subsubsection}{\numberline {3.3.3.1}Has\discretionary {\unhbox \voidb@x \hbox {\relax \fontsize  {7}{8}\selectfont  $\leftarrow \joinrel  \rhook $}}{}{}Animation()}{14}{subsubsection.3.3.3.1}\protected@file@percent }
\newlabel{class_parsage_a08396b2448457846f13aa0c4f32c3058}{{3.3.3.1}{14}{\texorpdfstring {Has\+Animation()}{HasAnimation()}}{table.3.13}{}}
\gdef \LT@xiv {\LT@entry 
    {3}{25.3097pt}\LT@entry 
    {3}{81.92357pt}}
\gdef \LT@xv {\LT@entry 
    {3}{80.78448pt}\LT@entry 
    {3}{255.2954pt}}
\@writefile{toc}{\contentsline {subsubsection}{\numberline {3.3.3.2}Init\discretionary {\unhbox \voidb@x \hbox {\relax \fontsize  {7}{8}\selectfont  $\leftarrow \joinrel  \rhook $}}{}{}Parsage()}{15}{subsubsection.3.3.3.2}\protected@file@percent }
\newlabel{class_parsage_acd97431fa48a6fae25b3ed80c940c591}{{3.3.3.2}{15}{\texorpdfstring {Init\+Parsage()}{InitParsage()}}{subsubsection.3.3.3.2}{}}
\@writefile{toc}{\contentsline {subsubsection}{\numberline {3.3.3.3}Is\discretionary {\unhbox \voidb@x \hbox {\relax \fontsize  {7}{8}\selectfont  $\leftarrow \joinrel  \rhook $}}{}{}Driven()}{15}{subsubsection.3.3.3.3}\protected@file@percent }
\newlabel{class_parsage_ac1c6e82320a89a9ee1f83aeb19e3010d}{{3.3.3.3}{15}{\texorpdfstring {Is\+Driven()}{IsDriven()}}{table.3.14}{}}
\@writefile{toc}{\contentsline {subsubsection}{\numberline {3.3.3.4}Join()}{15}{subsubsection.3.3.3.4}\protected@file@percent }
\newlabel{class_parsage_acc5649f66ddc316d5ecda0e2d8eae7f6}{{3.3.3.4}{15}{\texorpdfstring {Join()}{Join()}}{table.3.15}{}}
\@writefile{toc}{\contentsline {subsubsection}{\numberline {3.3.3.5}Parse\discretionary {\unhbox \voidb@x \hbox {\relax \fontsize  {7}{8}\selectfont  $\leftarrow \joinrel  \rhook $}}{}{}Svg\discretionary {\unhbox \voidb@x \hbox {\relax \fontsize  {7}{8}\selectfont  $\leftarrow \joinrel  \rhook $}}{}{}Tag()}{15}{subsubsection.3.3.3.5}\protected@file@percent }
\gdef \LT@xvi {\LT@entry 
    {3}{25.3097pt}\LT@entry 
    {3}{81.92357pt}}
\gdef \LT@xvii {\LT@entry 
    {3}{38.31444pt}\LT@entry 
    {3}{144.2831pt}}
\newlabel{class_parsage_ad009bf076ad8da3c43bc68d5ba77ac73}{{3.3.3.5}{16}{\texorpdfstring {Parse\+Svg\+Tag()}{ParseSvgTag()}}{table.3.16}{}}
\@writefile{toc}{\contentsline {subsubsection}{\numberline {3.3.3.6}Set\discretionary {\unhbox \voidb@x \hbox {\relax \fontsize  {7}{8}\selectfont  $\leftarrow \joinrel  \rhook $}}{}{}Attribute()}{16}{subsubsection.3.3.3.6}\protected@file@percent }
\newlabel{class_parsage_a118aa455b789dc895bccf27a7238484c}{{3.3.3.6}{16}{\texorpdfstring {Set\+Attribute()}{SetAttribute()}}{table.3.17}{}}
\@writefile{toc}{\contentsline {subsubsection}{\numberline {3.3.3.7}Set\discretionary {\unhbox \voidb@x \hbox {\relax \fontsize  {7}{8}\selectfont  $\leftarrow \joinrel  \rhook $}}{}{}Attribute\discretionary {\unhbox \voidb@x \hbox {\relax \fontsize  {7}{8}\selectfont  $\leftarrow \joinrel  \rhook $}}{}{}Style()}{16}{subsubsection.3.3.3.7}\protected@file@percent }
\gdef \LT@xviii {\LT@entry 
    {3}{38.31444pt}\LT@entry 
    {3}{144.2831pt}}
\gdef \LT@xix {\LT@entry 
    {3}{34.08463pt}\LT@entry 
    {3}{144.2831pt}}
\gdef \LT@xx {\LT@entry 
    {3}{27.0377pt}\LT@entry 
    {3}{126.40933pt}}
\newlabel{class_parsage_a333dc1300487aeec5694380fd3ed5118}{{3.3.3.7}{17}{\texorpdfstring {Set\+Attribute\+Style()}{SetAttributeStyle()}}{table.3.18}{}}
\@writefile{toc}{\contentsline {subsubsection}{\numberline {3.3.3.8}Set\discretionary {\unhbox \voidb@x \hbox {\relax \fontsize  {7}{8}\selectfont  $\leftarrow \joinrel  \rhook $}}{}{}Driven\discretionary {\unhbox \voidb@x \hbox {\relax \fontsize  {7}{8}\selectfont  $\leftarrow \joinrel  \rhook $}}{}{}Parent()}{17}{subsubsection.3.3.3.8}\protected@file@percent }
\newlabel{class_parsage_aeb8e3a69da05952513821f9ed99f5748}{{3.3.3.8}{17}{\texorpdfstring {Set\+Driven\+Parent()}{SetDrivenParent()}}{table.3.19}{}}
\@writefile{toc}{\contentsline {subsubsection}{\numberline {3.3.3.9}Split()}{17}{subsubsection.3.3.3.9}\protected@file@percent }
\gdef \LT@xxi {\LT@entry 
    {3}{52.82222pt}\LT@entry 
    {3}{194.61272pt}}
\newlabel{class_parsage_a67732d87cb2c63914634b224d08fc623}{{3.3.3.9}{18}{\texorpdfstring {Split()}{Split()}}{table.3.20}{}}
\@writefile{toc}{\contentsline {subsubsection}{\numberline {3.3.3.10}Thread\discretionary {\unhbox \voidb@x \hbox {\relax \fontsize  {7}{8}\selectfont  $\leftarrow \joinrel  \rhook $}}{}{}Set\discretionary {\unhbox \voidb@x \hbox {\relax \fontsize  {7}{8}\selectfont  $\leftarrow \joinrel  \rhook $}}{}{}Driven\discretionary {\unhbox \voidb@x \hbox {\relax \fontsize  {7}{8}\selectfont  $\leftarrow \joinrel  \rhook $}}{}{}Parent()}{18}{subsubsection.3.3.3.10}\protected@file@percent }
\@writefile{toc}{\contentsline {section}{\numberline {3.4}R\IeC {\'e}f\IeC {\'e}rence de la structure parsage\discretionary {\unhbox \voidb@x \hbox {\relax \fontsize  {7}{8}\selectfont  $\leftarrow \joinrel  \rhook $}}{}{}\_\discretionary {\unhbox \voidb@x \hbox {\relax \fontsize  {7}{8}\selectfont  $\leftarrow \joinrel  \rhook $}}{}{}data}{18}{section.3.4}\protected@file@percent }
\newlabel{structparsage__data}{{3.4}{18}{Référence de la structure parsage\+\_\+data}{section.3.4}{}}
\@writefile{toc}{\contentsline {subsection}{\numberline {3.4.1}Description d\IeC {\'e}taill\IeC {\'e}e}{18}{subsection.3.4.1}\protected@file@percent }
\@writefile{toc}{\contentsline {subsection}{\numberline {3.4.2}Documentation des donn\IeC {\'e}es membres}{18}{subsection.3.4.2}\protected@file@percent }
\newlabel{structparsage__data_aa319424811a853903d3e3956802101c9}{{3.4.2}{18}{Documentation des données membres}{subsection.3.4.2}{}}
\@writefile{toc}{\contentsline {subsubsection}{\numberline {3.4.2.1}key}{19}{subsubsection.3.4.2.1}\protected@file@percent }
\newlabel{structparsage__data_a677d38e44d395049d71ce1e6f2733b41}{{3.4.2.1}{19}{\texorpdfstring {key}{key}}{subsubsection.3.4.2.1}{}}
\@writefile{toc}{\contentsline {subsubsection}{\numberline {3.4.2.2}parseur}{19}{subsubsection.3.4.2.2}\protected@file@percent }
\newlabel{structparsage__data_a1f84c2c622dd305246e0667a6c9613ab}{{3.4.2.2}{19}{\texorpdfstring {parseur}{parseur}}{subsubsection.3.4.2.2}{}}
\@writefile{toc}{\contentsline {subsubsection}{\numberline {3.4.2.3}value}{19}{subsubsection.3.4.2.3}\protected@file@percent }
\@writefile{toc}{\contentsline {section}{\numberline {3.5}R\IeC {\'e}f\IeC {\'e}rence de la classe Serveur}{19}{section.3.5}\protected@file@percent }
\newlabel{class_serveur}{{3.5}{19}{Référence de la classe Serveur}{section.3.5}{}}
\gdef \LT@xxii {\LT@entry 
    {3}{41.81543pt}\LT@entry 
    {3}{143.86047pt}}
\gdef \LT@xxiii {\LT@entry 
    {3}{42.85043pt}\LT@entry 
    {3}{102.48793pt}}
\@writefile{toc}{\contentsline {subsection}{\numberline {3.5.1}Description d\IeC {\'e}taill\IeC {\'e}e}{20}{subsection.3.5.1}\protected@file@percent }
\@writefile{toc}{\contentsline {subsection}{\numberline {3.5.2}Documentation des constructeurs et destructeur}{20}{subsection.3.5.2}\protected@file@percent }
\newlabel{class_serveur_a0125780f12d0a18452109947e581a4a5}{{3.5.2}{20}{Documentation des constructeurs et destructeur}{subsection.3.5.2}{}}
\@writefile{toc}{\contentsline {subsubsection}{\numberline {3.5.2.1}Serveur()\hspace  {0.1cm}{\relax \fontsize  {8}{9.5}\selectfont  \abovedisplayskip 6\p@ plus2\p@ minus4\p@ \abovedisplayshortskip \z@ plus\p@ \belowdisplayshortskip 3\p@ plus\p@ minus2\p@ \def \leftmargin \leftmargini \parsep 4\p@ plus2\p@ minus\p@ \topsep 8\p@ plus2\p@ minus4\p@ \itemsep 4\p@ plus2\p@ minus\p@ {\leftmargin \leftmargini \topsep 3\p@ plus\p@ minus\p@ \parsep 2\p@ plus\p@ minus\p@ \itemsep \parsep }\belowdisplayskip \abovedisplayskip \ttfamilyFB  [1/2]}}{20}{subsubsection.3.5.2.1}\protected@file@percent }
\newlabel{class_serveur_a14a9f4e8ea50c086dd963adb9537abf0}{{3.5.2.1}{20}{\texorpdfstring {Serveur()}{Serveur()}\hspace {0.1cm}{\footnotesize \ttfamily [1/2]}}{table.3.22}{}}
\@writefile{toc}{\contentsline {subsubsection}{\numberline {3.5.2.2}Serveur()\hspace  {0.1cm}{\relax \fontsize  {8}{9.5}\selectfont  \abovedisplayskip 6\p@ plus2\p@ minus4\p@ \abovedisplayshortskip \z@ plus\p@ \belowdisplayshortskip 3\p@ plus\p@ minus2\p@ \def \leftmargin \leftmargini \parsep 4\p@ plus2\p@ minus\p@ \topsep 8\p@ plus2\p@ minus4\p@ \itemsep 4\p@ plus2\p@ minus\p@ {\leftmargin \leftmargini \topsep 3\p@ plus\p@ minus\p@ \parsep 2\p@ plus\p@ minus\p@ \itemsep \parsep }\belowdisplayskip \abovedisplayskip \ttfamilyFB  [2/2]}}{20}{subsubsection.3.5.2.2}\protected@file@percent }
\newlabel{class_serveur_a722aefd65c9efab0b3e0646bf3440ea1}{{3.5.2.2}{20}{\texorpdfstring {Serveur()}{Serveur()}\hspace {0.1cm}{\footnotesize \ttfamily [2/2]}}{table.3.23}{}}
\@writefile{toc}{\contentsline {subsubsection}{\numberline {3.5.2.3}$\sim $\discretionary {\unhbox \voidb@x \hbox {\relax \fontsize  {7}{8}\selectfont  $\leftarrow \joinrel  \rhook $}}{}{}Serveur()}{20}{subsubsection.3.5.2.3}\protected@file@percent }
\gdef \LT@xxiv {\LT@entry 
    {3}{30.3047pt}\LT@entry 
    {3}{113.71992pt}}
\@writefile{toc}{\contentsline {subsection}{\numberline {3.5.3}Documentation des fonctions membres}{21}{subsection.3.5.3}\protected@file@percent }
\newlabel{class_serveur_a1c58497e65c8a106e41e1ba364d60514}{{3.5.3}{21}{Documentation des fonctions membres}{subsection.3.5.3}{}}
\@writefile{toc}{\contentsline {subsubsection}{\numberline {3.5.3.1}Init\discretionary {\unhbox \voidb@x \hbox {\relax \fontsize  {7}{8}\selectfont  $\leftarrow \joinrel  \rhook $}}{}{}Serveur()}{21}{subsubsection.3.5.3.1}\protected@file@percent }
\newlabel{class_serveur_ad230d9f35c54db964a8213dc9c50b8f2}{{3.5.3.1}{21}{\texorpdfstring {Init\+Serveur()}{InitServeur()}}{table.3.24}{}}
\@writefile{toc}{\contentsline {subsubsection}{\numberline {3.5.3.2}Run()}{21}{subsubsection.3.5.3.2}\protected@file@percent }
\newlabel{class_serveur_a85bea1c7e74ca63345fcd73151af371c}{{3.5.3.2}{21}{\texorpdfstring {Run()}{Run()}}{subsubsection.3.5.3.2}{}}
\@writefile{toc}{\contentsline {subsubsection}{\numberline {3.5.3.3}Start()}{21}{subsubsection.3.5.3.3}\protected@file@percent }
\newlabel{class_serveur_af975ebf473fba816a553e88b67a2715a}{{3.5.3.3}{21}{\texorpdfstring {Start()}{Start()}}{subsubsection.3.5.3.3}{}}
\gdef \LT@xxv {\LT@entry 
    {3}{23.30272pt}\LT@entry 
    {3}{156.1861pt}}
\@writefile{toc}{\contentsline {subsubsection}{\numberline {3.5.3.4}Stop()}{22}{subsubsection.3.5.3.4}\protected@file@percent }
\newlabel{class_serveur_acd70161c61868928614d01da3c3714ab}{{3.5.3.4}{22}{\texorpdfstring {Stop()}{Stop()}}{subsubsection.3.5.3.4}{}}
\@writefile{toc}{\contentsline {subsubsection}{\numberline {3.5.3.5}Thread()}{22}{subsubsection.3.5.3.5}\protected@file@percent }
\@writefile{toc}{\contentsline {section}{\numberline {3.6}R\IeC {\'e}f\IeC {\'e}rence de la classe Socket}{22}{section.3.6}\protected@file@percent }
\newlabel{class_socket}{{3.6}{22}{Référence de la classe Socket}{section.3.6}{}}
\gdef \LT@xxvi {\LT@entry 
    {3}{43.30945pt}\LT@entry 
    {3}{358.81166pt}}
\gdef \LT@xxvii {\LT@entry 
    {3}{38.44968pt}\LT@entry 
    {3}{98.08717pt}}
\@writefile{toc}{\contentsline {subsection}{\numberline {3.6.1}Description d\IeC {\'e}taill\IeC {\'e}e}{23}{subsection.3.6.1}\protected@file@percent }
\@writefile{toc}{\contentsline {subsection}{\numberline {3.6.2}Documentation des constructeurs et destructeur}{23}{subsection.3.6.2}\protected@file@percent }
\newlabel{class_socket_a8ab13c721526158ffa781fcc10bf9c83}{{3.6.2}{23}{Documentation des constructeurs et destructeur}{subsection.3.6.2}{}}
\@writefile{toc}{\contentsline {subsubsection}{\numberline {3.6.2.1}Socket()\hspace  {0.1cm}{\relax \fontsize  {8}{9.5}\selectfont  \abovedisplayskip 6\p@ plus2\p@ minus4\p@ \abovedisplayshortskip \z@ plus\p@ \belowdisplayshortskip 3\p@ plus\p@ minus2\p@ \def \leftmargin \leftmargini \parsep 4\p@ plus2\p@ minus\p@ \topsep 8\p@ plus2\p@ minus4\p@ \itemsep 4\p@ plus2\p@ minus\p@ {\leftmargin \leftmargini \topsep 3\p@ plus\p@ minus\p@ \parsep 2\p@ plus\p@ minus\p@ \itemsep \parsep }\belowdisplayskip \abovedisplayskip \ttfamilyFB  [1/2]}}{23}{subsubsection.3.6.2.1}\protected@file@percent }
\newlabel{class_socket_ad55073e6cf9e64bd24a4b3f2add476bd}{{3.6.2.1}{23}{\texorpdfstring {Socket()}{Socket()}\hspace {0.1cm}{\footnotesize \ttfamily [1/2]}}{table.3.26}{}}
\@writefile{toc}{\contentsline {subsubsection}{\numberline {3.6.2.2}Socket()\hspace  {0.1cm}{\relax \fontsize  {8}{9.5}\selectfont  \abovedisplayskip 6\p@ plus2\p@ minus4\p@ \abovedisplayshortskip \z@ plus\p@ \belowdisplayshortskip 3\p@ plus\p@ minus2\p@ \def \leftmargin \leftmargini \parsep 4\p@ plus2\p@ minus\p@ \topsep 8\p@ plus2\p@ minus4\p@ \itemsep 4\p@ plus2\p@ minus\p@ {\leftmargin \leftmargini \topsep 3\p@ plus\p@ minus\p@ \parsep 2\p@ plus\p@ minus\p@ \itemsep \parsep }\belowdisplayskip \abovedisplayskip \ttfamilyFB  [2/2]}}{23}{subsubsection.3.6.2.2}\protected@file@percent }
\newlabel{class_socket_aeac4eb6379a543d38ed88977d3b6630a}{{3.6.2.2}{23}{\texorpdfstring {Socket()}{Socket()}\hspace {0.1cm}{\footnotesize \ttfamily [2/2]}}{table.3.27}{}}
\@writefile{toc}{\contentsline {subsubsection}{\numberline {3.6.2.3}$\sim $\discretionary {\unhbox \voidb@x \hbox {\relax \fontsize  {7}{8}\selectfont  $\leftarrow \joinrel  \rhook $}}{}{}Socket()}{23}{subsubsection.3.6.2.3}\protected@file@percent }
\@writefile{toc}{\contentsline {subsection}{\numberline {3.6.3}Documentation des fonctions membres}{23}{subsection.3.6.3}\protected@file@percent }
\newlabel{class_socket_a5c3e3fdba40eb732b30869e131159863}{{3.6.3}{23}{Documentation des fonctions membres}{subsection.3.6.3}{}}
\gdef \LT@xxviii {\LT@entry 
    {3}{23.30272pt}\LT@entry 
    {3}{156.78925pt}}
\@writefile{toc}{\contentsline {subsubsection}{\numberline {3.6.3.1}Init\discretionary {\unhbox \voidb@x \hbox {\relax \fontsize  {7}{8}\selectfont  $\leftarrow \joinrel  \rhook $}}{}{}Socket()}{24}{subsubsection.3.6.3.1}\protected@file@percent }
\newlabel{class_socket_ad517cb205cbfdb01485df1f94377ca28}{{3.6.3.1}{24}{\texorpdfstring {Init\+Socket()}{InitSocket()}}{subsubsection.3.6.3.1}{}}
\@writefile{toc}{\contentsline {subsubsection}{\numberline {3.6.3.2}Run()}{24}{subsubsection.3.6.3.2}\protected@file@percent }
\newlabel{class_socket_a025a7c09b388b0ab0a17b2dc7a314a3a}{{3.6.3.2}{24}{\texorpdfstring {Run()}{Run()}}{subsubsection.3.6.3.2}{}}
\@writefile{toc}{\contentsline {subsubsection}{\numberline {3.6.3.3}Start()}{24}{subsubsection.3.6.3.3}\protected@file@percent }
\newlabel{class_socket_a0d0a5267d11fc4e8cf866d6754273d1d}{{3.6.3.3}{24}{\texorpdfstring {Start()}{Start()}}{subsubsection.3.6.3.3}{}}
\@writefile{toc}{\contentsline {subsubsection}{\numberline {3.6.3.4}Stop()}{24}{subsubsection.3.6.3.4}\protected@file@percent }
\newlabel{class_socket_ac3443e00f2d6c665610ff64aea05c028}{{3.6.3.4}{24}{\texorpdfstring {Stop()}{Stop()}}{subsubsection.3.6.3.4}{}}
\@writefile{toc}{\contentsline {subsubsection}{\numberline {3.6.3.5}Thread()}{24}{subsubsection.3.6.3.5}\protected@file@percent }
\@writefile{toc}{\contentsline {section}{\numberline {3.7}R\IeC {\'e}f\IeC {\'e}rence de la structure Structure}{25}{section.3.7}\protected@file@percent }
\newlabel{struct_structure}{{3.7}{25}{Référence de la structure Structure}{section.3.7}{}}
\@writefile{toc}{\contentsline {subsection}{\numberline {3.7.1}Description d\IeC {\'e}taill\IeC {\'e}e}{25}{subsection.3.7.1}\protected@file@percent }
\@writefile{toc}{\contentsline {chapter}{\numberline {4}Documentation des fichiers}{27}{chapter.4}\protected@file@percent }
\@writefile{lof}{\addvspace {10\p@ }}
\@writefile{lot}{\addvspace {10\p@ }}
\@writefile{toc}{\contentsline {section}{\numberline {4.1}R\IeC {\'e}f\IeC {\'e}rence du fichier include/class/affichage.hpp}{27}{section.4.1}\protected@file@percent }
\newlabel{affichage_8hpp}{{4.1}{27}{Référence du fichier include/class/affichage.hpp}{section.4.1}{}}
\@writefile{toc}{\contentsline {subsection}{\numberline {4.1.1}Description d\IeC {\'e}taill\IeC {\'e}e}{28}{subsection.4.1.1}\protected@file@percent }
\@writefile{toc}{\contentsline {subsection}{\numberline {4.1.2}Documentation des macros}{28}{subsection.4.1.2}\protected@file@percent }
\newlabel{affichage_8hpp_a23ae24670d549290e4585ad5dc97f522}{{4.1.2}{28}{Documentation des macros}{subsection.4.1.2}{}}
\@writefile{toc}{\contentsline {subsubsection}{\numberline {4.1.2.1}W\discretionary {\unhbox \voidb@x \hbox {\relax \fontsize  {7}{8}\selectfont  $\leftarrow \joinrel  \rhook $}}{}{}I\discretionary {\unhbox \voidb@x \hbox {\relax \fontsize  {7}{8}\selectfont  $\leftarrow \joinrel  \rhook $}}{}{}N\discretionary {\unhbox \voidb@x \hbox {\relax \fontsize  {7}{8}\selectfont  $\leftarrow \joinrel  \rhook $}}{}{}D\discretionary {\unhbox \voidb@x \hbox {\relax \fontsize  {7}{8}\selectfont  $\leftarrow \joinrel  \rhook $}}{}{}O\discretionary {\unhbox \voidb@x \hbox {\relax \fontsize  {7}{8}\selectfont  $\leftarrow \joinrel  \rhook $}}{}{}W\discretionary {\unhbox \voidb@x \hbox {\relax \fontsize  {7}{8}\selectfont  $\leftarrow \joinrel  \rhook $}}{}{}\_\discretionary {\unhbox \voidb@x \hbox {\relax \fontsize  {7}{8}\selectfont  $\leftarrow \joinrel  \rhook $}}{}{}\discretionary {\unhbox \voidb@x \hbox {\relax \fontsize  {7}{8}\selectfont  $\leftarrow \joinrel  \rhook $}}{}{}D\discretionary {\unhbox \voidb@x \hbox {\relax \fontsize  {7}{8}\selectfont  $\leftarrow \joinrel  \rhook $}}{}{}E\discretionary {\unhbox \voidb@x \hbox {\relax \fontsize  {7}{8}\selectfont  $\leftarrow \joinrel  \rhook $}}{}{}F\discretionary {\unhbox \voidb@x \hbox {\relax \fontsize  {7}{8}\selectfont  $\leftarrow \joinrel  \rhook $}}{}{}A\discretionary {\unhbox \voidb@x \hbox {\relax \fontsize  {7}{8}\selectfont  $\leftarrow \joinrel  \rhook $}}{}{}U\discretionary {\unhbox \voidb@x \hbox {\relax \fontsize  {7}{8}\selectfont  $\leftarrow \joinrel  \rhook $}}{}{}L\discretionary {\unhbox \voidb@x \hbox {\relax \fontsize  {7}{8}\selectfont  $\leftarrow \joinrel  \rhook $}}{}{}T\discretionary {\unhbox \voidb@x \hbox {\relax \fontsize  {7}{8}\selectfont  $\leftarrow \joinrel  \rhook $}}{}{}\_\discretionary {\unhbox \voidb@x \hbox {\relax \fontsize  {7}{8}\selectfont  $\leftarrow \joinrel  \rhook $}}{}{}\discretionary {\unhbox \voidb@x \hbox {\relax \fontsize  {7}{8}\selectfont  $\leftarrow \joinrel  \rhook $}}{}{}H\discretionary {\unhbox \voidb@x \hbox {\relax \fontsize  {7}{8}\selectfont  $\leftarrow \joinrel  \rhook $}}{}{}E\discretionary {\unhbox \voidb@x \hbox {\relax \fontsize  {7}{8}\selectfont  $\leftarrow \joinrel  \rhook $}}{}{}I\discretionary {\unhbox \voidb@x \hbox {\relax \fontsize  {7}{8}\selectfont  $\leftarrow \joinrel  \rhook $}}{}{}G\discretionary {\unhbox \voidb@x \hbox {\relax \fontsize  {7}{8}\selectfont  $\leftarrow \joinrel  \rhook $}}{}{}HT}{28}{subsubsection.4.1.2.1}\protected@file@percent }
\newlabel{affichage_8hpp_a89adc4ed9ab49d7e3ee5294c33d0bb6a}{{4.1.2.1}{28}{\texorpdfstring {W\+I\+N\+D\+O\+W\+\_\+\+D\+E\+F\+A\+U\+L\+T\+\_\+\+H\+E\+I\+G\+HT}{WINDOW\_DEFAULT\_HEIGHT}}{subsubsection.4.1.2.1}{}}
\@writefile{toc}{\contentsline {subsubsection}{\numberline {4.1.2.2}W\discretionary {\unhbox \voidb@x \hbox {\relax \fontsize  {7}{8}\selectfont  $\leftarrow \joinrel  \rhook $}}{}{}I\discretionary {\unhbox \voidb@x \hbox {\relax \fontsize  {7}{8}\selectfont  $\leftarrow \joinrel  \rhook $}}{}{}N\discretionary {\unhbox \voidb@x \hbox {\relax \fontsize  {7}{8}\selectfont  $\leftarrow \joinrel  \rhook $}}{}{}D\discretionary {\unhbox \voidb@x \hbox {\relax \fontsize  {7}{8}\selectfont  $\leftarrow \joinrel  \rhook $}}{}{}O\discretionary {\unhbox \voidb@x \hbox {\relax \fontsize  {7}{8}\selectfont  $\leftarrow \joinrel  \rhook $}}{}{}W\discretionary {\unhbox \voidb@x \hbox {\relax \fontsize  {7}{8}\selectfont  $\leftarrow \joinrel  \rhook $}}{}{}\_\discretionary {\unhbox \voidb@x \hbox {\relax \fontsize  {7}{8}\selectfont  $\leftarrow \joinrel  \rhook $}}{}{}\discretionary {\unhbox \voidb@x \hbox {\relax \fontsize  {7}{8}\selectfont  $\leftarrow \joinrel  \rhook $}}{}{}D\discretionary {\unhbox \voidb@x \hbox {\relax \fontsize  {7}{8}\selectfont  $\leftarrow \joinrel  \rhook $}}{}{}E\discretionary {\unhbox \voidb@x \hbox {\relax \fontsize  {7}{8}\selectfont  $\leftarrow \joinrel  \rhook $}}{}{}F\discretionary {\unhbox \voidb@x \hbox {\relax \fontsize  {7}{8}\selectfont  $\leftarrow \joinrel  \rhook $}}{}{}A\discretionary {\unhbox \voidb@x \hbox {\relax \fontsize  {7}{8}\selectfont  $\leftarrow \joinrel  \rhook $}}{}{}U\discretionary {\unhbox \voidb@x \hbox {\relax \fontsize  {7}{8}\selectfont  $\leftarrow \joinrel  \rhook $}}{}{}L\discretionary {\unhbox \voidb@x \hbox {\relax \fontsize  {7}{8}\selectfont  $\leftarrow \joinrel  \rhook $}}{}{}T\discretionary {\unhbox \voidb@x \hbox {\relax \fontsize  {7}{8}\selectfont  $\leftarrow \joinrel  \rhook $}}{}{}\_\discretionary {\unhbox \voidb@x \hbox {\relax \fontsize  {7}{8}\selectfont  $\leftarrow \joinrel  \rhook $}}{}{}\discretionary {\unhbox \voidb@x \hbox {\relax \fontsize  {7}{8}\selectfont  $\leftarrow \joinrel  \rhook $}}{}{}W\discretionary {\unhbox \voidb@x \hbox {\relax \fontsize  {7}{8}\selectfont  $\leftarrow \joinrel  \rhook $}}{}{}I\discretionary {\unhbox \voidb@x \hbox {\relax \fontsize  {7}{8}\selectfont  $\leftarrow \joinrel  \rhook $}}{}{}D\discretionary {\unhbox \voidb@x \hbox {\relax \fontsize  {7}{8}\selectfont  $\leftarrow \joinrel  \rhook $}}{}{}TH}{28}{subsubsection.4.1.2.2}\protected@file@percent }
\newlabel{affichage_8hpp_a3adf7b7b13572f2baf3379a8f2f4220a}{{4.1.2.2}{28}{\texorpdfstring {W\+I\+N\+D\+O\+W\+\_\+\+D\+E\+F\+A\+U\+L\+T\+\_\+\+W\+I\+D\+TH}{WINDOW\_DEFAULT\_WIDTH}}{subsubsection.4.1.2.2}{}}
\@writefile{toc}{\contentsline {subsubsection}{\numberline {4.1.2.3}W\discretionary {\unhbox \voidb@x \hbox {\relax \fontsize  {7}{8}\selectfont  $\leftarrow \joinrel  \rhook $}}{}{}I\discretionary {\unhbox \voidb@x \hbox {\relax \fontsize  {7}{8}\selectfont  $\leftarrow \joinrel  \rhook $}}{}{}N\discretionary {\unhbox \voidb@x \hbox {\relax \fontsize  {7}{8}\selectfont  $\leftarrow \joinrel  \rhook $}}{}{}D\discretionary {\unhbox \voidb@x \hbox {\relax \fontsize  {7}{8}\selectfont  $\leftarrow \joinrel  \rhook $}}{}{}O\discretionary {\unhbox \voidb@x \hbox {\relax \fontsize  {7}{8}\selectfont  $\leftarrow \joinrel  \rhook $}}{}{}W\discretionary {\unhbox \voidb@x \hbox {\relax \fontsize  {7}{8}\selectfont  $\leftarrow \joinrel  \rhook $}}{}{}\_\discretionary {\unhbox \voidb@x \hbox {\relax \fontsize  {7}{8}\selectfont  $\leftarrow \joinrel  \rhook $}}{}{}\discretionary {\unhbox \voidb@x \hbox {\relax \fontsize  {7}{8}\selectfont  $\leftarrow \joinrel  \rhook $}}{}{}T\discretionary {\unhbox \voidb@x \hbox {\relax \fontsize  {7}{8}\selectfont  $\leftarrow \joinrel  \rhook $}}{}{}I\discretionary {\unhbox \voidb@x \hbox {\relax \fontsize  {7}{8}\selectfont  $\leftarrow \joinrel  \rhook $}}{}{}T\discretionary {\unhbox \voidb@x \hbox {\relax \fontsize  {7}{8}\selectfont  $\leftarrow \joinrel  \rhook $}}{}{}LE}{29}{subsubsection.4.1.2.3}\protected@file@percent }
\@writefile{toc}{\contentsline {section}{\numberline {4.2}R\IeC {\'e}f\IeC {\'e}rence du fichier include/class/parsage.hpp}{29}{section.4.2}\protected@file@percent }
\newlabel{parsage_8hpp}{{4.2}{29}{Référence du fichier include/class/parsage.hpp}{section.4.2}{}}
\@writefile{toc}{\contentsline {subsection}{\numberline {4.2.1}Description d\IeC {\'e}taill\IeC {\'e}e}{29}{subsection.4.2.1}\protected@file@percent }
\@writefile{toc}{\contentsline {section}{\numberline {4.3}R\IeC {\'e}f\IeC {\'e}rence du fichier include/class/serveur.hpp}{30}{section.4.3}\protected@file@percent }
\newlabel{serveur_8hpp}{{4.3}{30}{Référence du fichier include/class/serveur.hpp}{section.4.3}{}}
\@writefile{toc}{\contentsline {subsection}{\numberline {4.3.1}Description d\IeC {\'e}taill\IeC {\'e}e}{30}{subsection.4.3.1}\protected@file@percent }
\@writefile{toc}{\contentsline {section}{\numberline {4.4}R\IeC {\'e}f\IeC {\'e}rence du fichier include/class/socket.hpp}{31}{section.4.4}\protected@file@percent }
\newlabel{socket_8hpp}{{4.4}{31}{Référence du fichier include/class/socket.hpp}{section.4.4}{}}
\@writefile{toc}{\contentsline {subsection}{\numberline {4.4.1}Description d\IeC {\'e}taill\IeC {\'e}e}{31}{subsection.4.4.1}\protected@file@percent }
\@writefile{toc}{\contentsline {subsection}{\numberline {4.4.2}Documentation des macros}{32}{subsection.4.4.2}\protected@file@percent }
\newlabel{socket_8hpp_a6b20d41d6252e9871430c242cb1a56e7}{{4.4.2}{32}{Documentation des macros}{subsection.4.4.2}{}}
\@writefile{toc}{\contentsline {subsubsection}{\numberline {4.4.2.1}B\discretionary {\unhbox \voidb@x \hbox {\relax \fontsize  {7}{8}\selectfont  $\leftarrow \joinrel  \rhook $}}{}{}U\discretionary {\unhbox \voidb@x \hbox {\relax \fontsize  {7}{8}\selectfont  $\leftarrow \joinrel  \rhook $}}{}{}F\discretionary {\unhbox \voidb@x \hbox {\relax \fontsize  {7}{8}\selectfont  $\leftarrow \joinrel  \rhook $}}{}{}F\discretionary {\unhbox \voidb@x \hbox {\relax \fontsize  {7}{8}\selectfont  $\leftarrow \joinrel  \rhook $}}{}{}E\discretionary {\unhbox \voidb@x \hbox {\relax \fontsize  {7}{8}\selectfont  $\leftarrow \joinrel  \rhook $}}{}{}R\discretionary {\unhbox \voidb@x \hbox {\relax \fontsize  {7}{8}\selectfont  $\leftarrow \joinrel  \rhook $}}{}{}\_\discretionary {\unhbox \voidb@x \hbox {\relax \fontsize  {7}{8}\selectfont  $\leftarrow \joinrel  \rhook $}}{}{}\discretionary {\unhbox \voidb@x \hbox {\relax \fontsize  {7}{8}\selectfont  $\leftarrow \joinrel  \rhook $}}{}{}S\discretionary {\unhbox \voidb@x \hbox {\relax \fontsize  {7}{8}\selectfont  $\leftarrow \joinrel  \rhook $}}{}{}I\discretionary {\unhbox \voidb@x \hbox {\relax \fontsize  {7}{8}\selectfont  $\leftarrow \joinrel  \rhook $}}{}{}ZE}{32}{subsubsection.4.4.2.1}\protected@file@percent }
\newlabel{socket_8hpp_a614217d263be1fb1a5f76e2ff7be19a2}{{4.4.2.1}{32}{\texorpdfstring {B\+U\+F\+F\+E\+R\+\_\+\+S\+I\+ZE}{BUFFER\_SIZE}}{subsubsection.4.4.2.1}{}}
\@writefile{toc}{\contentsline {subsubsection}{\numberline {4.4.2.2}P\discretionary {\unhbox \voidb@x \hbox {\relax \fontsize  {7}{8}\selectfont  $\leftarrow \joinrel  \rhook $}}{}{}O\discretionary {\unhbox \voidb@x \hbox {\relax \fontsize  {7}{8}\selectfont  $\leftarrow \joinrel  \rhook $}}{}{}RT}{32}{subsubsection.4.4.2.2}\protected@file@percent }
\@writefile{toc}{\contentsline {section}{\numberline {4.5}R\IeC {\'e}f\IeC {\'e}rence du fichier include/module/animation.hpp}{32}{section.4.5}\protected@file@percent }
\newlabel{animation_8hpp}{{4.5}{32}{Référence du fichier include/module/animation.hpp}{section.4.5}{}}
\@writefile{toc}{\contentsline {subsection}{\numberline {4.5.1}Description d\IeC {\'e}taill\IeC {\'e}e}{33}{subsection.4.5.1}\protected@file@percent }
\gdef \LT@xxix {\LT@entry 
    {3}{38.31444pt}\LT@entry 
    {3}{190.06483pt}}
\@writefile{toc}{\contentsline {subsection}{\numberline {4.5.2}Documentation des macros}{34}{subsection.4.5.2}\protected@file@percent }
\newlabel{animation_8hpp_a7b9fdc0162092f8c6399b7b128d2c562}{{4.5.2}{34}{Documentation des macros}{subsection.4.5.2}{}}
\@writefile{toc}{\contentsline {subsubsection}{\numberline {4.5.2.1}M\discretionary {\unhbox \voidb@x \hbox {\relax \fontsize  {7}{8}\selectfont  $\leftarrow \joinrel  \rhook $}}{}{}I\discretionary {\unhbox \voidb@x \hbox {\relax \fontsize  {7}{8}\selectfont  $\leftarrow \joinrel  \rhook $}}{}{}L\discretionary {\unhbox \voidb@x \hbox {\relax \fontsize  {7}{8}\selectfont  $\leftarrow \joinrel  \rhook $}}{}{}L\discretionary {\unhbox \voidb@x \hbox {\relax \fontsize  {7}{8}\selectfont  $\leftarrow \joinrel  \rhook $}}{}{}I\discretionary {\unhbox \voidb@x \hbox {\relax \fontsize  {7}{8}\selectfont  $\leftarrow \joinrel  \rhook $}}{}{}S\discretionary {\unhbox \voidb@x \hbox {\relax \fontsize  {7}{8}\selectfont  $\leftarrow \joinrel  \rhook $}}{}{}E\discretionary {\unhbox \voidb@x \hbox {\relax \fontsize  {7}{8}\selectfont  $\leftarrow \joinrel  \rhook $}}{}{}C\discretionary {\unhbox \voidb@x \hbox {\relax \fontsize  {7}{8}\selectfont  $\leftarrow \joinrel  \rhook $}}{}{}O\discretionary {\unhbox \voidb@x \hbox {\relax \fontsize  {7}{8}\selectfont  $\leftarrow \joinrel  \rhook $}}{}{}N\discretionary {\unhbox \voidb@x \hbox {\relax \fontsize  {7}{8}\selectfont  $\leftarrow \joinrel  \rhook $}}{}{}D\discretionary {\unhbox \voidb@x \hbox {\relax \fontsize  {7}{8}\selectfont  $\leftarrow \joinrel  \rhook $}}{}{}E\discretionary {\unhbox \voidb@x \hbox {\relax \fontsize  {7}{8}\selectfont  $\leftarrow \joinrel  \rhook $}}{}{}\_\discretionary {\unhbox \voidb@x \hbox {\relax \fontsize  {7}{8}\selectfont  $\leftarrow \joinrel  \rhook $}}{}{}\discretionary {\unhbox \voidb@x \hbox {\relax \fontsize  {7}{8}\selectfont  $\leftarrow \joinrel  \rhook $}}{}{}P\discretionary {\unhbox \voidb@x \hbox {\relax \fontsize  {7}{8}\selectfont  $\leftarrow \joinrel  \rhook $}}{}{}R\discretionary {\unhbox \voidb@x \hbox {\relax \fontsize  {7}{8}\selectfont  $\leftarrow \joinrel  \rhook $}}{}{}E\discretionary {\unhbox \voidb@x \hbox {\relax \fontsize  {7}{8}\selectfont  $\leftarrow \joinrel  \rhook $}}{}{}C\discretionary {\unhbox \voidb@x \hbox {\relax \fontsize  {7}{8}\selectfont  $\leftarrow \joinrel  \rhook $}}{}{}I\discretionary {\unhbox \voidb@x \hbox {\relax \fontsize  {7}{8}\selectfont  $\leftarrow \joinrel  \rhook $}}{}{}S\discretionary {\unhbox \voidb@x \hbox {\relax \fontsize  {7}{8}\selectfont  $\leftarrow \joinrel  \rhook $}}{}{}I\discretionary {\unhbox \voidb@x \hbox {\relax \fontsize  {7}{8}\selectfont  $\leftarrow \joinrel  \rhook $}}{}{}ON}{34}{subsubsection.4.5.2.1}\protected@file@percent }
\@writefile{toc}{\contentsline {subsection}{\numberline {4.5.3}Documentation des fonctions}{34}{subsection.4.5.3}\protected@file@percent }
\newlabel{animation_8hpp_a1cbccb20271103994250daee6f8589d1}{{4.5.3}{34}{Documentation des fonctions}{subsection.4.5.3}{}}
\@writefile{toc}{\contentsline {subsubsection}{\numberline {4.5.3.1}Animation()}{34}{subsubsection.4.5.3.1}\protected@file@percent }
\@writefile{toc}{\contentsline {section}{\numberline {4.6}R\IeC {\'e}f\IeC {\'e}rence du fichier include/module/aritmetique.hpp}{34}{section.4.6}\protected@file@percent }
\newlabel{aritmetique_8hpp}{{4.6}{34}{Référence du fichier include/module/aritmetique.hpp}{section.4.6}{}}
\@writefile{toc}{\contentsline {subsection}{\numberline {4.6.1}Description d\IeC {\'e}taill\IeC {\'e}e}{35}{subsection.4.6.1}\protected@file@percent }
\@writefile{toc}{\contentsline {subsection}{\numberline {4.6.2}Documentation des d\IeC {\'e}finitions de type}{36}{subsection.4.6.2}\protected@file@percent }
\newlabel{aritmetique_8hpp_a73b802b9a5f3550f9a410781124945ae}{{4.6.2}{36}{Documentation des définitions de type}{subsection.4.6.2}{}}
\@writefile{toc}{\contentsline {subsubsection}{\numberline {4.6.2.1}expression\discretionary {\unhbox \voidb@x \hbox {\relax \fontsize  {7}{8}\selectfont  $\leftarrow \joinrel  \rhook $}}{}{}\_\discretionary {\unhbox \voidb@x \hbox {\relax \fontsize  {7}{8}\selectfont  $\leftarrow \joinrel  \rhook $}}{}{}t}{36}{subsubsection.4.6.2.1}\protected@file@percent }
\newlabel{aritmetique_8hpp_af02e8f8655dabbd5b1b63849de45da8b}{{4.6.2.1}{36}{\texorpdfstring {expression\+\_\+t}{expression\_t}}{subsubsection.4.6.2.1}{}}
\@writefile{toc}{\contentsline {subsubsection}{\numberline {4.6.2.2}parser\discretionary {\unhbox \voidb@x \hbox {\relax \fontsize  {7}{8}\selectfont  $\leftarrow \joinrel  \rhook $}}{}{}\_\discretionary {\unhbox \voidb@x \hbox {\relax \fontsize  {7}{8}\selectfont  $\leftarrow \joinrel  \rhook $}}{}{}t}{36}{subsubsection.4.6.2.2}\protected@file@percent }
\newlabel{aritmetique_8hpp_aa2f8e438a8ab3d889f26822a7f1df788}{{4.6.2.2}{36}{\texorpdfstring {parser\+\_\+t}{parser\_t}}{subsubsection.4.6.2.2}{}}
\@writefile{toc}{\contentsline {subsubsection}{\numberline {4.6.2.3}symbol\discretionary {\unhbox \voidb@x \hbox {\relax \fontsize  {7}{8}\selectfont  $\leftarrow \joinrel  \rhook $}}{}{}\_\discretionary {\unhbox \voidb@x \hbox {\relax \fontsize  {7}{8}\selectfont  $\leftarrow \joinrel  \rhook $}}{}{}table\discretionary {\unhbox \voidb@x \hbox {\relax \fontsize  {7}{8}\selectfont  $\leftarrow \joinrel  \rhook $}}{}{}\_\discretionary {\unhbox \voidb@x \hbox {\relax \fontsize  {7}{8}\selectfont  $\leftarrow \joinrel  \rhook $}}{}{}t}{36}{subsubsection.4.6.2.3}\protected@file@percent }
\newlabel{aritmetique_8hpp_a634f2e2245ac87de466e2810dee4f841}{{4.6.2.3}{36}{\texorpdfstring {symbol\+\_\+table\+\_\+t}{symbol\_table\_t}}{subsubsection.4.6.2.3}{}}
\@writefile{toc}{\contentsline {subsubsection}{\numberline {4.6.2.4}T}{36}{subsubsection.4.6.2.4}\protected@file@percent }
\@writefile{toc}{\contentsline {subsection}{\numberline {4.6.3}Documentation des fonctions}{36}{subsection.4.6.3}\protected@file@percent }
\newlabel{aritmetique_8hpp_a39fe9daa802da54bc524d7e249890fb8}{{4.6.3}{36}{Documentation des fonctions}{subsection.4.6.3}{}}
\@writefile{toc}{\contentsline {subsubsection}{\numberline {4.6.3.1}Evaluate\discretionary {\unhbox \voidb@x \hbox {\relax \fontsize  {7}{8}\selectfont  $\leftarrow \joinrel  \rhook $}}{}{}Arithmetic()}{36}{subsubsection.4.6.3.1}\protected@file@percent }
\gdef \LT@xxx {\LT@entry 
    {3}{34.08463pt}\LT@entry 
    {3}{114.52095pt}}
\@writefile{toc}{\contentsline {section}{\numberline {4.7}R\IeC {\'e}f\IeC {\'e}rence du fichier include/module/gdata.hpp}{37}{section.4.7}\protected@file@percent }
\newlabel{gdata_8hpp}{{4.7}{37}{Référence du fichier include/module/gdata.hpp}{section.4.7}{}}
\@writefile{toc}{\contentsline {subsection}{\numberline {4.7.1}Description d\IeC {\'e}taill\IeC {\'e}e}{38}{subsection.4.7.1}\protected@file@percent }
\@writefile{toc}{\contentsline {subsection}{\numberline {4.7.2}Documentation des macros}{38}{subsection.4.7.2}\protected@file@percent }
\newlabel{gdata_8hpp_a8fe83ac76edc595f6b98cd4a4127aed5}{{4.7.2}{38}{Documentation des macros}{subsection.4.7.2}{}}
\@writefile{toc}{\contentsline {subsubsection}{\numberline {4.7.2.1}E\discretionary {\unhbox \voidb@x \hbox {\relax \fontsize  {7}{8}\selectfont  $\leftarrow \joinrel  \rhook $}}{}{}R\discretionary {\unhbox \voidb@x \hbox {\relax \fontsize  {7}{8}\selectfont  $\leftarrow \joinrel  \rhook $}}{}{}R\discretionary {\unhbox \voidb@x \hbox {\relax \fontsize  {7}{8}\selectfont  $\leftarrow \joinrel  \rhook $}}{}{}OR}{38}{subsubsection.4.7.2.1}\protected@file@percent }
\@writefile{toc}{\contentsline {section}{\numberline {4.8}R\IeC {\'e}f\IeC {\'e}rence du fichier include/module/log.hpp}{38}{section.4.8}\protected@file@percent }
\newlabel{log_8hpp}{{4.8}{38}{Référence du fichier include/module/log.hpp}{section.4.8}{}}
\@writefile{toc}{\contentsline {subsection}{\numberline {4.8.1}Description d\IeC {\'e}taill\IeC {\'e}e}{39}{subsection.4.8.1}\protected@file@percent }
\@writefile{toc}{\contentsline {subsection}{\numberline {4.8.2}Documentation des macros}{40}{subsection.4.8.2}\protected@file@percent }
\newlabel{log_8hpp_a49bce9dafa991fde5616257caa9e3c4a}{{4.8.2}{40}{Documentation des macros}{subsection.4.8.2}{}}
\@writefile{toc}{\contentsline {subsubsection}{\numberline {4.8.2.1}D\discretionary {\unhbox \voidb@x \hbox {\relax \fontsize  {7}{8}\selectfont  $\leftarrow \joinrel  \rhook $}}{}{}E\discretionary {\unhbox \voidb@x \hbox {\relax \fontsize  {7}{8}\selectfont  $\leftarrow \joinrel  \rhook $}}{}{}B\discretionary {\unhbox \voidb@x \hbox {\relax \fontsize  {7}{8}\selectfont  $\leftarrow \joinrel  \rhook $}}{}{}U\discretionary {\unhbox \voidb@x \hbox {\relax \fontsize  {7}{8}\selectfont  $\leftarrow \joinrel  \rhook $}}{}{}G\discretionary {\unhbox \voidb@x \hbox {\relax \fontsize  {7}{8}\selectfont  $\leftarrow \joinrel  \rhook $}}{}{}\_\discretionary {\unhbox \voidb@x \hbox {\relax \fontsize  {7}{8}\selectfont  $\leftarrow \joinrel  \rhook $}}{}{}\discretionary {\unhbox \voidb@x \hbox {\relax \fontsize  {7}{8}\selectfont  $\leftarrow \joinrel  \rhook $}}{}{}E\discretionary {\unhbox \voidb@x \hbox {\relax \fontsize  {7}{8}\selectfont  $\leftarrow \joinrel  \rhook $}}{}{}R\discretionary {\unhbox \voidb@x \hbox {\relax \fontsize  {7}{8}\selectfont  $\leftarrow \joinrel  \rhook $}}{}{}R\discretionary {\unhbox \voidb@x \hbox {\relax \fontsize  {7}{8}\selectfont  $\leftarrow \joinrel  \rhook $}}{}{}OR}{40}{subsubsection.4.8.2.1}\protected@file@percent }
\newlabel{log_8hpp_a4407b4d6eae3ba7fe9538b1242a7e165}{{4.8.2.1}{40}{\texorpdfstring {D\+E\+B\+U\+G\+\_\+\+E\+R\+R\+OR}{DEBUG\_ERROR}}{subsubsection.4.8.2.1}{}}
\@writefile{toc}{\contentsline {subsubsection}{\numberline {4.8.2.2}D\discretionary {\unhbox \voidb@x \hbox {\relax \fontsize  {7}{8}\selectfont  $\leftarrow \joinrel  \rhook $}}{}{}E\discretionary {\unhbox \voidb@x \hbox {\relax \fontsize  {7}{8}\selectfont  $\leftarrow \joinrel  \rhook $}}{}{}B\discretionary {\unhbox \voidb@x \hbox {\relax \fontsize  {7}{8}\selectfont  $\leftarrow \joinrel  \rhook $}}{}{}U\discretionary {\unhbox \voidb@x \hbox {\relax \fontsize  {7}{8}\selectfont  $\leftarrow \joinrel  \rhook $}}{}{}G\discretionary {\unhbox \voidb@x \hbox {\relax \fontsize  {7}{8}\selectfont  $\leftarrow \joinrel  \rhook $}}{}{}\_\discretionary {\unhbox \voidb@x \hbox {\relax \fontsize  {7}{8}\selectfont  $\leftarrow \joinrel  \rhook $}}{}{}\discretionary {\unhbox \voidb@x \hbox {\relax \fontsize  {7}{8}\selectfont  $\leftarrow \joinrel  \rhook $}}{}{}I\discretionary {\unhbox \voidb@x \hbox {\relax \fontsize  {7}{8}\selectfont  $\leftarrow \joinrel  \rhook $}}{}{}N\discretionary {\unhbox \voidb@x \hbox {\relax \fontsize  {7}{8}\selectfont  $\leftarrow \joinrel  \rhook $}}{}{}FO}{40}{subsubsection.4.8.2.2}\protected@file@percent }
\newlabel{log_8hpp_a02736c2650b0ed5f197cae5207ff6e35}{{4.8.2.2}{40}{\texorpdfstring {D\+E\+B\+U\+G\+\_\+\+I\+N\+FO}{DEBUG\_INFO}}{subsubsection.4.8.2.2}{}}
\@writefile{toc}{\contentsline {subsubsection}{\numberline {4.8.2.3}D\discretionary {\unhbox \voidb@x \hbox {\relax \fontsize  {7}{8}\selectfont  $\leftarrow \joinrel  \rhook $}}{}{}E\discretionary {\unhbox \voidb@x \hbox {\relax \fontsize  {7}{8}\selectfont  $\leftarrow \joinrel  \rhook $}}{}{}B\discretionary {\unhbox \voidb@x \hbox {\relax \fontsize  {7}{8}\selectfont  $\leftarrow \joinrel  \rhook $}}{}{}U\discretionary {\unhbox \voidb@x \hbox {\relax \fontsize  {7}{8}\selectfont  $\leftarrow \joinrel  \rhook $}}{}{}G\discretionary {\unhbox \voidb@x \hbox {\relax \fontsize  {7}{8}\selectfont  $\leftarrow \joinrel  \rhook $}}{}{}\_\discretionary {\unhbox \voidb@x \hbox {\relax \fontsize  {7}{8}\selectfont  $\leftarrow \joinrel  \rhook $}}{}{}\discretionary {\unhbox \voidb@x \hbox {\relax \fontsize  {7}{8}\selectfont  $\leftarrow \joinrel  \rhook $}}{}{}M\discretionary {\unhbox \voidb@x \hbox {\relax \fontsize  {7}{8}\selectfont  $\leftarrow \joinrel  \rhook $}}{}{}A\discretionary {\unhbox \voidb@x \hbox {\relax \fontsize  {7}{8}\selectfont  $\leftarrow \joinrel  \rhook $}}{}{}R\discretionary {\unhbox \voidb@x \hbox {\relax \fontsize  {7}{8}\selectfont  $\leftarrow \joinrel  \rhook $}}{}{}K\discretionary {\unhbox \voidb@x \hbox {\relax \fontsize  {7}{8}\selectfont  $\leftarrow \joinrel  \rhook $}}{}{}ER}{40}{subsubsection.4.8.2.3}\protected@file@percent }
\newlabel{log_8hpp_a22ae4c4cebea059bbe99204f8623dc44}{{4.8.2.3}{40}{\texorpdfstring {D\+E\+B\+U\+G\+\_\+\+M\+A\+R\+K\+ER}{DEBUG\_MARKER}}{subsubsection.4.8.2.3}{}}
\@writefile{toc}{\contentsline {subsubsection}{\numberline {4.8.2.4}D\discretionary {\unhbox \voidb@x \hbox {\relax \fontsize  {7}{8}\selectfont  $\leftarrow \joinrel  \rhook $}}{}{}E\discretionary {\unhbox \voidb@x \hbox {\relax \fontsize  {7}{8}\selectfont  $\leftarrow \joinrel  \rhook $}}{}{}B\discretionary {\unhbox \voidb@x \hbox {\relax \fontsize  {7}{8}\selectfont  $\leftarrow \joinrel  \rhook $}}{}{}U\discretionary {\unhbox \voidb@x \hbox {\relax \fontsize  {7}{8}\selectfont  $\leftarrow \joinrel  \rhook $}}{}{}G\discretionary {\unhbox \voidb@x \hbox {\relax \fontsize  {7}{8}\selectfont  $\leftarrow \joinrel  \rhook $}}{}{}\_\discretionary {\unhbox \voidb@x \hbox {\relax \fontsize  {7}{8}\selectfont  $\leftarrow \joinrel  \rhook $}}{}{}\discretionary {\unhbox \voidb@x \hbox {\relax \fontsize  {7}{8}\selectfont  $\leftarrow \joinrel  \rhook $}}{}{}S\discretionary {\unhbox \voidb@x \hbox {\relax \fontsize  {7}{8}\selectfont  $\leftarrow \joinrel  \rhook $}}{}{}U\discretionary {\unhbox \voidb@x \hbox {\relax \fontsize  {7}{8}\selectfont  $\leftarrow \joinrel  \rhook $}}{}{}C\discretionary {\unhbox \voidb@x \hbox {\relax \fontsize  {7}{8}\selectfont  $\leftarrow \joinrel  \rhook $}}{}{}C\discretionary {\unhbox \voidb@x \hbox {\relax \fontsize  {7}{8}\selectfont  $\leftarrow \joinrel  \rhook $}}{}{}E\discretionary {\unhbox \voidb@x \hbox {\relax \fontsize  {7}{8}\selectfont  $\leftarrow \joinrel  \rhook $}}{}{}SS}{40}{subsubsection.4.8.2.4}\protected@file@percent }
\newlabel{log_8hpp_a8a4e4885193c12b840ff3cbedec2451d}{{4.8.2.4}{40}{\texorpdfstring {D\+E\+B\+U\+G\+\_\+\+S\+U\+C\+C\+E\+SS}{DEBUG\_SUCCESS}}{subsubsection.4.8.2.4}{}}
\@writefile{toc}{\contentsline {subsubsection}{\numberline {4.8.2.5}D\discretionary {\unhbox \voidb@x \hbox {\relax \fontsize  {7}{8}\selectfont  $\leftarrow \joinrel  \rhook $}}{}{}E\discretionary {\unhbox \voidb@x \hbox {\relax \fontsize  {7}{8}\selectfont  $\leftarrow \joinrel  \rhook $}}{}{}B\discretionary {\unhbox \voidb@x \hbox {\relax \fontsize  {7}{8}\selectfont  $\leftarrow \joinrel  \rhook $}}{}{}U\discretionary {\unhbox \voidb@x \hbox {\relax \fontsize  {7}{8}\selectfont  $\leftarrow \joinrel  \rhook $}}{}{}G\discretionary {\unhbox \voidb@x \hbox {\relax \fontsize  {7}{8}\selectfont  $\leftarrow \joinrel  \rhook $}}{}{}\_\discretionary {\unhbox \voidb@x \hbox {\relax \fontsize  {7}{8}\selectfont  $\leftarrow \joinrel  \rhook $}}{}{}\discretionary {\unhbox \voidb@x \hbox {\relax \fontsize  {7}{8}\selectfont  $\leftarrow \joinrel  \rhook $}}{}{}W\discretionary {\unhbox \voidb@x \hbox {\relax \fontsize  {7}{8}\selectfont  $\leftarrow \joinrel  \rhook $}}{}{}A\discretionary {\unhbox \voidb@x \hbox {\relax \fontsize  {7}{8}\selectfont  $\leftarrow \joinrel  \rhook $}}{}{}R\discretionary {\unhbox \voidb@x \hbox {\relax \fontsize  {7}{8}\selectfont  $\leftarrow \joinrel  \rhook $}}{}{}N\discretionary {\unhbox \voidb@x \hbox {\relax \fontsize  {7}{8}\selectfont  $\leftarrow \joinrel  \rhook $}}{}{}I\discretionary {\unhbox \voidb@x \hbox {\relax \fontsize  {7}{8}\selectfont  $\leftarrow \joinrel  \rhook $}}{}{}NG}{41}{subsubsection.4.8.2.5}\protected@file@percent }
\newlabel{log_8hpp_ab240226bb68975ee0f31899f188c71a7}{{4.8.2.5}{41}{\texorpdfstring {D\+E\+B\+U\+G\+\_\+\+W\+A\+R\+N\+I\+NG}{DEBUG\_WARNING}}{subsubsection.4.8.2.5}{}}
\@writefile{toc}{\contentsline {subsubsection}{\numberline {4.8.2.6}F\discretionary {\unhbox \voidb@x \hbox {\relax \fontsize  {7}{8}\selectfont  $\leftarrow \joinrel  \rhook $}}{}{}O\discretionary {\unhbox \voidb@x \hbox {\relax \fontsize  {7}{8}\selectfont  $\leftarrow \joinrel  \rhook $}}{}{}R\discretionary {\unhbox \voidb@x \hbox {\relax \fontsize  {7}{8}\selectfont  $\leftarrow \joinrel  \rhook $}}{}{}E\discretionary {\unhbox \voidb@x \hbox {\relax \fontsize  {7}{8}\selectfont  $\leftarrow \joinrel  \rhook $}}{}{}G\discretionary {\unhbox \voidb@x \hbox {\relax \fontsize  {7}{8}\selectfont  $\leftarrow \joinrel  \rhook $}}{}{}R\discretionary {\unhbox \voidb@x \hbox {\relax \fontsize  {7}{8}\selectfont  $\leftarrow \joinrel  \rhook $}}{}{}O\discretionary {\unhbox \voidb@x \hbox {\relax \fontsize  {7}{8}\selectfont  $\leftarrow \joinrel  \rhook $}}{}{}U\discretionary {\unhbox \voidb@x \hbox {\relax \fontsize  {7}{8}\selectfont  $\leftarrow \joinrel  \rhook $}}{}{}N\discretionary {\unhbox \voidb@x \hbox {\relax \fontsize  {7}{8}\selectfont  $\leftarrow \joinrel  \rhook $}}{}{}D\discretionary {\unhbox \voidb@x \hbox {\relax \fontsize  {7}{8}\selectfont  $\leftarrow \joinrel  \rhook $}}{}{}\_\discretionary {\unhbox \voidb@x \hbox {\relax \fontsize  {7}{8}\selectfont  $\leftarrow \joinrel  \rhook $}}{}{}\discretionary {\unhbox \voidb@x \hbox {\relax \fontsize  {7}{8}\selectfont  $\leftarrow \joinrel  \rhook $}}{}{}C\discretionary {\unhbox \voidb@x \hbox {\relax \fontsize  {7}{8}\selectfont  $\leftarrow \joinrel  \rhook $}}{}{}Y\discretionary {\unhbox \voidb@x \hbox {\relax \fontsize  {7}{8}\selectfont  $\leftarrow \joinrel  \rhook $}}{}{}AN}{41}{subsubsection.4.8.2.6}\protected@file@percent }
\newlabel{log_8hpp_a5a8d63e9fa43af8f83e9009a6dabd379}{{4.8.2.6}{41}{\texorpdfstring {F\+O\+R\+E\+G\+R\+O\+U\+N\+D\+\_\+\+C\+Y\+AN}{FOREGROUND\_CYAN}}{subsubsection.4.8.2.6}{}}
\@writefile{toc}{\contentsline {subsubsection}{\numberline {4.8.2.7}F\discretionary {\unhbox \voidb@x \hbox {\relax \fontsize  {7}{8}\selectfont  $\leftarrow \joinrel  \rhook $}}{}{}O\discretionary {\unhbox \voidb@x \hbox {\relax \fontsize  {7}{8}\selectfont  $\leftarrow \joinrel  \rhook $}}{}{}R\discretionary {\unhbox \voidb@x \hbox {\relax \fontsize  {7}{8}\selectfont  $\leftarrow \joinrel  \rhook $}}{}{}E\discretionary {\unhbox \voidb@x \hbox {\relax \fontsize  {7}{8}\selectfont  $\leftarrow \joinrel  \rhook $}}{}{}G\discretionary {\unhbox \voidb@x \hbox {\relax \fontsize  {7}{8}\selectfont  $\leftarrow \joinrel  \rhook $}}{}{}R\discretionary {\unhbox \voidb@x \hbox {\relax \fontsize  {7}{8}\selectfont  $\leftarrow \joinrel  \rhook $}}{}{}O\discretionary {\unhbox \voidb@x \hbox {\relax \fontsize  {7}{8}\selectfont  $\leftarrow \joinrel  \rhook $}}{}{}U\discretionary {\unhbox \voidb@x \hbox {\relax \fontsize  {7}{8}\selectfont  $\leftarrow \joinrel  \rhook $}}{}{}N\discretionary {\unhbox \voidb@x \hbox {\relax \fontsize  {7}{8}\selectfont  $\leftarrow \joinrel  \rhook $}}{}{}D\discretionary {\unhbox \voidb@x \hbox {\relax \fontsize  {7}{8}\selectfont  $\leftarrow \joinrel  \rhook $}}{}{}\_\discretionary {\unhbox \voidb@x \hbox {\relax \fontsize  {7}{8}\selectfont  $\leftarrow \joinrel  \rhook $}}{}{}\discretionary {\unhbox \voidb@x \hbox {\relax \fontsize  {7}{8}\selectfont  $\leftarrow \joinrel  \rhook $}}{}{}G\discretionary {\unhbox \voidb@x \hbox {\relax \fontsize  {7}{8}\selectfont  $\leftarrow \joinrel  \rhook $}}{}{}R\discretionary {\unhbox \voidb@x \hbox {\relax \fontsize  {7}{8}\selectfont  $\leftarrow \joinrel  \rhook $}}{}{}AY}{41}{subsubsection.4.8.2.7}\protected@file@percent }
\newlabel{log_8hpp_ac7e7564b3b0cf8504f5af0f1330d1134}{{4.8.2.7}{41}{\texorpdfstring {F\+O\+R\+E\+G\+R\+O\+U\+N\+D\+\_\+\+G\+R\+AY}{FOREGROUND\_GRAY}}{subsubsection.4.8.2.7}{}}
\@writefile{toc}{\contentsline {subsubsection}{\numberline {4.8.2.8}F\discretionary {\unhbox \voidb@x \hbox {\relax \fontsize  {7}{8}\selectfont  $\leftarrow \joinrel  \rhook $}}{}{}O\discretionary {\unhbox \voidb@x \hbox {\relax \fontsize  {7}{8}\selectfont  $\leftarrow \joinrel  \rhook $}}{}{}R\discretionary {\unhbox \voidb@x \hbox {\relax \fontsize  {7}{8}\selectfont  $\leftarrow \joinrel  \rhook $}}{}{}E\discretionary {\unhbox \voidb@x \hbox {\relax \fontsize  {7}{8}\selectfont  $\leftarrow \joinrel  \rhook $}}{}{}G\discretionary {\unhbox \voidb@x \hbox {\relax \fontsize  {7}{8}\selectfont  $\leftarrow \joinrel  \rhook $}}{}{}R\discretionary {\unhbox \voidb@x \hbox {\relax \fontsize  {7}{8}\selectfont  $\leftarrow \joinrel  \rhook $}}{}{}O\discretionary {\unhbox \voidb@x \hbox {\relax \fontsize  {7}{8}\selectfont  $\leftarrow \joinrel  \rhook $}}{}{}U\discretionary {\unhbox \voidb@x \hbox {\relax \fontsize  {7}{8}\selectfont  $\leftarrow \joinrel  \rhook $}}{}{}N\discretionary {\unhbox \voidb@x \hbox {\relax \fontsize  {7}{8}\selectfont  $\leftarrow \joinrel  \rhook $}}{}{}D\discretionary {\unhbox \voidb@x \hbox {\relax \fontsize  {7}{8}\selectfont  $\leftarrow \joinrel  \rhook $}}{}{}\_\discretionary {\unhbox \voidb@x \hbox {\relax \fontsize  {7}{8}\selectfont  $\leftarrow \joinrel  \rhook $}}{}{}\discretionary {\unhbox \voidb@x \hbox {\relax \fontsize  {7}{8}\selectfont  $\leftarrow \joinrel  \rhook $}}{}{}G\discretionary {\unhbox \voidb@x \hbox {\relax \fontsize  {7}{8}\selectfont  $\leftarrow \joinrel  \rhook $}}{}{}R\discretionary {\unhbox \voidb@x \hbox {\relax \fontsize  {7}{8}\selectfont  $\leftarrow \joinrel  \rhook $}}{}{}E\discretionary {\unhbox \voidb@x \hbox {\relax \fontsize  {7}{8}\selectfont  $\leftarrow \joinrel  \rhook $}}{}{}EN}{41}{subsubsection.4.8.2.8}\protected@file@percent }
\newlabel{log_8hpp_abadd0d9f6ba46167da47ff05d65915ac}{{4.8.2.8}{41}{\texorpdfstring {F\+O\+R\+E\+G\+R\+O\+U\+N\+D\+\_\+\+G\+R\+E\+EN}{FOREGROUND\_GREEN}}{subsubsection.4.8.2.8}{}}
\@writefile{toc}{\contentsline {subsubsection}{\numberline {4.8.2.9}F\discretionary {\unhbox \voidb@x \hbox {\relax \fontsize  {7}{8}\selectfont  $\leftarrow \joinrel  \rhook $}}{}{}O\discretionary {\unhbox \voidb@x \hbox {\relax \fontsize  {7}{8}\selectfont  $\leftarrow \joinrel  \rhook $}}{}{}R\discretionary {\unhbox \voidb@x \hbox {\relax \fontsize  {7}{8}\selectfont  $\leftarrow \joinrel  \rhook $}}{}{}E\discretionary {\unhbox \voidb@x \hbox {\relax \fontsize  {7}{8}\selectfont  $\leftarrow \joinrel  \rhook $}}{}{}G\discretionary {\unhbox \voidb@x \hbox {\relax \fontsize  {7}{8}\selectfont  $\leftarrow \joinrel  \rhook $}}{}{}R\discretionary {\unhbox \voidb@x \hbox {\relax \fontsize  {7}{8}\selectfont  $\leftarrow \joinrel  \rhook $}}{}{}O\discretionary {\unhbox \voidb@x \hbox {\relax \fontsize  {7}{8}\selectfont  $\leftarrow \joinrel  \rhook $}}{}{}U\discretionary {\unhbox \voidb@x \hbox {\relax \fontsize  {7}{8}\selectfont  $\leftarrow \joinrel  \rhook $}}{}{}N\discretionary {\unhbox \voidb@x \hbox {\relax \fontsize  {7}{8}\selectfont  $\leftarrow \joinrel  \rhook $}}{}{}D\discretionary {\unhbox \voidb@x \hbox {\relax \fontsize  {7}{8}\selectfont  $\leftarrow \joinrel  \rhook $}}{}{}\_\discretionary {\unhbox \voidb@x \hbox {\relax \fontsize  {7}{8}\selectfont  $\leftarrow \joinrel  \rhook $}}{}{}\discretionary {\unhbox \voidb@x \hbox {\relax \fontsize  {7}{8}\selectfont  $\leftarrow \joinrel  \rhook $}}{}{}M\discretionary {\unhbox \voidb@x \hbox {\relax \fontsize  {7}{8}\selectfont  $\leftarrow \joinrel  \rhook $}}{}{}A\discretionary {\unhbox \voidb@x \hbox {\relax \fontsize  {7}{8}\selectfont  $\leftarrow \joinrel  \rhook $}}{}{}G\discretionary {\unhbox \voidb@x \hbox {\relax \fontsize  {7}{8}\selectfont  $\leftarrow \joinrel  \rhook $}}{}{}E\discretionary {\unhbox \voidb@x \hbox {\relax \fontsize  {7}{8}\selectfont  $\leftarrow \joinrel  \rhook $}}{}{}N\discretionary {\unhbox \voidb@x \hbox {\relax \fontsize  {7}{8}\selectfont  $\leftarrow \joinrel  \rhook $}}{}{}TA}{41}{subsubsection.4.8.2.9}\protected@file@percent }
\newlabel{log_8hpp_a1ee9d42c453a5b8529e5d492d4abb17f}{{4.8.2.9}{41}{\texorpdfstring {F\+O\+R\+E\+G\+R\+O\+U\+N\+D\+\_\+\+M\+A\+G\+E\+N\+TA}{FOREGROUND\_MAGENTA}}{subsubsection.4.8.2.9}{}}
\@writefile{toc}{\contentsline {subsubsection}{\numberline {4.8.2.10}F\discretionary {\unhbox \voidb@x \hbox {\relax \fontsize  {7}{8}\selectfont  $\leftarrow \joinrel  \rhook $}}{}{}O\discretionary {\unhbox \voidb@x \hbox {\relax \fontsize  {7}{8}\selectfont  $\leftarrow \joinrel  \rhook $}}{}{}R\discretionary {\unhbox \voidb@x \hbox {\relax \fontsize  {7}{8}\selectfont  $\leftarrow \joinrel  \rhook $}}{}{}E\discretionary {\unhbox \voidb@x \hbox {\relax \fontsize  {7}{8}\selectfont  $\leftarrow \joinrel  \rhook $}}{}{}G\discretionary {\unhbox \voidb@x \hbox {\relax \fontsize  {7}{8}\selectfont  $\leftarrow \joinrel  \rhook $}}{}{}R\discretionary {\unhbox \voidb@x \hbox {\relax \fontsize  {7}{8}\selectfont  $\leftarrow \joinrel  \rhook $}}{}{}O\discretionary {\unhbox \voidb@x \hbox {\relax \fontsize  {7}{8}\selectfont  $\leftarrow \joinrel  \rhook $}}{}{}U\discretionary {\unhbox \voidb@x \hbox {\relax \fontsize  {7}{8}\selectfont  $\leftarrow \joinrel  \rhook $}}{}{}N\discretionary {\unhbox \voidb@x \hbox {\relax \fontsize  {7}{8}\selectfont  $\leftarrow \joinrel  \rhook $}}{}{}D\discretionary {\unhbox \voidb@x \hbox {\relax \fontsize  {7}{8}\selectfont  $\leftarrow \joinrel  \rhook $}}{}{}\_\discretionary {\unhbox \voidb@x \hbox {\relax \fontsize  {7}{8}\selectfont  $\leftarrow \joinrel  \rhook $}}{}{}\discretionary {\unhbox \voidb@x \hbox {\relax \fontsize  {7}{8}\selectfont  $\leftarrow \joinrel  \rhook $}}{}{}O\discretionary {\unhbox \voidb@x \hbox {\relax \fontsize  {7}{8}\selectfont  $\leftarrow \joinrel  \rhook $}}{}{}R\discretionary {\unhbox \voidb@x \hbox {\relax \fontsize  {7}{8}\selectfont  $\leftarrow \joinrel  \rhook $}}{}{}A\discretionary {\unhbox \voidb@x \hbox {\relax \fontsize  {7}{8}\selectfont  $\leftarrow \joinrel  \rhook $}}{}{}N\discretionary {\unhbox \voidb@x \hbox {\relax \fontsize  {7}{8}\selectfont  $\leftarrow \joinrel  \rhook $}}{}{}GE}{41}{subsubsection.4.8.2.10}\protected@file@percent }
\newlabel{log_8hpp_aef543dc7ad78ec1b81e744bff6c9c075}{{4.8.2.10}{41}{\texorpdfstring {F\+O\+R\+E\+G\+R\+O\+U\+N\+D\+\_\+\+O\+R\+A\+N\+GE}{FOREGROUND\_ORANGE}}{subsubsection.4.8.2.10}{}}
\gdef \LT@xxxi {\LT@entry 
    {3}{49.31245pt}\LT@entry 
    {3}{85.64967pt}}
\@writefile{toc}{\contentsline {subsubsection}{\numberline {4.8.2.11}F\discretionary {\unhbox \voidb@x \hbox {\relax \fontsize  {7}{8}\selectfont  $\leftarrow \joinrel  \rhook $}}{}{}O\discretionary {\unhbox \voidb@x \hbox {\relax \fontsize  {7}{8}\selectfont  $\leftarrow \joinrel  \rhook $}}{}{}R\discretionary {\unhbox \voidb@x \hbox {\relax \fontsize  {7}{8}\selectfont  $\leftarrow \joinrel  \rhook $}}{}{}E\discretionary {\unhbox \voidb@x \hbox {\relax \fontsize  {7}{8}\selectfont  $\leftarrow \joinrel  \rhook $}}{}{}G\discretionary {\unhbox \voidb@x \hbox {\relax \fontsize  {7}{8}\selectfont  $\leftarrow \joinrel  \rhook $}}{}{}R\discretionary {\unhbox \voidb@x \hbox {\relax \fontsize  {7}{8}\selectfont  $\leftarrow \joinrel  \rhook $}}{}{}O\discretionary {\unhbox \voidb@x \hbox {\relax \fontsize  {7}{8}\selectfont  $\leftarrow \joinrel  \rhook $}}{}{}U\discretionary {\unhbox \voidb@x \hbox {\relax \fontsize  {7}{8}\selectfont  $\leftarrow \joinrel  \rhook $}}{}{}N\discretionary {\unhbox \voidb@x \hbox {\relax \fontsize  {7}{8}\selectfont  $\leftarrow \joinrel  \rhook $}}{}{}D\discretionary {\unhbox \voidb@x \hbox {\relax \fontsize  {7}{8}\selectfont  $\leftarrow \joinrel  \rhook $}}{}{}\_\discretionary {\unhbox \voidb@x \hbox {\relax \fontsize  {7}{8}\selectfont  $\leftarrow \joinrel  \rhook $}}{}{}\discretionary {\unhbox \voidb@x \hbox {\relax \fontsize  {7}{8}\selectfont  $\leftarrow \joinrel  \rhook $}}{}{}R\discretionary {\unhbox \voidb@x \hbox {\relax \fontsize  {7}{8}\selectfont  $\leftarrow \joinrel  \rhook $}}{}{}ED}{42}{subsubsection.4.8.2.11}\protected@file@percent }
\newlabel{log_8hpp_ab702106cf3b3e96750b6845ded4e0299}{{4.8.2.11}{42}{\texorpdfstring {F\+O\+R\+E\+G\+R\+O\+U\+N\+D\+\_\+\+R\+ED}{FOREGROUND\_RED}}{subsubsection.4.8.2.11}{}}
\@writefile{toc}{\contentsline {subsubsection}{\numberline {4.8.2.12}R\discretionary {\unhbox \voidb@x \hbox {\relax \fontsize  {7}{8}\selectfont  $\leftarrow \joinrel  \rhook $}}{}{}E\discretionary {\unhbox \voidb@x \hbox {\relax \fontsize  {7}{8}\selectfont  $\leftarrow \joinrel  \rhook $}}{}{}S\discretionary {\unhbox \voidb@x \hbox {\relax \fontsize  {7}{8}\selectfont  $\leftarrow \joinrel  \rhook $}}{}{}ET}{42}{subsubsection.4.8.2.12}\protected@file@percent }
\newlabel{log_8hpp_a7ce3d6fee94f21c9e3d0ffdd90aadc2e}{{4.8.2.12}{42}{\texorpdfstring {R\+E\+S\+ET}{RESET}}{subsubsection.4.8.2.12}{}}
\@writefile{toc}{\contentsline {subsubsection}{\numberline {4.8.2.13}S\discretionary {\unhbox \voidb@x \hbox {\relax \fontsize  {7}{8}\selectfont  $\leftarrow \joinrel  \rhook $}}{}{}T\discretionary {\unhbox \voidb@x \hbox {\relax \fontsize  {7}{8}\selectfont  $\leftarrow \joinrel  \rhook $}}{}{}Y\discretionary {\unhbox \voidb@x \hbox {\relax \fontsize  {7}{8}\selectfont  $\leftarrow \joinrel  \rhook $}}{}{}L\discretionary {\unhbox \voidb@x \hbox {\relax \fontsize  {7}{8}\selectfont  $\leftarrow \joinrel  \rhook $}}{}{}E\discretionary {\unhbox \voidb@x \hbox {\relax \fontsize  {7}{8}\selectfont  $\leftarrow \joinrel  \rhook $}}{}{}\_\discretionary {\unhbox \voidb@x \hbox {\relax \fontsize  {7}{8}\selectfont  $\leftarrow \joinrel  \rhook $}}{}{}\discretionary {\unhbox \voidb@x \hbox {\relax \fontsize  {7}{8}\selectfont  $\leftarrow \joinrel  \rhook $}}{}{}B\discretionary {\unhbox \voidb@x \hbox {\relax \fontsize  {7}{8}\selectfont  $\leftarrow \joinrel  \rhook $}}{}{}O\discretionary {\unhbox \voidb@x \hbox {\relax \fontsize  {7}{8}\selectfont  $\leftarrow \joinrel  \rhook $}}{}{}LD}{42}{subsubsection.4.8.2.13}\protected@file@percent }
\@writefile{toc}{\contentsline {subsection}{\numberline {4.8.3}Documentation des fonctions}{42}{subsection.4.8.3}\protected@file@percent }
\newlabel{log_8hpp_af4db8d88ba4dc1f5ff2cf1dfd1160e47}{{4.8.3}{42}{Documentation des fonctions}{subsection.4.8.3}{}}
\@writefile{toc}{\contentsline {subsubsection}{\numberline {4.8.3.1}Log\discretionary {\unhbox \voidb@x \hbox {\relax \fontsize  {7}{8}\selectfont  $\leftarrow \joinrel  \rhook $}}{}{}Error()}{42}{subsubsection.4.8.3.1}\protected@file@percent }
\newlabel{log_8hpp_af7b103f090258a8569cd05d802726b0d}{{4.8.3.1}{42}{\texorpdfstring {Log\+Error()}{LogError()}}{table.4.3}{}}
\@writefile{toc}{\contentsline {subsubsection}{\numberline {4.8.3.2}Log\discretionary {\unhbox \voidb@x \hbox {\relax \fontsize  {7}{8}\selectfont  $\leftarrow \joinrel  \rhook $}}{}{}Info()}{42}{subsubsection.4.8.3.2}\protected@file@percent }
\gdef \LT@xxxii {\LT@entry 
    {3}{49.31245pt}\LT@entry 
    {3}{85.64967pt}}
\gdef \LT@xxxiii {\LT@entry 
    {3}{49.31245pt}\LT@entry 
    {3}{85.64967pt}}
\gdef \LT@xxxiv {\LT@entry 
    {3}{49.31245pt}\LT@entry 
    {3}{85.64967pt}}
\gdef \LT@xxxv {\LT@entry 
    {3}{49.31245pt}\LT@entry 
    {3}{85.64967pt}}
\newlabel{log_8hpp_a5d5e8bb226ad6b4b648f013962a6d6cf}{{4.8.3.2}{43}{\texorpdfstring {Log\+Info()}{LogInfo()}}{table.4.4}{}}
\@writefile{toc}{\contentsline {subsubsection}{\numberline {4.8.3.3}Log\discretionary {\unhbox \voidb@x \hbox {\relax \fontsize  {7}{8}\selectfont  $\leftarrow \joinrel  \rhook $}}{}{}Marker()}{43}{subsubsection.4.8.3.3}\protected@file@percent }
\newlabel{log_8hpp_ab2e095f380888b1b6f301da32adc020b}{{4.8.3.3}{43}{\texorpdfstring {Log\+Marker()}{LogMarker()}}{table.4.5}{}}
\@writefile{toc}{\contentsline {subsubsection}{\numberline {4.8.3.4}Log\discretionary {\unhbox \voidb@x \hbox {\relax \fontsize  {7}{8}\selectfont  $\leftarrow \joinrel  \rhook $}}{}{}Success()}{43}{subsubsection.4.8.3.4}\protected@file@percent }
\newlabel{log_8hpp_a032429cc7d0cad047ef5ebaee5db9427}{{4.8.3.4}{43}{\texorpdfstring {Log\+Success()}{LogSuccess()}}{table.4.6}{}}
\@writefile{toc}{\contentsline {subsubsection}{\numberline {4.8.3.5}Log\discretionary {\unhbox \voidb@x \hbox {\relax \fontsize  {7}{8}\selectfont  $\leftarrow \joinrel  \rhook $}}{}{}Warning()}{43}{subsubsection.4.8.3.5}\protected@file@percent }
\@writefile{toc}{\contentsline {section}{\numberline {4.9}R\IeC {\'e}f\IeC {\'e}rence du fichier include/module/typage.hpp}{44}{section.4.9}\protected@file@percent }
\newlabel{typage_8hpp}{{4.9}{44}{Référence du fichier include/module/typage.hpp}{section.4.9}{}}
\@writefile{toc}{\contentsline {subsection}{\numberline {4.9.1}Description d\IeC {\'e}taill\IeC {\'e}e}{45}{subsection.4.9.1}\protected@file@percent }
\@writefile{toc}{\contentsline {subsection}{\numberline {4.9.2}Documentation des macros}{45}{subsection.4.9.2}\protected@file@percent }
\newlabel{typage_8hpp_a2ba17d9aafc960c9d68b89bce5c1c882}{{4.9.2}{45}{Documentation des macros}{subsection.4.9.2}{}}
\@writefile{toc}{\contentsline {subsubsection}{\numberline {4.9.2.1}A\discretionary {\unhbox \voidb@x \hbox {\relax \fontsize  {7}{8}\selectfont  $\leftarrow \joinrel  \rhook $}}{}{}T\discretionary {\unhbox \voidb@x \hbox {\relax \fontsize  {7}{8}\selectfont  $\leftarrow \joinrel  \rhook $}}{}{}T\discretionary {\unhbox \voidb@x \hbox {\relax \fontsize  {7}{8}\selectfont  $\leftarrow \joinrel  \rhook $}}{}{}R\discretionary {\unhbox \voidb@x \hbox {\relax \fontsize  {7}{8}\selectfont  $\leftarrow \joinrel  \rhook $}}{}{}I\discretionary {\unhbox \voidb@x \hbox {\relax \fontsize  {7}{8}\selectfont  $\leftarrow \joinrel  \rhook $}}{}{}B\discretionary {\unhbox \voidb@x \hbox {\relax \fontsize  {7}{8}\selectfont  $\leftarrow \joinrel  \rhook $}}{}{}U\discretionary {\unhbox \voidb@x \hbox {\relax \fontsize  {7}{8}\selectfont  $\leftarrow \joinrel  \rhook $}}{}{}T\discretionary {\unhbox \voidb@x \hbox {\relax \fontsize  {7}{8}\selectfont  $\leftarrow \joinrel  \rhook $}}{}{}E\discretionary {\unhbox \voidb@x \hbox {\relax \fontsize  {7}{8}\selectfont  $\leftarrow \joinrel  \rhook $}}{}{}\_\discretionary {\unhbox \voidb@x \hbox {\relax \fontsize  {7}{8}\selectfont  $\leftarrow \joinrel  \rhook $}}{}{}\discretionary {\unhbox \voidb@x \hbox {\relax \fontsize  {7}{8}\selectfont  $\leftarrow \joinrel  \rhook $}}{}{}M\discretionary {\unhbox \voidb@x \hbox {\relax \fontsize  {7}{8}\selectfont  $\leftarrow \joinrel  \rhook $}}{}{}AX}{45}{subsubsection.4.9.2.1}\protected@file@percent }
\newlabel{typage_8hpp_af536d34dcc134f37113d06b932ffb49d}{{4.9.2.1}{45}{\texorpdfstring {A\+T\+T\+R\+I\+B\+U\+T\+E\+\_\+\+M\+AX}{ATTRIBUTE\_MAX}}{subsubsection.4.9.2.1}{}}
\@writefile{toc}{\contentsline {subsubsection}{\numberline {4.9.2.2}A\discretionary {\unhbox \voidb@x \hbox {\relax \fontsize  {7}{8}\selectfont  $\leftarrow \joinrel  \rhook $}}{}{}T\discretionary {\unhbox \voidb@x \hbox {\relax \fontsize  {7}{8}\selectfont  $\leftarrow \joinrel  \rhook $}}{}{}T\discretionary {\unhbox \voidb@x \hbox {\relax \fontsize  {7}{8}\selectfont  $\leftarrow \joinrel  \rhook $}}{}{}R\discretionary {\unhbox \voidb@x \hbox {\relax \fontsize  {7}{8}\selectfont  $\leftarrow \joinrel  \rhook $}}{}{}I\discretionary {\unhbox \voidb@x \hbox {\relax \fontsize  {7}{8}\selectfont  $\leftarrow \joinrel  \rhook $}}{}{}B\discretionary {\unhbox \voidb@x \hbox {\relax \fontsize  {7}{8}\selectfont  $\leftarrow \joinrel  \rhook $}}{}{}U\discretionary {\unhbox \voidb@x \hbox {\relax \fontsize  {7}{8}\selectfont  $\leftarrow \joinrel  \rhook $}}{}{}T\discretionary {\unhbox \voidb@x \hbox {\relax \fontsize  {7}{8}\selectfont  $\leftarrow \joinrel  \rhook $}}{}{}E\discretionary {\unhbox \voidb@x \hbox {\relax \fontsize  {7}{8}\selectfont  $\leftarrow \joinrel  \rhook $}}{}{}\_\discretionary {\unhbox \voidb@x \hbox {\relax \fontsize  {7}{8}\selectfont  $\leftarrow \joinrel  \rhook $}}{}{}\discretionary {\unhbox \voidb@x \hbox {\relax \fontsize  {7}{8}\selectfont  $\leftarrow \joinrel  \rhook $}}{}{}M\discretionary {\unhbox \voidb@x \hbox {\relax \fontsize  {7}{8}\selectfont  $\leftarrow \joinrel  \rhook $}}{}{}IN}{45}{subsubsection.4.9.2.2}\protected@file@percent }
\newlabel{typage_8hpp_a717bdc5d52ecca2b267f320935dbcab7}{{4.9.2.2}{45}{\texorpdfstring {A\+T\+T\+R\+I\+B\+U\+T\+E\+\_\+\+M\+IN}{ATTRIBUTE\_MIN}}{subsubsection.4.9.2.2}{}}
\@writefile{toc}{\contentsline {subsubsection}{\numberline {4.9.2.3}A\discretionary {\unhbox \voidb@x \hbox {\relax \fontsize  {7}{8}\selectfont  $\leftarrow \joinrel  \rhook $}}{}{}T\discretionary {\unhbox \voidb@x \hbox {\relax \fontsize  {7}{8}\selectfont  $\leftarrow \joinrel  \rhook $}}{}{}T\discretionary {\unhbox \voidb@x \hbox {\relax \fontsize  {7}{8}\selectfont  $\leftarrow \joinrel  \rhook $}}{}{}R\discretionary {\unhbox \voidb@x \hbox {\relax \fontsize  {7}{8}\selectfont  $\leftarrow \joinrel  \rhook $}}{}{}I\discretionary {\unhbox \voidb@x \hbox {\relax \fontsize  {7}{8}\selectfont  $\leftarrow \joinrel  \rhook $}}{}{}B\discretionary {\unhbox \voidb@x \hbox {\relax \fontsize  {7}{8}\selectfont  $\leftarrow \joinrel  \rhook $}}{}{}U\discretionary {\unhbox \voidb@x \hbox {\relax \fontsize  {7}{8}\selectfont  $\leftarrow \joinrel  \rhook $}}{}{}T\discretionary {\unhbox \voidb@x \hbox {\relax \fontsize  {7}{8}\selectfont  $\leftarrow \joinrel  \rhook $}}{}{}E\discretionary {\unhbox \voidb@x \hbox {\relax \fontsize  {7}{8}\selectfont  $\leftarrow \joinrel  \rhook $}}{}{}\_\discretionary {\unhbox \voidb@x \hbox {\relax \fontsize  {7}{8}\selectfont  $\leftarrow \joinrel  \rhook $}}{}{}\discretionary {\unhbox \voidb@x \hbox {\relax \fontsize  {7}{8}\selectfont  $\leftarrow \joinrel  \rhook $}}{}{}T\discretionary {\unhbox \voidb@x \hbox {\relax \fontsize  {7}{8}\selectfont  $\leftarrow \joinrel  \rhook $}}{}{}Y\discretionary {\unhbox \voidb@x \hbox {\relax \fontsize  {7}{8}\selectfont  $\leftarrow \joinrel  \rhook $}}{}{}PE}{45}{subsubsection.4.9.2.3}\protected@file@percent }
\newlabel{typage_8hpp_ac87fa650bc0dcd101b39e15ecdb57477}{{4.9.2.3}{45}{\texorpdfstring {A\+T\+T\+R\+I\+B\+U\+T\+E\+\_\+\+T\+Y\+PE}{ATTRIBUTE\_TYPE}}{subsubsection.4.9.2.3}{}}
\gdef \LT@xxxvi {\LT@entry 
    {3}{37.21646pt}\LT@entry 
    {3}{84.98357pt}}
\@writefile{toc}{\contentsline {subsubsection}{\numberline {4.9.2.4}T\discretionary {\unhbox \voidb@x \hbox {\relax \fontsize  {7}{8}\selectfont  $\leftarrow \joinrel  \rhook $}}{}{}Y\discretionary {\unhbox \voidb@x \hbox {\relax \fontsize  {7}{8}\selectfont  $\leftarrow \joinrel  \rhook $}}{}{}P\discretionary {\unhbox \voidb@x \hbox {\relax \fontsize  {7}{8}\selectfont  $\leftarrow \joinrel  \rhook $}}{}{}E\discretionary {\unhbox \voidb@x \hbox {\relax \fontsize  {7}{8}\selectfont  $\leftarrow \joinrel  \rhook $}}{}{}\_\discretionary {\unhbox \voidb@x \hbox {\relax \fontsize  {7}{8}\selectfont  $\leftarrow \joinrel  \rhook $}}{}{}\discretionary {\unhbox \voidb@x \hbox {\relax \fontsize  {7}{8}\selectfont  $\leftarrow \joinrel  \rhook $}}{}{}D\discretionary {\unhbox \voidb@x \hbox {\relax \fontsize  {7}{8}\selectfont  $\leftarrow \joinrel  \rhook $}}{}{}O\discretionary {\unhbox \voidb@x \hbox {\relax \fontsize  {7}{8}\selectfont  $\leftarrow \joinrel  \rhook $}}{}{}U\discretionary {\unhbox \voidb@x \hbox {\relax \fontsize  {7}{8}\selectfont  $\leftarrow \joinrel  \rhook $}}{}{}B\discretionary {\unhbox \voidb@x \hbox {\relax \fontsize  {7}{8}\selectfont  $\leftarrow \joinrel  \rhook $}}{}{}LE}{46}{subsubsection.4.9.2.4}\protected@file@percent }
\newlabel{typage_8hpp_a929147425bf7969fe1d0e33716d02bc8}{{4.9.2.4}{46}{\texorpdfstring {T\+Y\+P\+E\+\_\+\+D\+O\+U\+B\+LE}{TYPE\_DOUBLE}}{subsubsection.4.9.2.4}{}}
\@writefile{toc}{\contentsline {subsubsection}{\numberline {4.9.2.5}T\discretionary {\unhbox \voidb@x \hbox {\relax \fontsize  {7}{8}\selectfont  $\leftarrow \joinrel  \rhook $}}{}{}Y\discretionary {\unhbox \voidb@x \hbox {\relax \fontsize  {7}{8}\selectfont  $\leftarrow \joinrel  \rhook $}}{}{}P\discretionary {\unhbox \voidb@x \hbox {\relax \fontsize  {7}{8}\selectfont  $\leftarrow \joinrel  \rhook $}}{}{}E\discretionary {\unhbox \voidb@x \hbox {\relax \fontsize  {7}{8}\selectfont  $\leftarrow \joinrel  \rhook $}}{}{}\_\discretionary {\unhbox \voidb@x \hbox {\relax \fontsize  {7}{8}\selectfont  $\leftarrow \joinrel  \rhook $}}{}{}\discretionary {\unhbox \voidb@x \hbox {\relax \fontsize  {7}{8}\selectfont  $\leftarrow \joinrel  \rhook $}}{}{}I\discretionary {\unhbox \voidb@x \hbox {\relax \fontsize  {7}{8}\selectfont  $\leftarrow \joinrel  \rhook $}}{}{}N\discretionary {\unhbox \voidb@x \hbox {\relax \fontsize  {7}{8}\selectfont  $\leftarrow \joinrel  \rhook $}}{}{}T\discretionary {\unhbox \voidb@x \hbox {\relax \fontsize  {7}{8}\selectfont  $\leftarrow \joinrel  \rhook $}}{}{}E\discretionary {\unhbox \voidb@x \hbox {\relax \fontsize  {7}{8}\selectfont  $\leftarrow \joinrel  \rhook $}}{}{}G\discretionary {\unhbox \voidb@x \hbox {\relax \fontsize  {7}{8}\selectfont  $\leftarrow \joinrel  \rhook $}}{}{}ER}{46}{subsubsection.4.9.2.5}\protected@file@percent }
\newlabel{typage_8hpp_a4e4e428e3a6a191834e3ff63bd301866}{{4.9.2.5}{46}{\texorpdfstring {T\+Y\+P\+E\+\_\+\+I\+N\+T\+E\+G\+ER}{TYPE\_INTEGER}}{subsubsection.4.9.2.5}{}}
\@writefile{toc}{\contentsline {subsubsection}{\numberline {4.9.2.6}T\discretionary {\unhbox \voidb@x \hbox {\relax \fontsize  {7}{8}\selectfont  $\leftarrow \joinrel  \rhook $}}{}{}Y\discretionary {\unhbox \voidb@x \hbox {\relax \fontsize  {7}{8}\selectfont  $\leftarrow \joinrel  \rhook $}}{}{}P\discretionary {\unhbox \voidb@x \hbox {\relax \fontsize  {7}{8}\selectfont  $\leftarrow \joinrel  \rhook $}}{}{}E\discretionary {\unhbox \voidb@x \hbox {\relax \fontsize  {7}{8}\selectfont  $\leftarrow \joinrel  \rhook $}}{}{}\_\discretionary {\unhbox \voidb@x \hbox {\relax \fontsize  {7}{8}\selectfont  $\leftarrow \joinrel  \rhook $}}{}{}\discretionary {\unhbox \voidb@x \hbox {\relax \fontsize  {7}{8}\selectfont  $\leftarrow \joinrel  \rhook $}}{}{}S\discretionary {\unhbox \voidb@x \hbox {\relax \fontsize  {7}{8}\selectfont  $\leftarrow \joinrel  \rhook $}}{}{}T\discretionary {\unhbox \voidb@x \hbox {\relax \fontsize  {7}{8}\selectfont  $\leftarrow \joinrel  \rhook $}}{}{}R\discretionary {\unhbox \voidb@x \hbox {\relax \fontsize  {7}{8}\selectfont  $\leftarrow \joinrel  \rhook $}}{}{}I\discretionary {\unhbox \voidb@x \hbox {\relax \fontsize  {7}{8}\selectfont  $\leftarrow \joinrel  \rhook $}}{}{}NG}{46}{subsubsection.4.9.2.6}\protected@file@percent }
\@writefile{toc}{\contentsline {subsection}{\numberline {4.9.3}Documentation des fonctions}{46}{subsection.4.9.3}\protected@file@percent }
\newlabel{typage_8hpp_a6fba9ad6bef730f65a6473920e2dfd26}{{4.9.3}{46}{Documentation des fonctions}{subsection.4.9.3}{}}
\@writefile{toc}{\contentsline {subsubsection}{\numberline {4.9.3.1}Check()}{46}{subsubsection.4.9.3.1}\protected@file@percent }
\newlabel{typage_8hpp_a6404b3b17e5062d342c93797a87063b1}{{4.9.3.1}{46}{\texorpdfstring {Check()}{Check()}}{table.4.8}{}}
\gdef \LT@xxxvii {\LT@entry 
    {3}{37.21646pt}\LT@entry 
    {3}{84.98357pt}}
\gdef \LT@xxxviii {\LT@entry 
    {3}{37.21646pt}\LT@entry 
    {3}{84.98357pt}}
\@writefile{toc}{\contentsline {subsubsection}{\numberline {4.9.3.2}Check\discretionary {\unhbox \voidb@x \hbox {\relax \fontsize  {7}{8}\selectfont  $\leftarrow \joinrel  \rhook $}}{}{}Size()}{47}{subsubsection.4.9.3.2}\protected@file@percent }
\newlabel{typage_8hpp_a8e36258e154dcdeff0cf933a41dcf0f6}{{4.9.3.2}{47}{\texorpdfstring {Check\+Size()}{CheckSize()}}{table.4.9}{}}
\@writefile{toc}{\contentsline {subsubsection}{\numberline {4.9.3.3}Check\discretionary {\unhbox \voidb@x \hbox {\relax \fontsize  {7}{8}\selectfont  $\leftarrow \joinrel  \rhook $}}{}{}Type()}{47}{subsubsection.4.9.3.3}\protected@file@percent }
\newlabel{typage_8hpp_a209dd95b4e4d6eb737596ec9770a62d1}{{4.9.3.3}{47}{\texorpdfstring {Check\+Type()}{CheckType()}}{table.4.10}{}}
\gdef \LT@xxxix {\LT@entry 
    {3}{37.21646pt}\LT@entry 
    {3}{84.98357pt}}
\gdef \LT@xl {\LT@entry 
    {3}{37.21646pt}\LT@entry 
    {3}{84.98357pt}}
\gdef \LT@xli {\LT@entry 
    {3}{34.08463pt}\LT@entry 
    {3}{86.34233pt}}
\@writefile{toc}{\contentsline {subsubsection}{\numberline {4.9.3.4}Is\discretionary {\unhbox \voidb@x \hbox {\relax \fontsize  {7}{8}\selectfont  $\leftarrow \joinrel  \rhook $}}{}{}Smaller\discretionary {\unhbox \voidb@x \hbox {\relax \fontsize  {7}{8}\selectfont  $\leftarrow \joinrel  \rhook $}}{}{}Or\discretionary {\unhbox \voidb@x \hbox {\relax \fontsize  {7}{8}\selectfont  $\leftarrow \joinrel  \rhook $}}{}{}Equal\discretionary {\unhbox \voidb@x \hbox {\relax \fontsize  {7}{8}\selectfont  $\leftarrow \joinrel  \rhook $}}{}{}Than()}{48}{subsubsection.4.9.3.4}\protected@file@percent }
\newlabel{typage_8hpp_abfcb7a3f23770be3943b99d3a0fc33f6}{{4.9.3.4}{48}{\texorpdfstring {Is\+Smaller\+Or\+Equal\+Than()}{IsSmallerOrEqualThan()}}{table.4.11}{}}
\@writefile{toc}{\contentsline {subsubsection}{\numberline {4.9.3.5}Is\discretionary {\unhbox \voidb@x \hbox {\relax \fontsize  {7}{8}\selectfont  $\leftarrow \joinrel  \rhook $}}{}{}Taller\discretionary {\unhbox \voidb@x \hbox {\relax \fontsize  {7}{8}\selectfont  $\leftarrow \joinrel  \rhook $}}{}{}Or\discretionary {\unhbox \voidb@x \hbox {\relax \fontsize  {7}{8}\selectfont  $\leftarrow \joinrel  \rhook $}}{}{}Equal\discretionary {\unhbox \voidb@x \hbox {\relax \fontsize  {7}{8}\selectfont  $\leftarrow \joinrel  \rhook $}}{}{}Than()}{48}{subsubsection.4.9.3.5}\protected@file@percent }
\newlabel{typage_8hpp_a873b1c73a31535259d69bec9c0f946b2}{{4.9.3.5}{48}{\texorpdfstring {Is\+Taller\+Or\+Equal\+Than()}{IsTallerOrEqualThan()}}{table.4.12}{}}
\@writefile{toc}{\contentsline {subsubsection}{\numberline {4.9.3.6}To\discretionary {\unhbox \voidb@x \hbox {\relax \fontsize  {7}{8}\selectfont  $\leftarrow \joinrel  \rhook $}}{}{}Double()}{48}{subsubsection.4.9.3.6}\protected@file@percent }
\gdef \LT@xlii {\LT@entry 
    {3}{34.08463pt}\LT@entry 
    {3}{86.34233pt}}
\newlabel{typage_8hpp_a583e13f46beec29ec6957d7f939a105b}{{4.9.3.6}{49}{\texorpdfstring {To\+Double()}{ToDouble()}}{table.4.13}{}}
\@writefile{toc}{\contentsline {subsubsection}{\numberline {4.9.3.7}To\discretionary {\unhbox \voidb@x \hbox {\relax \fontsize  {7}{8}\selectfont  $\leftarrow \joinrel  \rhook $}}{}{}Integer()}{49}{subsubsection.4.9.3.7}\protected@file@percent }
\@writefile{toc}{\contentsline {chapter}{Index}{51}{section*.36}\protected@file@percent }
