<svg width="10" height="7" viewBox="0 0 10 7" fill="none" xmlns="http://www.w3.org/2000/svg">
<path d="M8.825 6.175L5 2.35834L1.175 6.175L0 5L5 3.33786e-06L10 5L8.825 6.175Z" fill="#242E3F" fill-opacity="0.5"/>
</svg>
