<svg width="24" height="24" viewBox="0 0 24 24" fill="none" xmlns="http://www.w3.org/2000/svg">
<path d="M8.69991 8.56636C8.99815 8.56636 9.23991 8.32535 9.23991 8.02805C9.23991 7.73075 8.99815 7.48975 8.69991 7.48975C8.40168 7.48975 8.15991 7.73075 8.15991 8.02805C8.15991 8.32535 8.40168 8.56636 8.69991 8.56636Z" fill="#024E82" stroke="#024E82" stroke-width="2" stroke-miterlimit="10" stroke-linecap="round" stroke-linejoin="round"/>
<path d="M21.1198 12.7531L13.44 20.4089L3.83984 10.8389V3.18311H11.5197L21.1198 12.7531Z" stroke="#024E82" stroke-width="2" stroke-linecap="round" stroke-linejoin="round"/>
</svg>
