<svg width="50" height="50" viewBox="0 0 50 50" fill="none" xmlns="http://www.w3.org/2000/svg">
<rect width="50" height="50" rx="5" fill="#2EAAEA" fill-opacity="0.1"/>
<mask id="mask0_89:98" style="mask-type:alpha" maskUnits="userSpaceOnUse" x="0" y="0" width="50" height="50">
<rect width="50" height="50" rx="5" fill="#2EAAEA" fill-opacity="0.1"/>
</mask>
<g mask="url(#mask0_89:98)">
<path d="M-10.2887 -511.006H19.9883V-440.862H68.3493V-416.75H-10.2887V-511.006ZM24.056 -363.65C40.3134 -363.65 52.8717 -359.494 61.7311 -351.183C70.5904 -342.872 75.0201 -330.77 75.0201 -314.878C75.0201 -298.986 70.5904 -286.884 61.7311 -278.573C52.8717 -270.262 40.3134 -266.106 24.056 -266.106C7.79872 -266.106 -4.75962 -270.216 -13.619 -278.436C-22.387 -286.747 -26.771 -298.895 -26.771 -314.878C-26.771 -330.861 -22.387 -342.963 -13.619 -351.183C-4.75962 -359.494 7.79872 -363.65 24.056 -363.65ZM24.056 -341.045C17.5714 -341.045 12.6394 -339.081 9.26005 -335.154C5.88072 -331.227 4.19105 -325.929 4.19105 -319.262V-310.494C4.19105 -303.827 5.88072 -298.529 9.26005 -294.602C12.6394 -290.675 17.5714 -288.711 24.056 -288.711C30.5407 -288.711 35.4727 -290.675 38.8521 -294.602C42.3227 -298.529 44.0581 -303.827 44.0581 -310.494V-319.262C44.0581 -325.929 42.3227 -331.227 38.8521 -335.154C35.4727 -339.081 30.5407 -341.045 24.056 -341.045ZM24.6041 -214.65C33.6461 -214.65 41.7747 -213.28 48.9901 -210.54C56.2054 -207.8 61.9137 -203.736 66.1151 -198.347C70.4077 -193.05 72.5541 -186.565 72.5541 -178.893H43.6471C43.6471 -182.82 41.9117 -185.971 38.4411 -188.346C34.9704 -190.812 30.7691 -192.045 25.8371 -192.045C18.7131 -192.045 13.3244 -190.127 9.67105 -186.291C6.01772 -182.546 4.19105 -177.203 4.19105 -170.262V-161.494C4.19105 -154.553 6.01772 -149.164 9.67105 -145.328C13.3244 -141.583 18.7131 -139.711 25.8371 -139.711C30.7691 -139.711 34.9704 -140.853 38.4411 -143.136C41.9117 -145.511 43.6471 -148.525 43.6471 -152.178H22.2751V-171.358H72.5541V-118.75H56.9361L53.922 -128.066C45.3367 -120.759 34.1027 -117.106 20.2201 -117.106C4.60205 -117.106 -7.13428 -121.17 -14.9889 -129.299C-22.8436 -137.519 -26.771 -149.712 -26.771 -165.878C-26.771 -181.861 -22.3413 -193.963 -13.482 -202.183C-4.53128 -210.494 8.16405 -214.65 24.6041 -214.65ZM24.056 -65.6501C40.3134 -65.6501 52.8717 -61.4945 61.7311 -53.1831C70.5904 -44.8718 75.0201 -32.7701 75.0201 -16.8781C75.0201 -0.986123 70.5904 11.1155 61.7311 19.4269C52.8717 27.7382 40.3134 31.8939 24.056 31.8939C7.79872 31.8939 -4.75962 27.7839 -13.619 19.5639C-22.387 11.2525 -26.771 -0.894791 -26.771 -16.8781C-26.771 -32.8615 -22.387 -44.9631 -13.619 -53.1831C-4.75962 -61.4945 7.79872 -65.6501 24.056 -65.6501ZM24.056 -43.0451C17.5714 -43.0451 12.6394 -41.0815 9.26005 -37.1541C5.88072 -33.2268 4.19105 -27.9295 4.19105 -21.2621V-12.4941C4.19105 -5.82679 5.88072 -0.529457 9.26005 3.39788C12.6394 7.32521 17.5714 9.28888 24.056 9.28888C30.5407 9.28888 35.4727 7.32521 38.8521 3.39788C42.3227 -0.529457 44.0581 -5.82679 44.0581 -12.4941V-21.2621C44.0581 -27.9295 42.3227 -33.2268 38.8521 -37.1541C35.4727 -41.0815 30.5407 -43.0451 24.056 -43.0451Z" fill="#4071FF"/>
</g>
</svg>
