<svg width="24" height="24" viewBox="0 0 24 24" fill="none" xmlns="http://www.w3.org/2000/svg">
<path d="M18.5 20H5.5L2.5 23V6C2.5 4.35 3.85 3 5.5 3H18.5C20.15 3 21.5 4.35 21.5 6V17C21.5 18.65 20.15 20 18.5 20Z" fill="#212121"/>
<path d="M11 10H13V15.5H11V10Z" fill="white"/>
<path d="M12 8.5C12.5523 8.5 13 8.05228 13 7.5C13 6.94772 12.5523 6.5 12 6.5C11.4477 6.5 11 6.94772 11 7.5C11 8.05228 11.4477 8.5 12 8.5Z" fill="white"/>
</svg>
