<svg width="25" height="25" viewBox="0 0 25 25" fill="none" xmlns="http://www.w3.org/2000/svg">
<path d="M7.29175 11.458H9.37508V13.5413H7.29175V11.458ZM7.29175 15.6247H9.37508V17.708H7.29175V15.6247ZM11.4584 11.458H13.5417V13.5413H11.4584V11.458ZM11.4584 15.6247H13.5417V17.708H11.4584V15.6247ZM15.6251 11.458H17.7084V13.5413H15.6251V11.458ZM15.6251 15.6247H17.7084V17.708H15.6251V15.6247Z" fill="#686868"/>
<path d="M5.20833 22.9163H19.7917C20.9406 22.9163 21.875 21.982 21.875 20.833V6.24967C21.875 5.10072 20.9406 4.16634 19.7917 4.16634H17.7083V2.08301H15.625V4.16634H9.375V2.08301H7.29167V4.16634H5.20833C4.05937 4.16634 3.125 5.10072 3.125 6.24967V20.833C3.125 21.982 4.05937 22.9163 5.20833 22.9163ZM19.7917 8.33301L19.7927 20.833H5.20833V8.33301H19.7917Z" fill="#686868"/>
</svg>
