<svg width="69" height="69" viewBox="0 0 69 69" fill="none" xmlns="http://www.w3.org/2000/svg">
<path d="M28.6372 8.625C23.3328 8.625 18.8003 10.3177 15.6328 13.3429C12.4653 16.3659 10.7812 20.6677 10.7812 25.5365C10.7812 29.2086 12.1871 32.0376 13.6124 34.5647C15.0355 37.0918 16.4673 39.358 17.25 42.1806C18.1944 45.6586 18.8499 49.818 19.9453 53.2982C20.493 55.0318 21.1507 56.6167 22.1684 57.9471C23.1883 59.2775 24.8055 60.3728 26.6836 60.3728C28.4862 60.3728 30.2802 59.437 31.1988 58.0139C32.1173 56.5908 32.3438 54.9068 32.3438 53.0955C32.3438 50.8724 32.3438 47.403 32.816 44.6732C33.0532 43.3083 33.4564 42.1719 33.8273 41.5725C34.196 40.9752 34.2154 40.9666 34.5 40.9666C34.7868 40.9666 34.8019 40.9666 35.1749 41.5725C35.5436 42.1806 35.949 43.3083 36.184 44.6732C36.6649 47.4008 36.6563 50.8724 36.6563 53.0955C36.6563 54.9068 36.8827 56.5908 37.8012 58.0139C38.7198 59.437 40.5138 60.3728 42.3164 60.3728C44.2031 60.3728 45.8203 59.2861 46.8316 57.9471C47.8407 56.608 48.507 54.9736 49.0547 53.2292C50.1501 49.7425 50.8142 45.5982 51.75 42.1784C52.5327 39.358 53.9645 37.0918 55.3898 34.5668C56.8129 32.0376 58.2188 29.2086 58.2188 25.5365C58.3266 15.7493 50.8746 8.625 41.1024 8.625C38.2648 8.625 34.914 9.67725 34.3642 9.83897C32.6133 9.14897 30.7007 8.625 28.6372 8.625ZM28.6372 12.9375C33.6332 12.9375 39.3516 18.1944 39.3516 18.1944L42.3833 15.0938C42.3833 15.0938 40.9601 13.9725 39.9575 13.1402C40.4124 13.0712 40.8092 12.9375 41.1046 12.9375C48.9102 12.9375 53.9903 17.7632 53.9063 25.4718V25.5365C53.9063 28.1498 53.0136 30.1207 51.6832 32.4796C50.3528 34.8364 48.5566 37.4735 47.5712 41.0356C46.5448 44.7853 45.8893 48.9361 44.9449 51.9527C44.4727 53.4599 43.8905 54.6717 43.3945 55.3208C42.8986 55.9698 42.7369 56.0625 42.3164 56.0625C41.6588 56.0625 41.6588 55.9957 41.441 55.6571C41.221 55.3208 40.9688 54.4281 40.9688 53.0977C40.9688 50.8983 41.0119 47.2542 40.4297 43.9336C40.1343 42.2733 39.7311 40.6733 38.8793 39.2847C38.0298 37.8939 36.404 36.6562 34.5 36.6562C32.596 36.6562 30.9702 37.8939 30.1207 39.2847C29.2689 40.6733 28.8571 42.2733 28.5703 43.9336C27.9881 47.2542 28.0313 50.8983 28.0313 53.0977C28.0313 54.4281 27.779 55.3207 27.559 55.6593C27.3413 55.9957 27.3413 56.0625 26.6836 56.0625C26.2523 56.0625 26.0949 55.9612 25.6055 55.3208C25.116 54.6803 24.5273 53.5181 24.0551 52.0195C23.1128 49.0223 22.4552 44.8263 21.4267 41.0356C20.4413 37.4735 18.6473 34.8364 17.3168 32.4796C15.9864 30.1207 15.0938 28.1585 15.0938 25.5343C15.0938 21.6531 16.3983 18.5955 18.6645 16.4393C20.9307 14.283 24.2147 12.9375 28.6372 12.9375Z" fill="url(#paint0_angular_885_2869)"/>
<defs>
<radialGradient id="paint0_angular_885_2869" cx="0" cy="0" r="1" gradientUnits="userSpaceOnUse" gradientTransform="translate(34.5006 34.4989) rotate(90) scale(25.8739 23.7193)">
<stop stop-color="#4071FF"/>
<stop offset="1" stop-color="#00CFFF"/>
</radialGradient>
</defs>
</svg>
