module gitlab.com/unboundsoftware/eventsourced/mocks

go 1.21

require (
	github.com/sanity-io/litter v1.5.8
	github.com/stretchr/testify v1.10.0
	gitlab.com/unboundsoftware/eventsourced/eventsourced v1.17.0
)

require (
	github.com/davecgh/go-spew v1.1.1 // indirect
	github.com/google/uuid v1.6.0 // indirect
	github.com/pmezard/go-difflib v1.0.0 // indirect
	gopkg.in/yaml.v3 v3.0.1 // indirect
)
