{
    "products": [
        {
            "id": 273947792,
            "name": "Điện thoại AI Samsung Galaxy S24 Ultra 12GB/256GB, Camera 200MP Zoom 100x, S Pen- Vàng- Hàng Chính Hãng",
            "thumbnail_url": "https://salt.tikicdn.com/cache/280x280/ts/product/c1/77/a8/81aeda13c278a2f63f5cd870fd5bbdf0.jpg",
            "price": 26990000,
            "original_price": 0,
            "discount_rate": 22,
            "rating_average": 5,
            "review_count": 3,
            "quantity_sold": {
                "text": "Đã bán 423",
                "value": 423
            }
        },
        {
            "id": 273258830,
            "name": "Điện thoại Samsung Galaxy A05 (4GB/128GB) - Đã kích hoạt bảo hành điện tử - Hàng chính hãng",
            "thumbnail_url": "https://salt.tikicdn.com/cache/280x280/ts/product/d7/46/18/4f555ac569738cd2ec65aa33f8287bdd.png",
            "price": 2590000,
            "original_price": 0,
            "discount_rate": 15,
            "rating_average": 4.7,
            "review_count": 43,
            "quantity_sold": {
                "text": "Đã bán 268",
                "value": 268
            }
        },
        {
            "id": 257682739,
            "name": "Điện thoại Samsung Galaxy A04 (3GB/32GB) - Đã kích hoạt bảo hành điện tử -  Hàng chính hãng",
            "thumbnail_url": "https://salt.tikicdn.com/cache/280x280/ts/product/65/96/3b/ac3a67a68ed098665178b4c57c5e623c.jpg",
            "price": 1999000,
            "original_price": 0,
            "discount_rate": 33,
            "rating_average": 4.5,
            "review_count": 17,
            "quantity_sold": {
                "text": "Đã bán 123",
                "value": 123
            }
        },
        {
            "id": 272273169,
            "name": "Điện thoại Samsung Galaxy M34 5G (8GB/128GB) - Hàng chính hãng",
            "thumbnail_url": "https://salt.tikicdn.com/cache/280x280/ts/product/96/af/90/4ef8546eac102567fdee9ed4500e4b18.jpg",
            "price": 6490000,
            "original_price": 0,
            "discount_rate": 19,
            "rating_average": 0,
            "review_count": 0,
            "quantity_sold": {
                "text": "Đã bán 9",
                "value": 9
            }
        },
        {
            "id": 273951550,
            "name": "Điện Thoại Samsung Galaxy A15 LTE (8GB/128GB)- Đã Kích Hoạt Bảo Hành Điện tử - Hàng Chính Hãng",
            "thumbnail_url": "https://salt.tikicdn.com/cache/280x280/ts/product/6d/75/96/a08845ebcf14285ed5f2507be5ddab23.jpg",
            "price": 4190000,
            "original_price": 0,
            "discount_rate": 16,
            "rating_average": 5,
            "review_count": 11,
            "quantity_sold": {
                "text": "Đã bán 51",
                "value": 51
            }
        },
        {
            "id": 184036446,
            "name": "Apple iPhone 11",
            "thumbnail_url": "https://salt.tikicdn.com/cache/280x280/ts/product/aa/24/e0/d73c22287081d807af0de9cb48a79f3c.jpg",
            "price": 9990000,
            "original_price": 0,
            "discount_rate": 38,
            "rating_average": 4.8,
            "review_count": 2989,
            "quantity_sold": {
                "text": "Đã bán 5k+",
                "value": 13983
            }
        },
        {
            "id": 184059211,
            "name": "Apple iPhone 13",
            "thumbnail_url": "https://salt.tikicdn.com/cache/280x280/ts/product/b7/ba/88/66059a54a3a139d45841d412379b1fe4.jpg",
            "price": 13490000,
            "original_price": 0,
            "discount_rate": 46,
            "rating_average": 5,
            "review_count": 1859,
            "quantity_sold": {
                "text": "Đã bán 5k+",
                "value": 5818
            }
        },
        {
            "id": 57809866,
            "name": "Điện thoại Xiaomi Redmi 9A (2GB/32GB)",
            "thumbnail_url": "https://salt.tikicdn.com/cache/280x280/ts/product/22/34/6c/f2f6ca4edc76d9ba9fbb03ac976c06ae.png",
            "price": 1690000,
            "original_price": 0,
            "discount_rate": 32,
            "rating_average": 4.7,
            "review_count": 850,
            "quantity_sold": {
                "text": "Đã bán 5k+",
                "value": 6195
            }
        },
        {
            "id": 120295859,
            "name": "Điện Thoại Nokia C30 (2GB/32GB) - Hàng Chính Hãng",
            "thumbnail_url": "https://salt.tikicdn.com/cache/280x280/ts/product/5c/57/85/312c7a38df0312e7525a18f61c5a0fbc.jpg",
            "price": 1490000,
            "original_price": 0,
            "discount_rate": 25,
            "rating_average": 4.6,
            "review_count": 220,
            "quantity_sold": {
                "text": "Đã bán 938",
                "value": 938
            }
        },
        {
            "id": 123345348,
            "name": "Apple iPhone 12",
            "thumbnail_url": "https://salt.tikicdn.com/cache/280x280/ts/product/e0/c9/78/e028f9346e1922b0aadc750f272609c3.jpg",
            "price": 11990000,
            "original_price": 0,
            "discount_rate": 29,
            "rating_average": 5,
            "review_count": 1278,
            "quantity_sold": {
                "text": "Đã bán 2.8k",
                "value": 2811
            }
        },
        {
            "id": 274693012,
            "name": "Điện thoại AI Samsung Galaxy S24 Ultra 12GB/256GB, Camera 200MP Zoom 100x, S Pen - Đã Kích Hoạt Điện Tử - Hàng Chính Hãng",
            "thumbnail_url": "https://salt.tikicdn.com/cache/280x280/ts/product/2c/97/51/5b4d91841ef1b2a329e803cde2b293cc.jpg",
            "price": 23990000,
            "original_price": 0,
            "discount_rate": 29,
            "rating_average": 5,
            "review_count": 1,
            "quantity_sold": {
                "text": "Đã bán 1",
                "value": 1
            }
        },
        {
            "id": 274498287,
            "name": "Điện Thoại Samsung Galaxy A55 5G (8GB/128GB)- Hàng Chính Hãng",
            "thumbnail_url": "https://salt.tikicdn.com/cache/280x280/ts/product/f2/d4/dc/d2bc74be1bda3af933bf181d0dfcebe6.jpg",
            "price": 9290000,
            "original_price": 0,
            "discount_rate": 7,
            "rating_average": 5,
            "review_count": 2,
            "quantity_sold": {
                "text": "Đã bán 4",
                "value": 4
            }
        },
        {
            "id": 273258825,
            "name": "Điện thoại Samsung Galaxy A05s (4GB/128GB) - Đã kích hoạt bảo hành điện tử - Hàng chính hãng",
            "thumbnail_url": "https://salt.tikicdn.com/cache/280x280/ts/product/c9/bd/50/34beaa0a13e96332641345316f85f7c8.jpg",
            "price": 3150000,
            "original_price": 0,
            "discount_rate": 20,
            "rating_average": 4.8,
            "review_count": 33,
            "quantity_sold": {
                "text": "Đã bán 181",
                "value": 181
            }
        },
        {
            "id": 274498288,
            "name": "Điện Thoại Samsung Galaxy A35 5G (8GB/128GB)- Hàng Chính Hãng",
            "thumbnail_url": "https://salt.tikicdn.com/cache/280x280/ts/product/56/d8/b0/55a1bcf803e0492546314f1efae2c908.jpg",
            "price": 7590000,
            "original_price": 0,
            "discount_rate": 8,
            "rating_average": 0,
            "review_count": 0,
            "quantity_sold": {
                "text": "Đã bán 8",
                "value": 8
            }
        },
        {
            "id": 270510406,
            "name": "Điện thoại Vivo Y36 (8GB/128GB) - Hàng Chính Hãng - Camera 50MP - Sạc Nhanh 44W",
            "thumbnail_url": "https://salt.tikicdn.com/cache/280x280/ts/product/f1/c2/81/55a8cae03f215bd75dab198181ef799a.png",
            "price": 5190000,
            "original_price": 0,
            "discount_rate": 0,
            "rating_average": 5,
            "review_count": 2,
            "quantity_sold": {
                "text": "Đã bán 3",
                "value": 3
            }
        },
        {
            "id": 121744434,
            "name": "Điện Thoại Xiaomi Redmi 10 4GB/128GB - Hàng Chính Hãng",
            "thumbnail_url": "https://salt.tikicdn.com/cache/280x280/ts/product/bf/ff/d8/b361ab48631a1757ec82c109f8ee835f.jpg",
            "price": 2889000,
            "original_price": 0,
            "discount_rate": 33,
            "rating_average": 4.8,
            "review_count": 48,
            "quantity_sold": {
                "text": "Đã bán 132",
                "value": 132
            }
        },
        {
            "id": 189466001,
            "name": "Điện thoại Xiaomi Redmi 10A (2GB/32GB) - Hàng chính hãng",
            "thumbnail_url": "https://salt.tikicdn.com/cache/280x280/ts/product/67/09/80/e96911f68a37664e0dac06e6de4801a7.jpg",
            "price": 1949000,
            "original_price": 0,
            "discount_rate": 33,
            "rating_average": 1,
            "review_count": 1,
            "quantity_sold": {
                "text": "Đã bán 2",
                "value": 2
            }
        },
        {
            "id": 125590981,
            "name": "Điện thoại Nokia C30 2GB/32GB - Hàng chính hãng",
            "thumbnail_url": "https://salt.tikicdn.com/cache/280x280/ts/product/ae/77/39/dc4d08a8b156a0c2f797f95a1860bc8c.jpg",
            "price": 1550000,
            "original_price": 0,
            "discount_rate": 0,
            "rating_average": 4.7,
            "review_count": 43,
            "quantity_sold": {
                "text": "Đã bán 134",
                "value": 134
            }
        },
        {
            "id": 172329599,
            "name": "Điện thoại Xiaomi Redmi 9A (2GB/32GB) - Hàng chính hãng",
            "thumbnail_url": "https://salt.tikicdn.com/cache/280x280/ts/product/bd/2e/b8/6006994eca7ae21a0d38de2c315f77b1.jpg",
            "price": 1790000,
            "original_price": 0,
            "discount_rate": 19,
            "rating_average": 0,
            "review_count": 0,
            "quantity_sold": {
                "text": "Đã bán 26",
                "value": 26
            }
        },
        {
            "id": 29931445,
            "name": "Ulefone Armor X 5 ( chống nước,chống va đập,pin 5.000mAh ) hàng chính hãng",
            "thumbnail_url": "https://salt.tikicdn.com/cache/280x280/ts/product/db/dc/95/b3035c9a5987661b9579a247bdb9d76a.jpg",
            "price": 3990000,
            "original_price": 0,
            "discount_rate": 0,
            "rating_average": 4.6,
            "review_count": 38,
            "quantity_sold": {
                "text": "Đã bán 137",
                "value": 137
            }
        },
        {
            "id": 272113804,
            "name": "[MỚI] Điện thoại vivo Y17s - Hàng chính hãng - Camera 50MP - Pin 5000 mAh - Sạc nhanh- RAM mở rộng đến 8GB",
            "thumbnail_url": "https://salt.tikicdn.com/cache/280x280/ts/product/c5/a3/56/86b0dbdd05675c725be11e8588d187e6.png",
            "price": 3990000,
            "original_price": 0,
            "discount_rate": 0,
            "rating_average": 5,
            "review_count": 1,
            "quantity_sold": {
                "text": "Đã bán 7",
                "value": 7
            }
        },
        {
            "id": 272909668,
            "name": "[Mới] Điện thoại vivo V29e 5G (8GB/256GB) - Hàng Chính Hãng - Camera Selfie 50 MP - Vòng Sáng Aura 2.0 - Màn hình AMOLED 6.67",
            "thumbnail_url": "https://salt.tikicdn.com/cache/280x280/ts/product/82/91/45/74be276c7c5c8b8ae2e6a5217ce72857.png",
            "price": 8990000,
            "original_price": 0,
            "discount_rate": 0,
            "rating_average": 4,
            "review_count": 1,
            "quantity_sold": {
                "text": "Đã bán 2",
                "value": 2
            }
        },
        {
            "id": 181266509,
            "name": "Điện thoại Ulefone Armor 14 pro (chống nước,chống va đập,pin khủng,pin 10.000mAh,Ram 8Gb,Rom 128Gb)- hàng chính hãng",
            "thumbnail_url": "https://salt.tikicdn.com/cache/280x280/ts/product/cc/02/3a/1d54b42c01e58cfcc866585cb61f7ee6.jpg",
            "price": 5990000,
            "original_price": 0,
            "discount_rate": 0,
            "rating_average": 5,
            "review_count": 4,
            "quantity_sold": {
                "text": "Đã bán 6",
                "value": 6
            }
        },
        {
            "id": 140184098,
            "name": "Điện Thoại Vsmart Bee Lite 2GB/16GB - Hàng Chính Hãng",
            "thumbnail_url": "https://salt.tikicdn.com/cache/280x280/ts/product/3d/fa/0d/a1d998ecb3d2b880f2ed045ef719e088.jpg",
            "price": 999000,
            "original_price": 0,
            "discount_rate": 50,
            "rating_average": 4.3,
            "review_count": 25,
            "quantity_sold": {
                "text": "Đã bán 100",
                "value": 100
            }
        },
        {
            "id": 192859201,
            "name": "Điện thoại Oukitel WP19(chống sốc ,chống nước ,Pin 21000mAh ,Ram 8G ,Rom 256G ,Tầm nhìn ban đêm 64MP ,  Máy ảnh 90Hz ,Điện thoại Helio G95 )-hàng chính hãng",
            "thumbnail_url": "https://salt.tikicdn.com/cache/280x280/ts/product/17/5b/7b/ac1d0110b90e4a4f475051c186783acc.png",
            "price": 9790000,
            "original_price": 0,
            "discount_rate": 0,
            "rating_average": 5,
            "review_count": 2,
            "quantity_sold": {
                "text": "Đã bán 3",
                "value": 3
            }
        },
        {
            "id": 181918564,
            "name": "Điện thoại OUKITEL WP16 (pin 10.600mAh,  Ram 8Gb,Rom 128Gb, màn hình 6,39 in , Android 11, Máy ảnh nhìn ban đêm 20MP, chống nước IP68,chống va đập, hai SIM 4G, NFC..) – hàng chính hãng",
            "thumbnail_url": "https://salt.tikicdn.com/cache/280x280/ts/product/2f/2c/21/513325a975bee29b4b1dbbb0ef769747.jpg",
            "price": 5990000,
            "original_price": 0,
            "discount_rate": 0,
            "rating_average": 0,
            "review_count": 0,
            "quantity_sold": null
        },
        {
            "id": 197966909,
            "name": "Điện Thoại Samsung A04s 4GB/64GB - Hàng Chính Hãng",
            "thumbnail_url": "https://salt.tikicdn.com/cache/280x280/ts/product/ea/8f/3e/1ca9f736cdda1cdd317f23489cc475a0.jpg",
            "price": 2649000,
            "original_price": 0,
            "discount_rate": 34,
            "rating_average": 4.8,
            "review_count": 20,
            "quantity_sold": {
                "text": "Đã bán 86",
                "value": 86
            }
        },
        {
            "id": 155833852,
            "name": "Điện Thoại Masstel Hapi 30 3GB/32GB - Hàng Chính Hãng",
            "thumbnail_url": "https://salt.tikicdn.com/cache/280x280/ts/product/34/b7/7b/23b42cf71be2dadb2c3da04332a0fe07.jpg",
            "price": 1879000,
            "original_price": 0,
            "discount_rate": 21,
            "rating_average": 5,
            "review_count": 2,
            "quantity_sold": {
                "text": "Đã bán 6",
                "value": 6
            }
        },
        {
            "id": 143359355,
            "name": "Điện Thoại Tecno Spark 6 Go 4GB/64GB - Hàng Chính Hãng",
            "thumbnail_url": "https://salt.tikicdn.com/cache/280x280/ts/product/f1/0f/74/534eaff816c2126a7c49608e3b5a41fe.jpg",
            "price": 2079000,
            "original_price": 0,
            "discount_rate": 30,
            "rating_average": 4.8,
            "review_count": 13,
            "quantity_sold": {
                "text": "Đã bán 31",
                "value": 31
            }
        },
        {
            "id": 151463645,
            "name": "Điện thoại Bphone A60 (Ram 6Gb,Rom 128 Gb,màn hình đục lổ FHD 6.7inch , pin 5.000mAh ) - Hàng chính hãng",
            "thumbnail_url": "https://salt.tikicdn.com/cache/280x280/ts/product/53/81/c1/e3931bf82fb3b6f637e5fc6203878e17.png",
            "price": 6490000,
            "original_price": 0,
            "discount_rate": 0,
            "rating_average": 4,
            "review_count": 1,
            "quantity_sold": {
                "text": "Đã bán 1",
                "value": 1
            }
        },
        {
            "id": 193366048,
            "name": "Điện thoại OnePlus 10T 5G - Hàng Chính Hãng",
            "thumbnail_url": "https://salt.tikicdn.com/cache/280x280/ts/product/92/e0/e0/f614498043ec158a71d483658099e6f6.jpg",
            "price": 15990000,
            "original_price": 0,
            "discount_rate": 0,
            "rating_average": 0,
            "review_count": 0,
            "quantity_sold": null
        },
        {
            "id": 158895857,
            "name": "Điện thoại Vivo Y33s (8GB/128GB) - Hàng chính hãng",
            "thumbnail_url": "https://salt.tikicdn.com/cache/280x280/ts/product/44/5d/98/552402fb183ed24fc6053d1799d4c618.jpg",
            "price": 6069000,
            "original_price": 0,
            "discount_rate": 0,
            "rating_average": 5,
            "review_count": 1,
            "quantity_sold": {
                "text": "Đã bán 4",
                "value": 4
            }
        },
        {
            "id": 140144656,
            "name": "Điện thoại Realme C25Y (4GB/128GB) - Hàng chính hãng",
            "thumbnail_url": "https://salt.tikicdn.com/cache/280x280/ts/product/8c/18/91/d8e35540bbad051b6182573802e60a5a.jpg",
            "price": 3599000,
            "original_price": 0,
            "discount_rate": 28,
            "rating_average": 0,
            "review_count": 0,
            "quantity_sold": null
        },
        {
            "id": 147969070,
            "name": "Điện thoại thông minh itel A26 - giá rẻ | 2 Sim 2 Sóng 4G LTE | Màn hình IPS 5.7\" HD+ | RAM 2GB + ROM 32 GB (Hỗ trợ thẻ nhớ 32 GB) | Mở khoá bằng Gương Mặt | Chính Hãng bảo hành 12 tháng| 1 đổi 1 trong 30 ngày",
            "thumbnail_url": "https://salt.tikicdn.com/cache/280x280/ts/product/a4/14/05/a288f7276d63c8b23ecfc73c8375914b.jpg",
            "price": 2390000,
            "original_price": 0,
            "discount_rate": 0,
            "rating_average": 5,
            "review_count": 1,
            "quantity_sold": {
                "text": "Đã bán 7",
                "value": 7
            }
        },
        {
            "id": 196760330,
            "name": "Điện Thoại Vivo T1x 4GB/64GB - Hàng Chính Hãng",
            "thumbnail_url": "https://salt.tikicdn.com/cache/280x280/ts/product/92/f7/ac/5c3a16204d91d37cc2b572cdbc96f8b2.jpg",
            "price": 3299000,
            "original_price": 0,
            "discount_rate": 27,
            "rating_average": 0,
            "review_count": 0,
            "quantity_sold": {
                "text": "Đã bán 4",
                "value": 4
            }
        },
        {
            "id": 37289936,
            "name": "Điện thoại Oukitel WP2 chống nước,chống va đập, pin 10.000 mAh - Hàng chính hãng",
            "thumbnail_url": "https://salt.tikicdn.com/cache/280x280/ts/product/fd/9a/50/d35336c3126729a85f5f4d4dfe24e2c8.png",
            "price": 5490000,
            "original_price": 0,
            "discount_rate": 0,
            "rating_average": 4.3,
            "review_count": 3,
            "quantity_sold": {
                "text": "Đã bán 14",
                "value": 14
            }
        },
        {
            "id": 181216830,
            "name": "Điện thoại ZTE Blade V40 Vita (ZTE 8045) - MH giọt nước HD+ 6.75\" - Pin 6000 mAh sạc nhanh 22.5W -  Bộ nhớ mở rộng (4+2)GB - Hàng chính hãng",
            "thumbnail_url": "https://salt.tikicdn.com/cache/280x280/ts/product/14/cc/b3/1224785fc8f2604497defb76fcf7d5f0.png",
            "price": 4290000,
            "original_price": 0,
            "discount_rate": 0,
            "rating_average": 0,
            "review_count": 0,
            "quantity_sold": null
        },
        {
            "id": 140747649,
            "name": "Điện thoại Realme C11 2021 (4GB/64GB) - Hàng chính hãng",
            "thumbnail_url": "https://salt.tikicdn.com/cache/280x280/ts/product/40/93/b9/6a053b3d067bc57c941775944543aad0.jpg",
            "price": 3790000,
            "original_price": 0,
            "discount_rate": 0,
            "rating_average": 0,
            "review_count": 0,
            "quantity_sold": {
                "text": "Đã bán 1",
                "value": 1
            }
        },
        {
            "id": 274440344,
            "name": "Điện thoại Xiaomi Redmi Note 13 pro (8GB - 128GB) hàng chính hãng - Bảo hành 18 tháng",
            "thumbnail_url": "https://salt.tikicdn.com/cache/280x280/ts/product/88/c1/40/ef753ce8fb3c3b7afbbb04665340ff40.png",
            "price": 6490000,
            "original_price": 0,
            "discount_rate": 4,
            "rating_average": 0,
            "review_count": 0,
            "quantity_sold": null
        },
        {
            "id": 274639765,
            "name": "Điện thoại OPPO A2M 5G 6GB/128GB , Dimensity 6020 , Màn 90Hz , Rom tiếng việt - Hàng chính hãng",
            "thumbnail_url": "https://salt.tikicdn.com/cache/280x280/ts/product/63/bd/3f/fb7658b0316f4a930d29dbd22bbd22fa.jpg",
            "price": 2990000,
            "original_price": 0,
            "discount_rate": 19,
            "rating_average": 0,
            "review_count": 0,
            "quantity_sold": null
        },
        {
            "id": 192348147,
            "name": "Điện thoại Oppo A57 (4GB/64GB) - Hàng chính hãng",
            "thumbnail_url": "https://salt.tikicdn.com/cache/280x280/ts/product/fd/85/18/ca377d0bc0fe919755c2b751b48b6b99.jpg",
            "price": 4284000,
            "original_price": 0,
            "discount_rate": 0,
            "rating_average": 0,
            "review_count": 0,
            "quantity_sold": null
        },
        {
            "id": 262589811,
            "name": "Điện thoại Samsung Galaxy A24 (6GB/128GB) - Hàng chính hãng - ĐÃ KÍCH HOẠT BẢO HÀNH ĐIỆN TỬ",
            "thumbnail_url": "https://salt.tikicdn.com/cache/280x280/ts/product/b5/26/49/e14d94448f5366e2aa021267c62fc2a5.jpg",
            "price": 6084000,
            "original_price": 0,
            "discount_rate": 0,
            "rating_average": 0,
            "review_count": 0,
            "quantity_sold": null
        },
        {
            "id": 245770363,
            "name": "Điện thoại Samsung Galaxy A04e (3GB/32GB) - Hàng chính hãng",
            "thumbnail_url": "https://salt.tikicdn.com/cache/280x280/ts/product/57/38/08/1a245da2ad6361608a7895349c60ee0b.jpg",
            "price": 2325000,
            "original_price": 0,
            "discount_rate": 0,
            "rating_average": 0,
            "review_count": 0,
            "quantity_sold": null
        },
        {
            "id": 249178196,
            "name": "Điện thoại Samsung Galaxy A34 5G 8GB/128GB Xanh - Hàng chính hãng",
            "thumbnail_url": "https://salt.tikicdn.com/cache/280x280/ts/product/b5/f3/39/cbc9a37798590ec00c5767a05730b72c.jpg",
            "price": 7290000,
            "original_price": 0,
            "discount_rate": 14,
            "rating_average": 0,
            "review_count": 0,
            "quantity_sold": null
        },
        {
            "id": 247730209,
            "name": "Điện thoại Samsung Galaxy A34 5G (8GB/128GB) - Hàng chính hãng",
            "thumbnail_url": "https://salt.tikicdn.com/cache/280x280/ts/product/22/ac/1a/6bcf2d746ab39b8044256d2e7f09404e.png",
            "price": 7164000,
            "original_price": 0,
            "discount_rate": 0,
            "rating_average": 0,
            "review_count": 0,
            "quantity_sold": {
                "text": "Đã bán 3",
                "value": 3
            }
        },
        {
            "id": 255866251,
            "name": "Điện Thoại Samsung A14 4GB/128GB - Hàng Chính Hãng",
            "thumbnail_url": "https://salt.tikicdn.com/cache/280x280/ts/product/1d/8f/98/9ef6537d77a38ec6e1f8599d06e58638.jpg",
            "price": 3349000,
            "original_price": 0,
            "discount_rate": 25,
            "rating_average": 0,
            "review_count": 0,
            "quantity_sold": null
        },
        {
            "id": 274191773,
            "name": "Điện thoại ZTE Libero 5G IV - 4GB/128GB Dimensity 700 , Kháng nước IP67 , Sạc nhanh 22,5W - Mới nguyên seal - Hàng nhập khẩu",
            "thumbnail_url": "https://salt.tikicdn.com/cache/280x280/ts/product/81/00/e6/90ead980cb6221148ca246fc9c14e623.jpg",
            "price": 2399000,
            "original_price": 0,
            "discount_rate": 20,
            "rating_average": 5,
            "review_count": 1,
            "quantity_sold": {
                "text": "Đã bán 1",
                "value": 1
            }
        },
        {
            "id": 272555368,
            "name": "XIAOMI 13T 5G (12GB-256GB) - Hàng chính hãng",
            "thumbnail_url": "https://salt.tikicdn.com/cache/280x280/ts/product/ff/fc/fa/3aa585fd2527da4226c9c57db7f0087d.png",
            "price": 11300000,
            "original_price": 0,
            "discount_rate": 6,
            "rating_average": 5,
            "review_count": 1,
            "quantity_sold": {
                "text": "Đã bán 3",
                "value": 3
            }
        },
        {
            "id": 249890023,
            "name": "Điện Thoại Xiaomi Redmi Note 12 Pro 5G 8GB/256GB - Hàng Chính Hãng",
            "thumbnail_url": "https://salt.tikicdn.com/cache/280x280/ts/product/f3/4d/65/07e40a0e40b246a3dfdc571ee31cacdf.png",
            "price": 9000000,
            "original_price": 0,
            "discount_rate": 0,
            "rating_average": 0,
            "review_count": 0,
            "quantity_sold": null
        },
        {
            "id": 213931247,
            "name": "Điện thoại Samsung Galaxy A04 (3GB / 32GB) - Hàng chính hãng - Mới 100% Nguyên Seal - Pin Khủng 5000 mAh - Bảo Hành 12 Tháng",
            "thumbnail_url": "https://salt.tikicdn.com/cache/280x280/ts/product/6a/d2/4b/fdcd9917242118e899d02b07cf7ddd48.png",
            "price": 2400000,
            "original_price": 0,
            "discount_rate": 0,
            "rating_average": 0,
            "review_count": 0,
            "quantity_sold": null
        },
        {
            "id": 273411988,
            "name": "Điện thoại Xiaomi Redmi 13C (6+128GB) | 6.74\" 90Hz| Media Tek Helio G85| 5000mAh - Hàng chính hãng",
            "thumbnail_url": "https://salt.tikicdn.com/cache/280x280/ts/product/8e/20/64/e72aa024ec2fa3a2fcacbe4c995b76e5.jpg",
            "price": 3090000,
            "original_price": 0,
            "discount_rate": 11,
            "rating_average": 0,
            "review_count": 0,
            "quantity_sold": {
                "text": "Đã bán 1",
                "value": 1
            }
        },
        {
            "id": 274544634,
            "name": "Điện thoại Redmi Note 12R 5G 6/128GB Snapdragon 4 Gen 2, Rom Quốc tế có sẳn Tiếng việt - Hàng nhập khẩu",
            "thumbnail_url": "https://salt.tikicdn.com/cache/280x280/ts/product/43/b8/49/e2fc95922f52f6b546b3159e2e64454d.jpg",
            "price": 3090000,
            "original_price": 0,
            "discount_rate": 14,
            "rating_average": 0,
            "review_count": 0,
            "quantity_sold": {
                "text": "Đã bán 2",
                "value": 2
            }
        }
    ]
}