"Id","SalePrice"
1461,118192.142404539
1462,158065.930721209
1463,176282.395873219
1464,189532.0359586
1465,195298.117436177
1466,163635.060029865
1467,171607.055675639
1468,160209.639464136
1469,189752.17138905
1470,117870.455504403
1471,181334.319680794
1472,93829.4810934512
1473,91383.2773646517
1474,143655.001590933
1475,100565.685733305
1476,333396.171301418
1477,244618.072591449
1478,274229.00314102
1479,281291.926749486
1480,415834.278291895
1481,314345.374626869
1482,214097.527010587
1483,176456.603192247
1484,164600.613090604
1485,186954.153309865
1486,190250.213927279
1487,306631.042915572
1488,229487.525407992
1489,190433.831807479
1490,224070.321533855
1491,193890.90214301
1492,93034.6588927108
1493,182646.963651533
1494,283962.276214308
1495,276061.528066216
1496,222415.814521355
1497,173039.822364496
1498,160762.904735748
1499,158624.636700036
1500,155738.201172471
1501,168619.332477916
1502,145845.314204626
1503,262356.944800903
1504,232744.628763865
1505,217371.099542152
1506,190125.613205084
1507,237906.511027631
1508,202666.185856032
1509,156052.001792366
1510,142541.148091292
1511,142267.571536471
1512,169271.064275178
1513,141092.756637864
1514,151711.793617361
1515,189083.215125193
1516,154701.807271707
1517,173135.789426353
1518,134838.606849176
1519,201736.089116488
1520,129356.101865572
1521,128927.631148295
1522,173083.73355432
1523,113607.741344266
1524,122889.902531904
1525,118183.524347633
1526,118945.461121548
1527,107033.736807009
1528,138376.688348497
1529,147738.172011962
1530,177153.941300087
1531,109917.085873821
1532,102687.58566022
1533,153930.377475267
1534,123505.772860278
1535,149741.429825603
1536,108274.437760018
1537,71610.0436118469
1538,151482.223875219
1539,188914.415909637
1540,99400.7334437291
1541,137510.589917834
1542,137679.508047521
1543,192045.991947791
1544,91489.9339884644
1545,116433.991643296
1546,132075.293269542
1547,135133.056327555
1548,134155.652750204
1549,118939.259708297
1550,128634.920893666
1551,109347.637461082
1552,133960.772405072
1553,150046.182525876
1554,120058.792456149
1555,161142.820280211
1556,89884.4517126339
1557,107126.372377806
1558,94404.9248188058
1559,84108.4967826277
1560,132215.798161229
1561,130645.706641614
1562,130592.852915951
1563,120689.470117274
1564,157705.67663835
1565,149590.952823896
1566,232880.299244315
1567,75991.7859405422
1568,232858.427186996
1569,137327.275390309
1570,141827.73804108
1571,124772.395443551
1572,139410.32072099
1573,217464.194859436
1574,129308.96468775
1575,217827.995778132
1576,241389.441905892
1577,174240.251119229
1578,141732.058146594
1579,147787.086207509
1580,186281.247461059
1581,158060.495625875
1582,126836.776027379
1583,278902.953757514
1584,209221.014910547
1585,138285.256977326
1586,68045.2535498255
1587,101797.674310154
1588,148588.749668001
1589,96570.7531187188
1590,134650.211490838
1591,93085.5799789677
1592,117779.194343677
1593,118799.479797316
1594,131381.123049015
1595,109965.963477641
1596,228707.570157561
1597,183442.570415191
1598,224945.318645562
1599,160873.638596286
1600,164906.133504294
1601,67751.456538139
1602,102221.920013502
1603,76639.3585490727
1604,252811.247917958
1605,234863.955419023
1606,167951.386352604
1607,167913.632122387
1608,216794.715909847
1609,178269.387390268
1610,149798.734588976
1611,140518.471107458
1612,164153.372201783
1613,159796.661590186
1614,114712.087376178
1615,89825.1457658789
1616,73857.3345248778
1617,83842.472094967
1618,119539.610297374
1619,135932.636481889
1620,163796.591003504
1621,134571.702349081
1622,138825.251250171
1623,249617.734113693
1624,207642.273231777
1625,109345.856012256
1626,163949.641480715
1627,178533.02085504
1628,261406.879030694
1629,176733.651550918
1630,326426.820487368
1631,231828.646220946
1632,247681.389659696
1633,167929.515502006
1634,180129.656802815
1635,171116.517570693
1636,151043.105438558
1637,197396.988039032
1638,180744.296892028
1639,180536.384712836
1640,242566.09375804
1641,176557.243621961
1642,231832.027997646
1643,211221.343365579
1644,224736.89478999
1645,195409.733113631
1646,154887.972755078
1647,151324.522535029
1648,130815.947372144
1649,140603.310385095
1650,109390.596084824
1651,119393.449033492
1652,92202.6351068538
1653,92204.4017799209
1654,139560.848485784
1655,137461.367843274
1656,139574.559757422
1657,143065.384969536
1658,141665.411518492
1659,110117.89780485
1660,148312.327541372
1661,392131.671319209
1662,350222.11514823
1663,334350.488495017
1664,441449.185564743
1665,272762.815206411
1666,310267.737342567
1667,340752.423372284
1668,300127.105311287
1669,282872.446280115
1670,303230.86769388
1671,252616.254706044
1672,372885.072838322
1673,284319.63182884
1674,234942.169689617
1675,194983.54547328
1676,195507.239885986
1677,221527.0045743
1678,409913.593630458
1679,346803.382740801
1680,302807.269852628
1681,229960.008543662
1682,295887.998682741
1683,184754.751917627
1684,170283.146196131
1685,170117.115105178
1686,169568.901698176
1687,166589.514201476
1688,189372.603639911
1689,187484.549839984
1690,190315.272996277
1691,180832.073678933
1692,243143.113803043
1693,168647.343618794
1694,176388.564472233
1695,158589.226208353
1696,256304.620663836
1697,165510.104491554
1698,328438.491460184
1699,300550.757888064
1700,243975.762617535
1701,263400.620350574
1702,238207.742714102
1703,239626.122922169
1704,262775.164881614
1705,228681.790824898
1706,377202.19057984
1707,204881.587447327
1708,198051.609905029
1709,255755.978411138
1710,216005.771692631
1711,254090.486578934
1712,249104.776654638
1713,251361.134776788
1714,214631.493107338
1715,203770.265517195
1716,172433.408238263
1717,171323.362435401
1718,138205.516203833
1719,206024.083180092
1720,221717.176246535
1721,151177.983796859
1722,125670.94107946
1723,146109.443196348
1724,198880.136084327
1725,228271.242836398
1726,181858.029281266
1727,151429.237392685
1728,163182.232678387
1729,160383.909447215
1730,154837.928729037
1731,122729.854465013
1732,119139.016036963
1733,103196.292005228
1734,113827.120143599
1735,114380.59481683
1736,98816.7208056733
1737,278113.658843087
1738,250444.981619394
1739,229831.46991452
1740,212933.708327686
1741,182179.180410753
1742,166731.543779525
1743,171587.316275482
1744,280794.603232125
1745,214522.572837147
1746,190361.996082679
1747,212392.435844384
1748,220199.574483723
1749,145531.953548184
1750,127650.298178614
1751,239901.656698343
1752,116819.15902245
1753,149008.097653114
1754,191398.226968633
1755,167398.796147579
1756,125676.076720207
1757,115382.621183643
1758,140134.575842894
1759,159441.567844974
1760,162440.503386797
1761,145714.468888595
1762,170998.300275905
1763,183587.485946758
1764,117173.532322384
1765,160374.114226626
1766,181474.250577648
1767,221657.129761662
1768,138430.87089029
1769,167207.980977299
1770,150519.172550251
1771,124351.285197541
1772,136197.574028853
1773,117939.749727936
1774,146844.018953102
1775,141086.519135655
1776,118229.970325036
1777,105095.045050901
1778,139796.437540698
1779,112011.621419783
1780,172758.945797513
1781,128283.435260281
1782,81266.855150269
1783,141669.7932069
1784,104439.28903178
1785,111986.517914333
1786,141022.246853509
1787,156195.727204058
1788,60513.6325638161
1789,91754.7266445482
1790,77534.3549008285
1791,177882.406464383
1792,155207.102374536
1793,132421.018666144
1794,154108.695699165
1795,133169.010409343
1796,115684.149975878
1797,112865.303351935
1798,117070.671941746
1799,110256.368752029
1800,132215.145359871
1801,127783.390165541
1802,132230.251897149
1803,145360.32985697
1804,142879.274658789
1805,134298.640127691
1806,132048.240357018
1807,137802.525636075
1808,124974.659249036
1809,121415.577133122
1810,136851.886308335
1811,98581.1530081619
1812,97286.8819580988
1813,117255.962380038
1814,91666.7819555195
1815,55159.4379523853
1816,98611.1914902667
1817,106539.846100933
1818,144444.718591127
1819,127787.948260714
1820,71269.5124153308
1821,112286.210401631
1822,144615.331190822
1823,50468.5211975292
1824,149580.888749136
1825,132650.579499363
1826,104507.723085815
1827,101174.835728412
1828,135297.540678675
1829,127939.764841989
1830,143619.016127899
1831,147963.539221171
1832,70931.8198270764
1833,134495.965873223
1834,114682.013224754
1835,131408.630641604
1836,121075.112820683
1837,86060.987002161
1838,123670.21779039
1839,99379.7162699786
1840,156271.926871022
1841,150688.362750639
1842,91653.3408309902
1843,128203.11718369
1844,138110.893824258
1845,144140.712842247
1846,150426.845139652
1847,164108.012066897
1848,47834.2972265558
1849,102840.161174573
1850,114851.178229243
1851,151928.873943276
1852,120713.200393554
1853,127146.216301205
1854,161346.587106908
1855,151885.658352229
1856,218688.759726674
1857,134675.53077213
1858,132724.962269725
1859,120237.471919806
1860,143771.956973465
1861,118328.94560209
1862,285093.529454506
1863,266780.601778045
1864,266865.913179453
1865,303956.540574701
1866,279991.004708632
1867,212740.49675738
1868,268373.27166149
1869,193863.430396207
1870,213238.608488674
1871,234403.491922664
1872,172155.633263944
1873,237486.2858683
1874,144923.683641713
1875,196644.707752083
1876,192480.318052069
1877,202393.744123292
1878,196853.280871007
1879,129172.571276765
1880,130160.362050809
1881,230698.988137148
1882,237410.139442931
1883,180084.51818183
1884,197209.497630797
1885,224748.17581723
1886,253989.163384594
1887,206696.214807173
1888,250868.141880963
1889,168457.129500445
1890,119214.477763538
1891,134801.600105106
1892,88264.6879742179
1893,122687.213296094
1894,132030.251311081
1895,138687.568789256
1896,122560.948368769
1897,114306.08945098
1898,108457.820918677
1899,173303.917113984
1900,151004.355018853
1901,163004.423045838
1902,150282.924651277
1903,204296.236666104
1904,141945.614524325
1905,203211.331947634
1906,161775.45935187
1907,210109.036935086
1908,108044.043876625
1909,127070.276568596
1910,115324.609974306
1911,218500.311431709
1912,328382.922450017
1913,138129.579452196
1914,62277.588835132
1915,270894.817621928
1916,56778.854817846
1917,236310.2515603
1918,136359.314221771
1919,176932.503447471
1920,159090.896458165
1921,323485.913451072
1922,277544.432037723
1923,233707.385141422
1924,231754.326978157
1925,193088.245345479
1926,322444.297305372
1927,132610.451902075
1928,151984.285773263
1929,128638.538826704
1930,130796.528513223
1931,138054.241535556
1932,136477.191091671
1933,165951.908214888
1934,172390.272760534
1935,164667.076082096
1936,186161.395470511
1937,175615.461230596
1938,170919.629594516
1939,245037.404733214
1940,192524.919778213
1941,166456.864867657
1942,183817.446967706
1943,218588.085565927
1944,336020.901115632
1945,356913.701904791
1946,148819.083511768
1947,299193.819152657
1948,168692.863224259
1949,232930.623533044
1950,181452.74195479
1951,237905.459269473
1952,203146.724403555
1953,165756.96034399
1954,184892.468541079
1955,135840.842100527
1956,281790.424689257
1957,154148.684662864
1958,271723.875654995
1959,147731.074787416
1960,115179.482631242
1961,120531.354712117
1962,96736.679939158
1963,104019.004098956
1964,103391.65377449
1965,140608.349959183
1966,131270.980437744
1967,276324.74982087
1968,365998.197304608
1969,341391.84949188
1970,363652.635502263
1971,416149.95140035
1972,341405.919123318
1973,270893.252851792
1974,301852.973318484
1975,495435.7007112
1976,260487.275012516
1977,327733.099096818
1978,324723.054307999
1979,312710.153663388
1980,215370.46577763
1981,306610.279929798
1982,221313.480171331
1983,215372.471055891
1984,171024.72899875
1985,213807.903008657
1986,206499.396480397
1987,174389.529756145
1988,170064.05917803
1989,189603.796460557
1990,207043.456607588
1991,229064.15396659
1992,208917.609248597
1993,162442.173997208
1994,217912.291663373
1995,182204.863322117
1996,247356.325056567
1997,286556.970754575
1998,297485.514165465
1999,263988.518559834
2000,299602.713207163
2001,280814.688747554
2002,233317.571280309
2003,255347.866501086
2004,279311.37282009
2005,210860.855500018
2006,217718.232364512
2007,245315.335104712
2008,211101.100896788
2009,194236.275349707
2010,190823.433579028
2011,140027.741623111
2012,167210.722510507
2013,172351.742274199
2014,180886.471810305
2015,199810.103553133
2016,185821.441162933
2017,190079.503028909
2018,117950.032967692
2019,131688.175263908
2020,106481.094363549
2021,91373.0683530542
2022,195433.920162324
2023,145145.173887335
2024,263667.057587747
2025,334606.805419146
2026,174383.452671411
2027,156501.249747281
2028,146017.103779578
2029,165429.534881581
2030,255557.157935863
2031,220795.440783426
2032,230023.04160712
2033,239026.213572662
2034,169615.260179753
2035,217637.125233653
2036,196324.592668467
2037,198620.027633624
2038,303662.098338454
2039,228146.30902625
2040,278987.638638797
2041,286748.269534351
2042,203331.538231048
2043,175088.241669847
2044,160850.644942317
2045,200674.758815183
2046,142451.258295784
2047,143474.939332175
2048,137369.653542931
2049,145034.391131326
2050,165519.794255498
2051,102922.846271577
2052,124530.566483344
2053,144939.183032783
2054,91267.0809038425
2055,154347.620825594
2056,149412.044535526
2057,112485.56427485
2058,205341.715515454
2059,135111.75305476
2060,167035.450040475
2061,166379.575739853
2062,125547.123826656
2063,119589.251965171
2064,136450.168232111
2065,119576.735708825
2066,165712.58887179
2067,111242.254529373
2068,145714.772223735
2069,80860.665261596
2070,114741.538868007
2071,83699.0295024969
2072,140074.199995137
2073,134690.454829063
2074,173094.648778717
2075,148064.037283296
2076,110595.151519267
2077,157496.031531707
2078,125973.332332097
2079,133122.079201425
2080,121172.499810139
2081,124160.968775732
2082,130930.545996351
2083,144053.576026302
2084,108383.009369588
2085,122054.778089199
2086,122879.147302636
2087,128658.287924103
2088,99766.2853172998
2089,78426.140712447
2090,132613.217326018
2091,111718.632603236
2092,126225.620778144
2093,122583.749120813
2094,108631.50834412
2095,139476.155317747
2096,84427.3052813232
2097,101050.62873371
2098,140629.562205373
2099,52890.7102507371
2100,80270.324589003
2101,114135.345058112
2102,126228.366957373
2103,103429.037704475
2104,141880.329855927
2105,129948.551956534
2106,64455.8039946147
2107,179713.963798947
2108,117109.200887599
2109,111037.177340983
2110,127876.844640442
2111,141516.44921364
2112,141169.391081177
2113,125271.04554389
2114,130291.979710684
2115,160960.072147834
2116,116560.996253477
2117,146641.312492035
2118,115332.429537449
2119,120424.085433235
2120,120810.052669946
2121,89260.8624170335
2122,115498.790621286
2123,80792.3709442465
2124,162735.305287057
2125,126551.131008278
2126,151380.174158951
2127,160033.63668618
2128,125511.45296206
2129,80044.8925820502
2130,127969.138328477
2131,149118.10322561
2132,119638.902491752
2133,108715.229218316
2134,117353.34865642
2135,85377.8476400431
2136,81571.7059642398
2137,98846.0425742595
2138,135547.649145338
2139,149658.82168613
2140,140854.222705088
2141,157699.619853597
2142,121402.708046627
2143,147692.829429317
2144,113846.095650967
2145,139652.662486773
2146,161967.022531091
2147,144476.6841312
2148,145169.51078785
2149,147970.247723698
2150,228869.813148984
2151,108922.005895041
2152,171955.008460271
2153,157013.339787796
2154,108873.168999592
2155,132213.84401867
2156,238186.616870226
2157,218116.812566491
2158,228455.588580181
2159,216953.360015263
2160,182055.981154373
2161,230198.976891712
2162,320964.872013081
2163,322259.237534863
2164,241841.387051092
2165,206284.099884899
2166,152252.205987045
2167,210161.081563538
2168,194611.847352877
2169,188426.881795591
2170,209710.328390983
2171,150183.613724582
2172,135749.741047297
2173,168534.028227871
2174,218395.027292233
2175,277576.508040502
2176,274998.698186032
2177,229595.3033299
2178,210258.048219064
2179,137917.092891881
2180,210558.502594375
2181,193409.59107761
2182,219449.041076981
2183,189811.647125814
2184,117921.876702297
2185,123344.415632372
2186,145065.113127322
2187,151389.547405126
2188,151574.437706776
2189,292035.113031381
2190,79633.2616712453
2191,82265.2442986393
2192,90835.4823192856
2193,108385.369564681
2194,107227.943513568
2195,98826.9602647058
2196,97223.6110739847
2197,122589.790616355
2198,153001.187595719
2199,184293.532437319
2200,144698.676443515
2201,141190.212344385
2202,216305.019318653
2203,133059.085988509
2204,174543.77352006
2205,121790.26911719
2206,143090.27978991
2207,206298.347281203
2208,267847.148043628
2209,237700.86821099
2210,116642.009752806
2211,105028.314055738
2212,109513.017447653
2213,97297.7746009203
2214,125144.865122236
2215,94656.6805076199
2216,141194.173217911
2217,58386.0559958379
2218,83562.6874606694
2219,85609.2359863114
2220,70333.2592410722
2221,273480.658963523
2222,254651.042036205
2223,268431.895825544
2224,200380.366170597
2225,125521.058969472
2226,174943.46604501
2227,186651.479392382
2228,247779.674055454
2229,247780.981540235
2230,148600.682683302
2231,211262.812265662
2232,173605.845095297
2233,176484.621632613
2234,227409.299313508
2235,207980.317518616
2236,248447.408145233
2237,278778.243827669
2238,193885.827870365
2239,113581.933752983
2240,149116.855297688
2241,148544.50884162
2242,110659.655828706
2243,127320.685270524
2244,105096.500804367
2245,91813.5879430086
2246,143924.995435094
2247,109868.045069215
2248,120488.769613537
2249,118384.067998702
2250,125892.881123922
2251,97742.0615653017
2252,177321.945303023
2253,150563.556925494
2254,171913.113386171
2255,181092.625577724
2256,168019.152123837
2257,199670.140810603
2258,158660.70716476
2259,167132.326885567
2260,141006.584218261
2261,196914.781010236
2262,213516.812805015
2263,347284.310014013
2264,456990.141015979
2265,166402.663796154
2266,287686.329162207
2267,344629.82005554
2268,400842.261220913
2269,150585.833864374
2270,190472.101496844
2271,207881.620554311
2272,197793.425844197
2273,156154.941355722
2274,176885.807886661
2275,163215.211188946
2276,191377.227688847
2277,181756.025453299
2278,143260.037223575
2279,124209.671081455
2280,118273.653878792
2281,164296.667156779
2282,179698.48526723
2283,107139.588137571
2284,109457.273706986
2285,138105.97374023
2286,123224.699710959
2287,330781.040875172
2288,265862.899362627
2289,347448.058943182
2290,415792.55795614
2291,311865.576904288
2292,388958.769906906
2293,435867.337914457
2294,365963.518967915
2295,441522.328989912
2296,278401.68266089
2297,318648.615815935
2298,313023.005818903
2299,324838.713288348
2300,307779.165339394
2301,294421.366440667
2302,246296.482785047
2303,247278.622707141
2304,253524.021002992
2305,199651.440463114
2306,194608.049594062
2307,204105.96028641
2308,224490.45794077
2309,268569.105395143
2310,223351.414004923
2311,196450.729595886
2312,174823.18105196
2313,167023.975320807
2314,176586.903485598
2315,175414.966923992
2316,206179.908665907
2317,190351.631115509
2318,175764.397941674
2319,179720.539483978
2320,181463.131753724
2321,230289.836955525
2322,182638.560896106
2323,196144.982270869
2324,175770.778323727
2325,218106.543713891
2326,171113.168209214
2327,199710.221927501
2328,212026.514532826
2329,186796.268773137
2330,176556.139499225
2331,330821.155655113
2332,363339.37189061
2333,304067.324782053
2334,255193.707369723
2335,271279.7005153
2336,286036.627235744
2337,195720.880026401
2338,252534.7286049
2339,219198.31815114
2340,371342.020283198
2341,220612.964547913
2342,237057.495164018
2343,229066.486192993
2344,210703.603032787
2345,231364.647666195
2346,212258.658306246
2347,198047.140514001
2348,237060.480535538
2349,178496.575393508
2350,289734.931947534
2351,248901.852023953
2352,255367.395177507
2353,239627.615913639
2354,142428.236926804
2355,144290.835046366
2356,143908.763568355
2357,183697.883996292
2358,191900.619106534
2359,133123.30260462
2360,112451.073955803
2361,140184.342352216
2362,263744.973240903
2363,134601.681747438
2364,149782.880901004
2365,213326.647373609
2366,193339.381881399
2367,223934.195787441
2368,202718.277876121
2369,218256.126013871
2370,164824.330615641
2371,162459.346183229
2372,184532.308008601
2373,265927.521239804
2374,280758.709141267
2375,245930.110499646
2376,274472.774925026
2377,342526.636894759
2378,142491.966041222
2379,194676.043686627
2380,151775.164287443
2381,160351.278175064
2382,197287.572408612
2383,199057.84853999
2384,236998.605774071
2385,165491.71013777
2386,131807.1302313
2387,135807.590480454
2388,107385.205407757
2389,120208.080497282
2390,143482.088526805
2391,139152.517076465
2392,114173.949437735
2393,158985.301812896
2394,142936.877584992
2395,197626.871679168
2396,145063.850075443
2397,219046.464405423
2398,126899.454575551
2399,69825.1022688401
2400,58621.418602372
2401,118126.932907182
2402,136199.067503473
2403,143833.419774821
2404,155480.543652766
2405,156059.928173137
2406,138272.980496843
2407,127586.768871905
2408,145632.085165166
2409,122130.246384107
2410,167290.088760811
2411,113354.549707821
2412,148243.274333342
2413,131035.930531202
2414,150879.426152449
2415,137999.168419983
2416,128417.803608622
2417,135922.102847766
2418,132242.109670187
2419,126461.015030101
2420,117641.11573791
2421,153408.604881481
2422,100731.474500295
2423,117830.461383391
2424,154704.154837918
2425,205288.875206077
2426,124110.306406388
2427,133007.638001025
2428,178777.55261657
2429,115524.835312949
2430,135339.154592756
2431,106932.674985382
2432,145501.462169823
2433,140798.182170666
2434,135395.778088448
2435,149853.115393695
2436,104083.719764264
2437,110624.316422625
2438,119535.927082266
2439,106003.550690446
2440,120507.387312894
2441,97596.7672531925
2442,101449.998719154
2443,127687.273112814
2444,133137.677753616
2445,96792.2542489934
2446,140453.462924317
2447,177103.876669062
2448,127471.745125273
2449,112956.202604294
2450,148580.165034783
2451,117035.760421709
2452,193870.102868896
2453,90651.3066031165
2454,121296.746680955
2455,122828.990239591
2456,132301.905560416
2457,129883.368502651
2458,129734.008819777
2459,113302.542704574
2460,140542.663680348
2461,131980.776188738
2462,135335.293950309
2463,129661.055877084
2464,169300.263720045
2465,139400.314751629
2466,109785.376625692
2467,130353.793582392
2468,85458.9207030712
2469,83577.8026266536
2470,176747.122100261
2471,191313.425581621
2472,149192.566665257
2473,114746.110524562
2474,79216.7721815706
2475,209528.167381777
2476,111965.82136292
2477,127781.691447515
2478,150385.030625707
2479,103974.231655837
2480,157737.779696419
2481,126730.976172943
2482,127056.005127881
2483,106450.613750934
2484,118430.466115001
2485,124146.062353038
2486,150687.118861661
2487,167084.352091538
2488,161564.528657207
2489,145694.164898432
2490,140203.383431133
2491,93848.8902399856
2492,190259.358105143
2493,149885.71055363
2494,148862.759750721
2495,82788.2640448514
2496,239895.156086752
2497,149112.883342641
2498,104451.367164846
2499,92604.0961522856
2500,115042.35916098
2501,137626.279416853
2502,145166.66591563
2503,94752.3642159571
2504,178618.902170826
2505,214956.823115741
2506,249726.695355522
2507,279813.55315631
2508,250866.521220754
2509,213010.330066092
2510,208113.033912549
2511,168752.421106505
2512,204137.066268678
2513,222098.392961796
2514,270813.109002237
2515,144912.158109547
2516,174806.513955413
2517,144527.691419221
2518,151341.347163066
2519,221349.737048938
2520,210324.717190394
2521,181418.820758549
2522,216282.277264904
2523,115185.444899287
2524,139740.423086514
2525,145821.380263781
2526,138797.839982206
2527,123757.32761695
2528,124707.089666984
2529,128743.546704874
2530,119866.261916748
2531,239252.956876295
2532,215586.494524051
2533,185402.967406958
2534,222581.083894454
2535,273863.254854227
2536,228085.654062752
2537,234237.067627005
2538,179487.12271354
2539,179710.316001832
2540,177893.717984541
2541,177763.081801266
2542,162192.380991361
2543,126545.666293328
2544,112878.689067085
2545,137778.432675407
2546,127723.77878595
2547,140019.182099863
2548,152572.494576765
2549,159473.919741577
2550,781924.634134255
2551,141289.99240291
2552,122512.461210911
2553,74301.5225909063
2554,91590.2000192872
2555,114523.076184903
2556,96432.0210297272
2557,103209.080246546
2558,141855.435759426
2559,139726.924345573
2560,152889.867986832
2561,144069.371599197
2562,136903.480659978
2563,148139.217618968
2564,195713.155019852
2565,133897.650362011
2566,171041.099084388
2567,139242.443258516
2568,207714.325273784
2569,221832.794940247
2570,116088.16037557
2571,190831.775397753
2572,146404.477564335
2573,221784.658529522
2574,297363.638083186
2575,127310.885292767
2576,118116.60643703
2577,130317.344842082
2578,83526.7372163452
2579,63041.715570612
2580,104317.099758115
2581,117511.527103616
2582,123470.238196672
2583,283755.743164705
2584,186299.789364312
2585,182940.701851773
2586,210780.714648633
2587,190674.622643762
2588,153765.874886493
2589,144062.907977008
2590,201910.920717532
2591,225011.860550069
2592,211947.765107486
2593,240212.025639105
2594,182627.906284444
2595,187746.946285402
2596,277885.258770107
2597,173733.740396738
2598,274732.852485632
2599,315595.334224151
2600,165195.963830124
2601,145184.213278541
2602,82375.7259839417
2603,93183.1834029101
2604,85203.3749654355
2605,78469.8189097075
2606,143979.747116842
2607,203336.358374881
2608,192910.266774903
2609,160572.878032217
2610,110322.03030534
2611,125297.308358465
2612,157745.16564032
2613,127529.899575939
2614,122871.070957234
2615,156853.330692234
2616,144196.726925014
2617,170609.71755774
2618,201553.403653246
2619,194535.572405533
2620,179546.112637481
2621,168534.191197816
2622,177151.172401667
2623,230421.983274845
2624,305038.319363869
2625,285985.549082422
2626,172074.097041901
2627,167927.45059749
2628,437489.92246782
2629,469136.167969645
2630,356744.406042638
2631,436654.519558214
2632,391552.425153446
2633,300114.804648367
2634,387918.338387787
2635,155060.536766152
2636,168553.842535858
2637,158899.806869713
2638,254124.449663631
2639,184100.510448857
2640,146983.453420136
2641,105259.037583676
2642,180293.661572152
2643,97028.0399289287
2644,119158.893871699
2645,106398.860404929
2646,90008.355186201
2647,102820.132817181
2648,144077.415151612
2649,150592.479111134
2650,136637.136603286
2651,140019.816755488
2652,366443.406654575
2653,252314.217665751
2654,250450.174945411
2655,341917.431707056
2656,313867.849001948
2657,334216.77485471
2658,293241.925041555
2659,289082.092969428
2660,345711.770716878
2661,330084.807696185
2662,334644.614472229
2663,286141.8009817
2664,259616.658748344
2665,299930.130876595
2666,271938.483815842
2667,169004.630060748
2668,174715.239009753
2669,182057.664701123
2670,267571.48028971
2671,182031.204516018
2672,193905.641607757
2673,196548.720428568
2674,193122.794979357
2675,171740.669587001
2676,189803.242398909
2677,189039.100501676
2678,242193.449371055
2679,265284.837431631
2680,281599.420755591
2681,347541.0172962
2682,293884.886483396
2683,443564.369219337
2684,303324.564445565
2685,314281.230991277
2686,248218.791951528
2687,282012.689337954
2688,214755.410702245
2689,206852.990066996
2690,361862.68148714
2691,186190.344199518
2692,146542.075175926
2693,204767.370340936
2694,137593.243099741
2695,187085.293175442
2696,177419.891514184
2697,177479.239344
2698,179813.515641349
2699,171303.018445382
2700,155881.087866175
2701,142611.791609706
2702,104275.493081683
2703,123672.592101486
2704,138875.33639692
2705,110413.546142389
2706,97574.7303706166
2707,117633.563857969
2708,131093.617758166
2709,100329.018274727
2710,120203.709549113
2711,287847.05476034
2712,348917.143051233
2713,165645.649625174
2714,147520.188514256
2715,163771.575437948
2716,145674.971578812
2717,198248.429005747
2718,218193.07329219
2719,149520.837886558
2720,166214.387717342
2721,129622.392342968
2722,159620.910146276
2723,142489.110748243
2724,125352.128537085
2725,127666.876763179
2726,147551.897944082
2727,185196.391984513
2728,183445.209280644
2729,142407.843116611
2730,147919.14652419
2731,121054.63515517
2732,133510.581777139
2733,152467.692817404
2734,139849.231691561
2735,135571.772240007
2736,138457.98345893
2737,114433.970322547
2738,137646.993552274
2739,151787.692322851
2740,133916.989303812
2741,141849.616622001
2742,149844.732027938
2743,151599.194913419
2744,153668.596551878
2745,142265.151196614
2746,133956.330788408
2747,146541.569101236
2748,118793.839189364
2749,124519.478509761
2750,136290.069155434
2751,129270.25674127
2752,212972.085454025
2753,142811.679473994
2754,211695.769650854
2755,133158.129735129
2756,96165.8465997263
2757,77573.0359988419
2758,85665.3076598704
2759,147590.785368008
2760,119603.480505568
2761,140287.550616226
2762,142013.415317033
2763,176427.62162726
2764,149303.406724686
2765,270921.189030888
2766,129191.782518803
2767,92235.1056426286
2768,131835.352637583
2769,132393.62876804
2770,137145.469437094
2771,108832.170741843
2772,114148.19135331
2773,159745.087335083
2774,143342.666637463
2775,117491.010872861
2776,146906.594832477
2777,139966.902100809
2778,102956.260504214
2779,121306.909074504
2780,94919.2353412818
2781,90847.7943067749
2782,95727.7106652638
2783,99644.5737184091
2784,124968.761984927
2785,136111.983451922
2786,64665.3508726838
2787,123803.7978336
2788,79304.2882305072
2789,168083.492707234
2790,92580.6907969653
2791,116228.495317886
2792,65417.3295937022
2793,170900.945069043
2794,95105.3995714917
2795,125148.042478359
2796,88934.5326926436
2797,205568.581891571
2798,105271.012843986
2799,114683.817455429
2800,65451.5539079218
2801,94996.0430675842
2802,131581.875002182
2803,163893.318615573
2804,132437.865217569
2805,96983.7942986398
2806,86149.5016964744
2807,156851.001636831
2808,145010.437077729
2809,133861.057962419
2810,123064.878781463
2811,158755.585586886
2812,155844.815065852
2813,152601.206004314
2814,152244.932338969
2815,95969.2156170046
2816,210003.890540875
2817,146023.579200018
2818,132115.648101932
2819,161886.248900235
2820,132333.322415642
2821,109034.037298758
2822,191335.695419711
2823,309936.214042979
2824,173034.743054421
2825,144223.919140044
2826,133525.782074861
2827,135575.100411643
2828,210552.863544861
2829,221452.456498415
2830,228070.219364146
2831,170644.419759011
2832,240380.124372047
2833,273516.015906935
2834,217584.353865265
2835,218026.885437474
2836,185411.025928005
2837,159152.741322186
2838,148570.282019325
2839,172521.361500549
2840,195836.030830001
2841,192338.367174914
2842,223435.591067662
2843,146254.317110622
2844,173052.051799375
2845,124223.900193215
2846,197413.135423718
2847,199435.720381648
2848,212123.969735596
2849,195183.607912039
2850,264194.423058477
2851,206169.723322601
2852,231887.918815307
2853,225994.913515206
2854,139671.029266269
2855,192696.374391765
2856,195118.286244039
2857,181685.363666318
2858,198247.223236132
2859,119555.975770341
2860,129778.840024637
2861,120630.285909291
2862,193496.503955662
2863,132567.600101224
2864,231102.100390303
2865,142105.230068113
2866,142384.772323345
2867,96655.1671333895
2868,99320.0932641753
2869,103055.321993379
2870,128311.641737799
2871,87001.9115170099
2872,52695.5175428365
2873,99048.2597679614
2874,131622.998910219
2875,111758.518743662
2876,157980.422854312
2877,135507.493432156
2878,174669.207145198
2879,135974.072396854
2880,95535.8777341975
2881,144308.58488996
2882,171105.46055762
2883,203803.699418902
2884,201065.079725738
2885,178807.192910981
2886,235117.278678379
2887,89988.4501969747
2888,134028.730706546
2889,52951.5620220427
2890,72461.2606223844
2891,132350.235898545
2892,49519.903312549
2893,91774.7483273674
2894,63802.9949823561
2895,316559.30056598
2896,263188.520668592
2897,195955.40217774
2898,148517.729577653
2899,194744.754132515
2900,159209.352088513
2901,193248.148435355
2902,186657.897120523
2903,298963.459699373
2904,316948.044567848
2905,98625.175056434
2906,197145.483485985
2907,109585.439621409
2908,125616.37718125
2909,149113.050813954
2910,78078.8390632294
2911,78154.9063457682
2912,151430.476710783
2913,78569.6447205106
2914,74137.4222747907
2915,83363.3425499263
2916,82220.4204780952
2917,158415.5993213
2918,125512.256308792
2919,208342.73959515
