{
  "definitions": {},
  "$schema": "http://json-schema.org/draft-07/schema#",
  "$id": "https://example.com/object1613082461.json",
  "title": "Root",
  "type": "object",
  "required": [
  ],
  "properties": {
  }
}
