<svg xmlns="http://www.w3.org/2000/svg" width="283.05" height="101" viewBox="0 0 283.05 101">
  <path fill="#f6f6f8" d="M62.11 34.7c10.74-6.03 23.45-9.09 37.78-9.09 26.17 0 56.8 10.22 88.58 29.56 20.63 12.56 40.45 28.15 58.87 45.83h35.71c-24.61-26.75-52.15-50.11-81.2-67.79C166.17 11.48 130.84 0 99.69 0 80.91 0 64.03 4.13 49.51 12.28 20.4 28.62 3.1 59.84 0 101h25.8c2.72-31.63 15.13-54.41 36.31-66.3z"/>
  <path fill="#f6f6f8" d="M106.91 101h51.86l-51.86-32.05z"/>
</svg>
