<?xml version="1.0" encoding="utf-8"?>
<!-- Generator: Adobe Illustrator 16.2.0, SVG Export Plug-In . SVG Version: 6.00 Build 0)  -->
<!DOCTYPE svg PUBLIC "-//W3C//DTD SVG 1.1//EN" "http://www.w3.org/Graphics/SVG/1.1/DTD/svg11.dtd">
<svg version="1.1" id="Laag_1" xmlns="http://www.w3.org/2000/svg" xmlns:xlink="http://www.w3.org/1999/xlink" x="0px" y="0px"
	 width="130.838px" height="30.75px" viewBox="0 0 130.838 30.75" enable-background="new 0 0 130.838 30.75" xml:space="preserve">
<g>
	<path fill="#60B22F" d="M1.09,2.288h3.185l10.15,15.201L24.572,2.288h3.187v27.858h-3.146V7.583L14.463,22.508h-0.158L4.156,7.622
		v22.525H1.09V2.288z"/>
	<path fill="#60B22F" d="M33.208,1.693h3.5v3.379h-3.5V1.693z M33.405,9.571h3.065v20.576h-3.065V9.571z"/>
	<path fill="#60B22F" d="M41.605,9.571h3.064v3.582c0.688-1.113,1.591-2.061,2.703-2.843c1.117-0.783,2.562-1.177,4.34-1.177
		c1.246,0,2.356,0.2,3.322,0.6c0.969,0.396,1.793,0.96,2.468,1.69c0.678,0.73,1.193,1.598,1.552,2.607
		c0.361,1.008,0.539,2.121,0.539,3.343v12.775h-3.064V18.154c0-1.905-0.492-3.415-1.472-4.528c-0.983-1.113-2.386-1.668-4.219-1.668
		c-0.877,0-1.693,0.156-2.448,0.458c-0.754,0.305-1.409,0.741-1.972,1.312c-0.555,0.569-0.987,1.251-1.293,2.046
		c-0.304,0.792-0.455,1.665-0.455,2.621v11.752h-3.064V9.571z"/>
	<path fill="#60B22F" d="M71.015,30.506c-0.821,0-1.593-0.108-2.308-0.319c-0.716-0.211-1.333-0.549-1.849-1.014
		c-0.517-0.463-0.922-1.069-1.216-1.812c-0.29-0.741-0.437-1.634-0.437-2.665V12.277H62.34V9.571h2.865V3.363h3.064v6.208h6.528
		v2.707H68.27v11.989c0,1.271,0.319,2.154,0.956,2.66c0.635,0.5,1.473,0.751,2.507,0.751c0.53,0,1.027-0.049,1.493-0.149
		c0.464-0.099,0.958-0.274,1.492-0.524v2.627c-0.534,0.292-1.096,0.511-1.692,0.655C72.428,30.431,71.759,30.506,71.015,30.506z"/>
	<path fill="#60B22F" d="M78.497,1.093h3.065v29.055h-3.065V1.093z"/>
	<path fill="#60B22F" d="M105.025,29.926h-3.409v-2.771h-0.085c-1.749,2.215-4.094,3.325-6.906,3.325
		c-5.887,0-9.596-4.991-9.596-10.533c0-5.712,3.624-10.614,9.638-10.614c2.728,0,6.162,0.913,8.051,3.336
		c1.732,2.222,1.783,3.597,2,4.752c0.399,2.132,0.266,3.304,0.266,5.91C104.983,25.639,105.025,29.926,105.025,29.926z
		 M87.972,19.734c0,4.139,2.429,8.053,6.929,8.053c4.635,0,7.063-3.736,7.063-8.01c0-4.224-2.653-7.649-7.11-7.649
		C90.672,12.13,87.972,15.776,87.972,19.734z"/>
	<path fill="#60B22F" d="M120.111,30.586c-0.957,0-1.832-0.123-2.631-0.36c-0.792-0.238-1.508-0.555-2.148-0.956
		c-0.635-0.396-1.211-0.859-1.727-1.391c-0.521-0.529-0.979-1.088-1.376-1.674v3.942h-3.064V1.093h3.064V13.71
		c0.424-0.609,0.897-1.193,1.413-1.752c0.517-0.555,1.096-1.039,1.731-1.451c0.638-0.412,1.349-0.742,2.129-0.994
		c0.78-0.253,1.651-0.381,2.608-0.381c1.219,0,2.421,0.238,3.601,0.716c1.18,0.477,2.235,1.177,3.165,2.094
		c0.928,0.913,1.67,2.025,2.226,3.341c0.561,1.313,0.841,2.817,0.841,4.515v0.083c0,1.671-0.28,3.172-0.841,4.498
		c-0.555,1.326-1.289,2.445-2.204,3.358c-0.918,0.917-1.966,1.622-3.146,2.109C122.571,30.34,121.356,30.586,120.111,30.586z
		 M119.554,27.838c0.981,0,1.915-0.178,2.808-0.536c0.886-0.357,1.655-0.875,2.305-1.553c0.651-0.677,1.167-1.505,1.554-2.487
		c0.385-0.982,0.578-2.096,0.578-3.342v-0.081c0-1.22-0.193-2.321-0.578-3.304c-0.387-0.979-0.91-1.819-1.571-2.506
		c-0.663-0.689-1.433-1.222-2.309-1.594c-0.876-0.369-1.805-0.555-2.786-0.555c-0.955,0-1.876,0.19-2.769,0.577
		c-0.887,0.383-1.686,0.927-2.387,1.632c-0.7,0.702-1.26,1.539-1.669,2.505c-0.412,0.97-0.618,2.037-0.618,3.203v0.083
		c0,1.194,0.206,2.281,0.618,3.263c0.409,0.98,0.969,1.818,1.669,2.506c0.701,0.688,1.5,1.228,2.387,1.609
		C117.676,27.648,118.599,27.838,119.554,27.838z"/>
</g>
</svg>
