<?xml version="1.0" encoding="utf-8"?>
<!-- Generator: Adobe Illustrator 25.2.3, SVG Export Plug-In . SVG Version: 6.00 Build 0)  -->
<svg version="1.1" id="Ñëîé_1" xmlns="http://www.w3.org/2000/svg" xmlns:xlink="http://www.w3.org/1999/xlink" x="0px" y="0px"
	 viewBox="0 0 2772.8 659.9" style="enable-background:new 0 0 2772.8 659.9;" xml:space="preserve">
<path d="M1237.3,639.3h114.2V0h-114.2V639.3z M1499,639.3h114.2V0H1499V639.3z M1018.4,142.8L842.3,323.6L667.8,142.8l-76.1,77.7
	l176.1,180.8L591.7,582.2l76.1,77.7l176.1-180.8l174.5,180.8l76.1-77.7L918.5,401.3l176.1-180.8L1018.4,142.8z M426.7,142.8
	L250.6,323.6L76.1,142.8L0,220.5l176.1,180.8L0,582.2l76.1,77.7l176.1-180.8l174.5,180.8l76.1-77.7L326.8,401.3l176.1-180.8
	L426.7,142.8z M1974.9,163.4c-130.1,0-226.8,82.5-226.8,223.7v252.2h114.2v-249c0-76.1,47.6-115.8,112.6-115.8
	c65,0,112.6,41.2,112.6,115.8v250.6h114.2V387.1C2201.8,244.3,2105,163.4,1974.9,163.4z M2539.6,545.7
	c-71.4,0-130.1-61.9-130.1-139.6c0-76.1,58.7-139.6,130.1-139.6c53.9,0,99.9,34.9,119,84.1h114.2c-20.6-111-112.6-187.2-231.6-187.2
	c-139.6,0-241.1,103.1-241.1,244.3c0,139.6,101.5,242.7,241.1,242.7c119,0,211-76.1,231.6-185.6h-114.2
	C2638,510.8,2592,545.7,2539.6,545.7z"/>
</svg>
