<?xml version="1.0" encoding="UTF-8"?>
<svg width="52px" height="52px" viewBox="0 0 52 52" version="1.1" xmlns="http://www.w3.org/2000/svg" xmlns:xlink="http://www.w3.org/1999/xlink">
    <title>Nexus Mutual</title>
    <defs>
        <linearGradient x1="0%" y1="100%" x2="100%" y2="0%" id="linearGradient-1">
            <stop stop-color="#00CCFF" offset="0%"></stop>
            <stop stop-color="#33FF99" offset="100%"></stop>
        </linearGradient>
        <circle id="path-2" cx="26" cy="26" r="26"></circle>
    </defs>
    <g id="⚡-Active---THORChain.org" stroke="none" stroke-width="1" fill="none" fill-rule="evenodd">
        <g id="Mobile:-Post-Builder" transform="translate(0.000000, -3.000000)">
            <g id="Mobile:-Single-Post" transform="translate(0.000000, -0.000000)">
                <g id="Nexus-Mutual" transform="translate(0.000000, 3.000000)">
                    <mask id="mask-3" fill="white">
                        <use xlink:href="#path-2"></use>
                    </mask>
                    <use id="Oval" fill="url(#linearGradient-1)" xlink:href="#path-2"></use>
                    <g id="Group" mask="url(#mask-3)" fill="#000B12" fill-rule="nonzero">
                        <g transform="translate(25.995736, 26.000000) scale(-1, 1) rotate(-180.000000) translate(-25.995736, -26.000000) translate(11.000000, 11.000000)" id="Shape">
                            <path d="M15.0278495,0.00125027702 L15.2314977,0.00201821088 C15.734368,0.0198653825 16.1868463,0.100702572 16.6172781,0.246629446 C17.3353643,0.49124068 17.9075236,0.845034612 18.4639355,1.38884843 C18.8786197,1.79408421 19.230314,2.30430335 19.4780747,2.85966534 C19.6103538,3.15466859 19.7583803,3.65543923 19.804573,3.95569165 C19.8129717,4.016582 19.8276693,4.10896735 19.8350182,4.1604092 C19.8791112,4.44491411 19.8822607,5.05066812 19.8402673,5.36771787 C19.7993238,5.68581746 19.7310847,5.98397021 19.6303006,6.28632229 C19.5305664,6.58552488 19.4213837,6.83118595 19.2523605,7.13773736 C19.0696895,7.46738512 18.7809852,7.84112589 18.4681348,8.15187665 C18.3684006,8.25056101 18.2865136,8.33979687 18.2865136,8.34819554 C18.2865136,8.3565942 18.2571182,8.38913905 18.2214239,8.41958422 C17.9663143,8.63584995 17.7426998,8.92035486 17.5894241,9.22585645 C17.4413975,9.51876003 17.3710587,9.76337126 17.3353643,10.111916 C17.3196168,10.2651917 17.318567,10.3134841 17.3290653,10.4741086 C17.3710587,11.1124075 17.6062214,11.6320751 18.0607994,12.0877029 C18.2623674,12.289271 18.454487,12.427849 18.7116962,12.553829 C19.19252,12.7910914 19.7625797,12.8645798 20.290646,12.7585466 C20.6223934,12.6913572 20.9016491,12.5737759 21.2019016,12.3732577 C21.3709248,12.2609255 21.4307653,12.2084338 21.5231507,12.0929521 C21.6176357,11.973271 21.8727452,11.7066133 22.019722,11.5722346 C22.2496355,11.3622679 22.4847983,11.184846 22.7409577,11.0273709 C22.9372765,10.9066401 23.3246652,10.7155704 23.4989375,10.6536302 C23.5283329,10.6431318 23.5913229,10.6200355 23.6406651,10.6011385 C23.7246518,10.5696435 23.8548311,10.5276501 23.9136218,10.5129525 C23.9283195,10.5087531 23.9934092,10.4919558 24.0595487,10.4751585 C24.549821,10.3470788 25.1482262,10.2998362 25.6458473,10.3491784 C26.0605316,10.3901219 26.3933288,10.4604608 26.7607706,10.585391 C27.2552422,10.7533644 27.7570627,11.0200221 28.1224048,11.3097762 C28.3197735,11.4651516 28.3985111,11.5365403 28.5864313,11.7234106 C28.8320924,11.9701215 28.9633216,12.1212976 29.1029494,12.3176165 C29.5575274,12.958015 29.8294343,13.639357 29.9491153,14.4330312 C30.0026568,14.7868252 30.0058063,15.399928 29.9564642,15.7453233 C29.9050223,16.1085657 29.8462316,16.3531769 29.7276004,16.699622 C29.5396802,17.2497348 29.1774876,17.8523393 28.7628033,18.3069173 C28.6000791,18.4843392 28.335521,18.7310501 28.1748965,18.8559803 C27.3969698,19.457535 26.499362,19.8008306 25.5513623,19.8617209 C25.3413955,19.8753687 24.9067644,19.8690697 24.7482395,19.8512226 C24.5382728,19.8260266 24.398645,19.8060797 24.3388044,19.7924319 C24.3041599,19.7840332 24.2285719,19.7682857 24.1708311,19.7556877 C23.7813428,19.671701 23.3435622,19.5100266 22.9950174,19.3221064 C22.4386056,19.021854 22.0302203,18.6943059 21.5976888,18.2019339 C21.4360145,18.0171632 21.3394298,17.9226782 21.2218484,17.8334423 C20.7609714,17.4848976 20.2769981,17.3190239 19.7142873,17.3169242 C19.4308322,17.3158744 19.1967193,17.3526185 18.9405599,17.4397547 C18.586766,17.5594358 18.3705003,17.6791168 18.1059422,17.9016815 C17.8686798,18.1011499 17.7259024,18.2743725 17.564228,18.5557279 C17.3469125,18.9357677 17.2419291,19.3084586 17.2293311,19.7504385 C17.2209325,20.0296943 17.2545271,20.2690564 17.343763,20.5483121 C17.3931052,20.7026376 17.4141018,20.7540795 17.4959889,20.9157539 C17.6471649,21.2128568 17.8770785,21.4984115 18.1374372,21.7136274 C18.1857296,21.7524713 18.2508192,21.8165111 18.2823142,21.8543051 C18.3138093,21.8920991 18.3841481,21.9729363 18.4397893,22.0338267 C18.6224603,22.2343449 18.7925334,22.4600591 18.9500084,22.7109694 C19.0623406,22.8904909 19.2586595,23.2726304 19.3038024,23.3986104 C19.3153505,23.4301054 19.3415964,23.5014941 19.362593,23.5560854 C19.4980216,23.911979 19.5935564,24.309866 19.6428986,24.7266499 C19.6523471,24.8043376 19.6565465,24.9744107 19.6554966,25.2463176 C19.6544468,25.7050949 19.6397491,25.8709686 19.5715099,26.1911678 C19.3940881,27.0215862 19.0444935,27.7260246 18.4954305,28.3590743 C18.3568524,28.5196988 18.0429522,28.8210011 17.8718293,28.9574794 C17.3700088,29.3585159 16.7558562,29.6713663 16.1606005,29.8288414 C15.7868597,29.9275257 15.5160026,29.9695191 15.1265144,29.9915656 C14.895551,30.0041636 14.8525078,30.0031137 14.5648534,29.9852666 C14.0850794,29.9537716 13.6441493,29.8550872 13.1423288,29.6629676 C12.4609868,29.4047086 11.7250534,28.8797918 11.2620768,28.3223301 C10.6857181,27.6283901 10.3308744,26.8662109 10.188097,26.0168955 C10.1398046,25.7334404 10.1356053,25.6694005 10.1356053,25.2358192 L10.1357365,25.1102924 C10.1364255,24.8478729 10.1403296,24.7860968 10.1587017,24.6584107 C10.2741834,23.8500389 10.4967481,23.236936 10.9030337,22.612285 C11.1318974,22.2605907 11.5161365,21.8280593 11.8258375,21.5739996 C12.2079769,21.2600993 12.522927,20.7477805 12.6321097,20.2596079 C12.680402,20.0433421 12.6940499,19.8995149 12.6877509,19.6664519 C12.6814519,19.4134419 12.655206,19.2307709 12.5964153,19.021854 C12.516628,18.7383989 12.4116446,18.5158342 12.2436712,18.2701731 C12.1722825,18.1672894 11.9644155,17.9373759 11.8436846,17.829243 C11.500389,17.5216418 11.0300636,17.3064259 10.5586883,17.2392365 C10.3760172,17.2140405 10.030622,17.2140405 9.86684791,17.2392365 C9.55609715,17.2885787 9.22749923,17.3998611 9.00913383,17.5310903 C8.71098108,17.7106118 8.64379173,17.766253 8.26060246,18.1504921 C7.97714738,18.4339472 7.85851618,18.5431299 7.6873933,18.6743591 C7.58870894,18.7499471 7.39868905,18.8843258 7.3472472,18.9137211 C7.32100136,18.9284188 7.27165918,18.9599138 7.23701467,18.9830102 C7.20237016,19.0061065 7.05644329,19.084844 6.91156625,19.1572825 C6.45488862,19.3871961 6.00870933,19.5320731 5.5268357,19.608711 C5.08275607,19.6790499 4.45390573,19.6790499 4.04866995,19.6076612 C3.94893576,19.5908638 3.83660356,19.5719668 3.79880955,19.5656678 L3.75790492,19.5582023 C3.72952053,19.5526032 3.70082508,19.5460709 3.68332785,19.5404718 C3.65708201,19.533123 3.59619166,19.5163256 3.54684948,19.5037276 C3.2728429,19.4312891 3.00828483,19.3336546 2.6828364,19.1845782 C2.50121519,19.1005915 2.13902259,18.8811763 1.9301057,18.7279006 C1.67919546,18.5441797 1.31595302,18.2050834 1.13538164,17.9867181 C0.775288707,17.5499873 0.523328637,17.1279541 0.331209083,16.6418812 C0.146438365,16.175755 0.0519533387,15.7526721 0.0141593282,15.2183068 C-0.0099868452,14.869762 -0.00473767707,14.680792 0.0414550025,14.3070512 C0.100245685,13.8262274 0.229375221,13.3559019 0.410996439,12.9632642 C0.695501351,12.3449121 0.953760423,11.973271 1.41463738,11.5144938 C1.75478348,11.1753975 2.0644844,10.9391849 2.42772683,10.7407664 C2.84661045,10.5108528 3.18360704,10.3754243 3.58884282,10.2714907 C4.21979283,10.1108662 4.85284251,10.080421 5.51003836,10.1801552 C5.89427747,10.2378961 6.33730726,10.3638761 6.63860951,10.5014043 C6.65015768,10.5066535 6.66625513,10.5140023 6.68472442,10.5224399 L6.80658289,10.5780422 C7.10893497,10.7155704 7.47427707,10.9454839 7.76718065,11.1795968 C8.02124039,11.3832645 8.29209747,11.6562213 8.49786486,11.9123807 C8.6679379,12.1254969 8.95979165,12.3386131 9.28209058,12.4866397 C9.64113368,12.6514636 10.0022764,12.7218024 10.4075122,12.7081546 C10.7287613,12.6966064 11.0048676,12.6315167 11.336615,12.490839 C11.4951399,12.4225998 11.7334521,12.2735235 11.8814786,12.1496431 C11.9843623,12.0625069 12.1712327,11.8756365 12.2468207,11.7822013 C12.4956313,11.4746001 12.6835515,11.0620155 12.7549402,10.6693777 C12.7864352,10.4919558 12.7948339,10.1140157 12.7696379,9.93449414 C12.7276445,9.62479322 12.6468073,9.35708565 12.5208273,9.10512558 C12.4756845,9.01693955 12.3371064,8.80487316 12.2489204,8.6904413 C12.1859304,8.60960411 11.961266,8.37969054 11.8909271,8.3250992 C11.8625816,8.30410252 11.8373856,8.27785668 11.8342361,8.26525868 C11.8300368,8.25371051 11.7680966,8.18337166 11.6946082,8.10778363 C11.2767745,7.67840168 10.9754722,7.23432206 10.7329606,6.69050824 C10.4998976,6.16769109 10.3749674,5.63017628 10.3382232,4.9908276 C10.3109275,4.51105363 10.3854657,3.90844913 10.5334923,3.40662866 C10.6374258,3.05598423 10.8274457,2.61820361 10.9933194,2.3494462 C11.0542097,2.25076184 11.2232329,1.9967021 11.2704755,1.93371208 C11.4510468,1.69120051 11.7733458,1.34265575 11.9875118,1.15893487 C12.4168938,0.791493097 12.8819701,0.51433702 13.3995381,0.318018132 C13.5759101,0.251878614 13.6861426,0.214084603 13.7627805,0.193087931 C13.7942755,0.184689262 13.8646144,0.165792256 13.9192057,0.151094586 C14.2709,0.0545098922 14.8546075,-0.0126794599 15.2314977,0.00201821088 Z M15.1811057,22.4096671 C14.5501557,22.3519263 13.9748469,22.4821056 13.4215846,22.8096537 C13.1748737,22.9555806 12.9334119,23.161348 12.7391927,23.3933612 C12.3843489,23.8153943 12.1575849,24.3319125 12.0861962,24.8788758 C12.0630999,25.054198 12.0599503,25.3785966 12.080947,25.5560185 C12.1292394,25.9770018 12.2762161,26.3853871 12.5092791,26.7496793 C12.7444419,27.1150214 13.0320963,27.3974267 13.4184351,27.6420379 C13.6305015,27.7764166 13.8152722,27.8583036 14.0871791,27.9370412 C14.3307405,28.0084298 14.45987,28.0315262 14.7118301,28.0525229 C14.9102486,28.0693202 15.2440957,28.045174 15.4677103,27.9979315 C15.6241355,27.9653867 15.8236039,27.9055461 15.9611321,27.849905 C16.0808131,27.8026625 16.3317234,27.6703834 16.4493047,27.5937456 C16.6729193,27.4467689 16.9427265,27.2032075 17.1065006,26.9995397 C17.4266998,26.600603 17.6272181,26.1344768 17.7059556,25.603261 C17.7301018,25.4373873 17.7301018,25.0825435 17.7049058,24.8893741 C17.6209191,24.2300786 17.3448128,23.6715671 16.8744874,23.2064908 C16.4209592,22.757162 15.8026072,22.4663581 15.1811057,22.4096671 Z M14.5910992,23.3177732 C14.7233783,23.2957267 15.0194313,23.2925772 15.1632585,23.312524 C15.3574778,23.3398197 15.6073382,23.4185572 15.7879096,23.5088429 C15.8939428,23.5613346 16.075564,23.6904641 16.1931453,23.7954475 C16.3863147,23.9697199 16.5133446,24.1387431 16.6277765,24.3770553 C16.9248794,24.9943575 16.8870854,25.6966962 16.5259426,26.265706 C16.3758164,26.5008688 16.138554,26.7339318 15.8981421,26.8798587 C15.715471,26.9911411 15.4456638,27.0919251 15.2314977,27.1307689 C15.134913,27.1475663 14.8063151,27.1601643 14.7118301,27.1507158 C14.4336242,27.1202706 14.1249731,27.0163371 13.8845612,26.8725099 C13.7249865,26.7759252 13.6389001,26.7034866 13.4541294,26.5071678 C13.2305148,26.2709552 13.0562425,25.9171613 12.9932524,25.5738657 C12.9638571,25.4100916 12.9607076,25.1066897 12.9880033,24.9366167 C13.0331461,24.6500121 13.1423288,24.3739058 13.3029534,24.1334939 C13.4037374,23.9833677 13.6493985,23.7377067 13.803724,23.6337731 C14.0420362,23.4720987 14.3034448,23.3671154 14.5910992,23.3177732 Z M25.5566114,12.289271 C25.4159337,12.2693241 25.0096481,12.2724736 24.8532229,12.29557 C24.3681998,12.3659088 23.9367182,12.5380815 23.5671767,12.8099884 C23.3645588,12.9590648 23.1818878,13.1312375 23.0464592,13.2971112 C22.8480407,13.5438221 22.6611703,13.8713702 22.5656354,14.1432771 C22.3714162,14.6965395 22.3420209,15.2728981 22.4816488,15.8114628 C22.5446388,16.0571238 22.6832168,16.3794228 22.8175955,16.5946387 C23.0632566,16.9851768 23.3897548,17.305376 23.7813428,17.5394889 C24.1193892,17.7421068 24.549821,17.8838344 24.9319604,17.9184789 C24.9981,17.923728 25.0694886,17.9310769 25.0894355,17.9331765 C25.0944222,17.9337015 25.1038051,17.9340951 25.1164687,17.9343576 L25.2228956,17.9343576 L25.2228956,17.9343576 L25.2889039,17.9331765 C25.7529303,17.9195287 26.0689303,17.8407912 26.51196,17.6245255 C27.130312,17.3232232 27.6447305,16.7447649 27.8924913,16.0718215 C28.1119065,15.4776157 28.1129563,14.7700278 27.8966906,14.1590247 C27.8441989,14.0109981 27.7465644,13.7978819 27.6898734,13.7054965 C27.6636275,13.6635032 27.635282,13.6152108 27.6268834,13.5973637 C27.5827903,13.5112773 27.3791226,13.2593172 27.2394947,13.1186395 C27.061023,12.939118 26.9780862,12.869829 26.7775679,12.7365001 C26.4132757,12.4950384 26.0416346,12.35856 25.5566114,12.289271 Z M5.03131423,12.0751049 C4.71321464,12.0457096 4.33842403,12.0772046 4.04027128,12.1601414 C3.53215181,12.301869 3.10276985,12.553829 2.74897592,12.9181213 C2.61774672,13.0525 2.57995271,13.0976429 2.46972018,13.2540681 C2.22510894,13.601563 2.08863057,13.9133636 2.00464388,14.3123004 C1.91225852,14.7532305 1.92380669,15.2623998 2.03613889,15.6455891 C2.26920196,16.441363 2.80881644,17.0870106 3.53845081,17.4439541 C3.81245739,17.5783328 4.17674965,17.6822663 4.46020473,17.7085121 C4.52634425,17.7137613 4.59983261,17.7211101 4.62292894,17.7232098 C4.6964173,17.7305586 5.00716805,17.7179606 5.12684909,17.703263 C5.35886232,17.6738676 5.58982571,17.6161268 5.80924094,17.5331899 C5.91212464,17.4943461 6.21132722,17.3400205 6.31211125,17.273881 C6.7446427,16.9914758 7.08583863,16.6061868 7.31050303,16.1495092 C7.51732025,15.7306256 7.60130694,15.3715825 7.60236506,14.9054564 C7.60340661,14.4466791 7.50472225,14.0256958 7.30210436,13.6194102 C7.12993164,13.2729651 6.8569749,12.9422675 6.52102814,12.6735101 C6.25961957,12.4635433 5.94256981,12.2882211 5.68851008,12.2126331 C5.39770616,12.1244471 5.26542712,12.0971514 5.03131423,12.0751049 Z M24.7608376,13.2267724 C25.0411431,13.1553837 25.4106846,13.1553837 25.6930898,13.2267724 C26.3114418,13.3831976 26.7954151,13.8167789 27.0347772,14.4288319 C27.2038004,14.8592637 27.1954017,15.4198748 27.0148303,15.8429578 C26.9077473,16.0928182 26.7460729,16.3258813 26.5550032,16.5012035 C26.2327043,16.7993562 25.9398007,16.9431834 25.5146181,17.0114226 C25.3959869,17.0303196 25.1072826,17.0387183 25.0117478,17.0250705 C24.7860336,16.9946253 24.5928642,16.9389841 24.4070436,16.8507981 C24.1729307,16.7405655 24.0175553,16.6271835 23.8191368,16.422466 C23.7015554,16.3006852 23.6438146,16.2250972 23.5629774,16.087569 C23.3603595,15.7400741 23.2732233,15.3705327 23.3026186,14.9810444 C23.3225655,14.7280345 23.3729575,14.5222671 23.4674425,14.3070512 C23.6081202,13.9889516 23.8611301,13.6949982 24.1771301,13.4829318 C24.3304058,13.3800481 24.5697678,13.2750647 24.7608376,13.2267724 Z M4.70796547,12.9664137 C5.02396539,12.9559153 5.3147693,13.0168057 5.60032405,13.1522342 C5.98876249,13.3370049 6.31841025,13.6603537 6.50318097,14.0393436 C6.59976566,14.238812 6.65015768,14.4004864 6.68270252,14.6115029 C6.70369919,14.7553302 6.70684869,15.0219879 6.68690185,15.1679148 C6.63860951,15.5374562 6.46958629,15.8964993 6.20397839,16.1936022 C5.99191199,16.4298148 5.67171274,16.6355822 5.35781248,16.7363662 C5.22658328,16.7783595 5.1772411,16.7878081 5.00296872,16.8109044 C4.82554683,16.8329509 4.6869688,16.8308512 4.47070307,16.7993562 C4.10851047,16.7479144 3.76626471,16.5851902 3.48490929,16.3332301 C3.17520838,16.0539743 2.97259049,15.7117286 2.89070346,15.330639 C2.83821178,15.0870776 2.82771345,14.869762 2.85815862,14.642998 C2.8886038,14.4151841 2.94319514,14.2419615 3.05027817,14.0288453 C3.13321503,13.8629716 3.18255721,13.7884334 3.30538774,13.6435563 C3.41142094,13.5175763 3.45446412,13.475583 3.57414515,13.3821478 C3.91009191,13.1196894 4.29223135,12.9800615 4.70796547,12.9664137 Z M15.4362153,1.95890809 C15.2965874,1.93896125 14.864056,1.94211075 14.7380759,1.96415726 C14.4336242,2.0155991 14.359086,2.03344628 14.1869133,2.09433663 C14.0787804,2.13318047 13.8929599,2.20981833 13.8194715,2.2465625 C13.7386343,2.28750601 13.5454649,2.40613721 13.4530796,2.47332657 C12.8872192,2.87856235 12.4777841,3.50006385 12.3392061,4.16565837 C12.2237244,4.71577119 12.2583689,5.24593717 12.44104,5.74460814 C12.7066479,6.47214285 13.2840564,7.07789685 13.9926941,7.3760496 C14.2855976,7.49888013 14.5407072,7.56501965 14.8168135,7.58811599 C14.8976506,7.59441499 14.9753383,7.60176383 14.990036,7.60386349 C15.0351788,7.6101625 15.3165343,7.59966416 15.432016,7.58706616 C15.8613979,7.54087348 16.3663679,7.34980376 16.7170123,7.10204302 C17.1201484,6.81648828 17.431949,6.45324584 17.6492646,6.01336555 C17.8466333,5.61232911 17.93062,5.24803684 17.9327325,4.78506021 C17.9337695,4.37247559 17.8707795,4.05752551 17.7112048,3.67748573 C17.6093709,3.43392433 17.520135,3.27539946 17.375258,3.08118024 C17.274474,2.94680153 17.0036169,2.66754579 16.863989,2.55521359 C16.4524542,2.22556583 16.0020756,2.03764561 15.4362153,1.95890809 Z M14.503963,2.93735303 C14.8493583,2.82607066 15.2440957,2.81347266 15.5884412,2.90270852 C15.7301687,2.93840286 15.8099561,2.96884804 15.9569328,3.04233639 C16.2403878,3.18511376 16.4640024,3.36673498 16.6330256,3.59349904 C16.9290787,3.99033615 17.0645072,4.44176461 17.0277631,4.91313991 C17.0120156,5.11680764 16.9962681,5.19974449 16.9416767,5.36876771 C16.7621552,5.92412969 16.3180755,6.38815616 15.7826604,6.58237538 C15.6440823,6.63276739 15.5432983,6.66006307 15.4152186,6.6800099 C15.2923881,6.69995674 14.9931855,6.70940525 14.8976506,6.69575741 C14.6026474,6.65376406 14.3643352,6.57502654 14.1218236,6.43749834 C13.9790462,6.35666115 13.8824615,6.28107313 13.7354848,6.13409642 C13.3827407,5.78135232 13.1748737,5.28478102 13.172774,4.79135921 C13.1685747,4.13311353 13.4982224,3.51476152 14.0399366,3.16201742 C14.1564681,3.0864294 14.384282,2.97619687 14.503963,2.93735303 Z"></path>
                        </g>
                    </g>
                </g>
            </g>
        </g>
    </g>
</svg>