<svg width="52" height="52" viewBox="0 0 52 52" fill="none" xmlns="http://www.w3.org/2000/svg">
<circle cx="26" cy="26" r="26" fill="#4462B7"/>
<mask id="mask0" mask-type="alpha" maskUnits="userSpaceOnUse" x="0" y="0" width="52" height="52">
<circle cx="26" cy="26" r="26" fill="white"/>
</mask>
<g mask="url(#mask0)">
<path d="M20.0066 22.7907V24.8787L14.6966 26.8047L20.0066 28.7127V30.8007L12.4466 27.8307V25.7787L20.0066 22.7907ZM30.619 19.8027L23.545 33.5187H21.421L28.495 19.8027H30.619ZM32.0362 22.7907L39.5782 25.7787V27.8307L32.0362 30.8007V28.7127L37.3282 26.8047L32.0362 24.8787V22.7907Z" fill="#99B2FB"/>
</g>
</svg>
