<?xml version="1.0" encoding="UTF-8"?>
<svg width="52px" height="52px" viewBox="0 0 52 52" version="1.1" xmlns="http://www.w3.org/2000/svg" xmlns:xlink="http://www.w3.org/1999/xlink">
    <title>NFTs</title>
    <defs>
        <linearGradient x1="0%" y1="100%" x2="100%" y2="0%" id="linearGradient-1">
            <stop stop-color="#00CCFF" offset="0%"></stop>
            <stop stop-color="#33FF99" offset="100%"></stop>
        </linearGradient>
        <circle id="path-2" cx="26" cy="26" r="26"></circle>
    </defs>
    <g id="⚡-Active---THORChain.org" stroke="none" stroke-width="1" fill="none" fill-rule="evenodd">
        <g id="Mobile:-Post-Builder" transform="translate(0.000000, -3.000000)">
            <g id="Mobile:-Single-Post" transform="translate(0.000000, -0.000000)">
                <g id="NFTs" transform="translate(0.000000, 3.000000)">
                    <mask id="mask-3" fill="white">
                        <use xlink:href="#path-2"></use>
                    </mask>
                    <use id="Oval" fill="url(#linearGradient-1)" xlink:href="#path-2"></use>
                    <g id="museum-art-decor-piece" mask="url(#mask-3)" fill="#000000" fill-rule="nonzero">
                        <g transform="translate(10.416731, 10.333143)" id="Rectangle">
                            <rect x="9.551552" y="9.95518523" width="11.9730511" height="15.1120202"></rect>
                            <rect x="13.7219282" y="27.6973285" width="7.80267487" height="4.81416721"></rect>
                            <rect x="0" y="9.95518523" width="6.45743098" height="7.80267487"></rect>
                            <rect x="3.76684308" y="20.4485481" width="2.6905879" height="4.61865736"></rect>
                            <rect x="24.4843799" y="9.95518523" width="4.1702761" height="4.70855385"></rect>
                            <rect x="5.78470892" y="0" width="9.01347446" height="7.66823057"></rect>
                            <rect x="24.4843799" y="18.0489726" width="5.5156201" height="7.0181328"></rect>
                            <rect x="17.8923044" y="2.01806606" width="3.63229867" height="4.70845374"></rect>
                        </g>
                    </g>
                </g>
            </g>
        </g>
    </g>
</svg>