<?xml version="1.0" encoding="UTF-8"?>
<svg width="52px" height="52px" viewBox="0 0 52 52" version="1.1" xmlns="http://www.w3.org/2000/svg" xmlns:xlink="http://www.w3.org/1999/xlink">
    <title>laboratory</title>
    <defs>
        <linearGradient x1="0%" y1="100%" x2="100%" y2="0%" id="linearGradient-1">
            <stop stop-color="#FFE500" offset="0%"></stop>
            <stop stop-color="#9AFF33" offset="100%"></stop>
        </linearGradient>
        <circle id="path-2" cx="26" cy="26" r="26"></circle>
    </defs>
    <g id="⚡-Active---THORChain.org" stroke="none" stroke-width="1" fill="none" fill-rule="evenodd">
        <g id="Mobile:-Post-Builder" transform="translate(0.000000, -3.000000)">
            <g id="laboratory" transform="translate(0.000000, 3.000000)">
                <mask id="mask-3" fill="white">
                    <use xlink:href="#path-2"></use>
                </mask>
                <use id="Oval" fill="url(#linearGradient-1)" xlink:href="#path-2"></use>
                <g id="test-tube" mask="url(#mask-3)" fill="#000000" fill-rule="nonzero">
                    <g transform="translate(13.000000, 11.000000)">
                        <path d="M22.5,10 C21.12125,10 20,8.87875 20,7.5 C20,6.12125 21.12125,5 22.5,5 C23.87875,5 25,6.12125 25,7.5 C25,8.87875 23.87875,10 22.5,10 Z" id="Path"></path>
                        <circle id="Oval" cx="18.125" cy="1.875" r="1.875"></circle>
                        <path d="M23.38375,14.74125 L15.25875,6.61625 C14.77,6.1275 13.98,6.1275 13.49125,6.61625 C13.0025,7.105 13.0025,7.895 13.49125,8.38375 L13.665,8.5575 L1.61125,20.6125 C0.5725,21.65125 0,23.0325 0,24.50125 C0,27.53375 2.46625,30 5.49875,30 C6.9675,30 8.34875,29.4275 9.3875,28.38875 L21.4425,16.33375 L21.61625,16.5075 C22.105,16.99625 22.895,16.99625 23.38375,16.5075 C23.8725,16.02 23.8725,15.23 23.38375,14.74125 Z M16.21625,18.025 C15.71625,18.18 15.145,18.1425 14.69875,17.89625 L13.715,17.34125 C12.5975,16.725 11.15375,16.72625 10.02625,17.345 L9.05875,17.89125 C8.6525,18.11625 8.14375,18.1725 7.685,18.0725 L15.4325,10.325 L19.67375,14.56625 L16.21625,18.025 Z" id="Shape"></path>
                    </g>
                </g>
            </g>
        </g>
    </g>
</svg>