<?xml version="1.0" encoding="UTF-8"?>
<svg width="316px" height="182px" viewBox="0 0 316 182" version="1.1" xmlns="http://www.w3.org/2000/svg" xmlns:xlink="http://www.w3.org/1999/xlink">
    <!-- Generator: Sketch 63.1 (92452) - https://sketch.com -->
    <title>Artboard</title>
    <desc>Created with Sketch.</desc>
    <defs>
        <linearGradient x1="0%" y1="50.5792789%" x2="100%" y2="49.4207211%" id="linearGradient-1">
            <stop stop-color="#00CCFF" offset="0%"></stop>
            <stop stop-color="#33FF99" offset="100%"></stop>
        </linearGradient>
    </defs>
    <g id="Artboard" stroke="none" stroke-width="1" fill="none" fill-rule="evenodd">
        <rect fill="#000B12" x="0" y="0" width="316" height="182"></rect>
        <g id="Liquidity-Pooling-in-Depth" transform="translate(-78.000000, -25.000000)" fill-rule="nonzero">
            <path d="M0,429.335022 L304.673844,303.002426 L208.288687,206.725776 L0,429.335022 Z M111.665611,110.745951 L207.969993,206.725776 L380,0 L111.665611,110.745951 Z" id="Shape" fill="#02121D"></path>
            <g id="Unedited-Copy-3" transform="translate(113.000000, 73.500000)">
                <path d="M90.49775,99.25 L92.09825,87.865 L88.99625,87.865 L87.39575,99.25 L90.49775,99.25 Z M95.15625,99.25 L95.96475,93.6235 C96.00875,93.2825 96.039,92.94975 96.0555,92.62525 C96.072,92.30075 96.07475,91.9735 96.06375,91.6435 L96.06375,91.6435 L96.22875,91.6435 C96.29475,91.9625 96.37175,92.276 96.45975,92.584 C96.54775,92.892 96.65225,93.1725 96.77325,93.4255 L96.77325,93.4255 L98.91825,98.2765 C99.05025,98.5845 99.18775,98.82375 99.33075,98.99425 C99.47375,99.16475 99.71025,99.25 100.04025,99.25 L100.04025,99.25 L101.26125,99.25 C101.61325,99.25 101.88,99.1675 102.0615,99.0025 C102.243,98.8375 102.35575,98.579 102.39975,98.227 L102.39975,98.227 L103.85175,87.865 L100.99725,87.865 L100.18875,93.508 C100.14475,93.816 100.12,94.11575 100.1145,94.40725 C100.109,94.69875 100.11725,95.0205 100.13925,95.3725 L100.13925,95.3725 L99.95775,95.3725 C99.86975,94.9985 99.768,94.6575 99.6525,94.3495 C99.537,94.0415 99.41875,93.75 99.29775,93.475 L99.29775,93.475 L97.20225,88.8385 C97.07025,88.5415 96.93275,88.305 96.78975,88.129 C96.64675,87.953 96.41575,87.865 96.09675,87.865 L96.09675,87.865 L94.87575,87.865 C94.52375,87.865 94.257,87.9475 94.0755,88.1125 C93.894,88.2775 93.78125,88.536 93.73725,88.888 L93.73725,88.888 L92.28525,99.25 L95.15625,99.25 Z M107.36075,99.25 L108.096833,99.2921667 C108.594278,99.3190556 109.105167,99.3435 109.6295,99.3655 C110.416,99.3985 111.26025,99.415 112.16225,99.415 C113.10825,99.415 113.91125,99.32975 114.57125,99.15925 C115.23125,98.98875 115.7785,98.69725 116.213,98.28475 C116.6475,97.87225 116.9995,97.28925 117.269,96.53575 C117.5385,95.78225 117.75575,94.828 117.92075,93.673 C118.14075,92.133 118.116,90.9285 117.8465,90.0595 C117.577,89.1905 117.071,88.58 116.3285,88.228 C115.586,87.876 114.60425,87.7 113.38325,87.7 C112.86625,87.7 112.3465,87.7055 111.824,87.7165 C111.3015,87.7275 110.79825,87.74675 110.31425,87.77425 C109.83025,87.80175 109.37925,87.832 108.96125,87.865 L108.96125,87.865 L107.36075,99.25 Z M112.12925,97.1215 C111.54625,97.1215 110.9495,97.11325 110.339,97.09675 L110.747,97.106 L111.747,89.994 L113.28425,89.9935 C113.605083,89.9935 113.872444,90.0259653 114.086333,90.0908958 L114.20825,90.13375 C114.43925,90.22725 114.60425,90.4005 114.70325,90.6535 C114.80225,90.9065 114.84625,91.2585 114.83525,91.7095 C114.82425,92.1605 114.76925,92.738 114.67025,93.442 C114.57125,94.212 114.45025,94.839 114.30725,95.323 C114.16425,95.807 113.99375,96.181 113.79575,96.445 C113.59775,96.709 113.36125,96.88775 113.08625,96.98125 C112.81125,97.07475 112.49225,97.1215 112.12925,97.1215 Z M121.35825,99.2995 C121.93025,99.2995 122.5325,99.29675 123.165,99.29125 C123.7975,99.28575 124.419,99.27475 125.0295,99.25825 C125.64,99.24175 126.20375,99.2005 126.72075,99.1345 L126.72075,99.1345 L126.77025,96.907 L122.71125,96.907 C122.43625,96.907 122.24375,96.84375 122.13375,96.71725 C122.02375,96.59075 121.98525,96.4065 122.01825,96.1645 L122.01825,96.1645 L122.26,94.432 L126.57225,94.432 L126.83625,92.3365 L122.553,92.337 L122.74425,90.967 C122.780917,90.7286667 122.850049,90.5514444 122.951646,90.4353333 L123.0165,90.373 C123.154,90.263 123.37125,90.208 123.66825,90.208 L123.66825,90.208 L127.76025,90.208 L128.10675,88.0135 C127.60075,87.9475 127.03975,87.90075 126.42375,87.87325 C125.80775,87.84575 125.16975,87.82925 124.50975,87.82375 C123.84975,87.81825 123.19525,87.8155 122.54625,87.8155 C121.74325,87.8155 121.1025,88.03 120.624,88.459 C120.1455,88.888 119.85125,89.471 119.74125,90.208 L119.74125,90.208 L118.88325,96.3955 C118.77325,97.2535 118.93,97.952 119.3535,98.491 C119.777,99.03 120.44525,99.2995 121.35825,99.2995 Z M127.94725,99.25 L131.03275,99.25 L131.608,95.157 L131.658719,95.1636719 L131.658719,95.1636719 L132.03925,95.2075 C132.55625,95.2625 133.07875,95.29 133.60675,95.29 C134.57475,95.29 135.35575,95.18825 135.94975,94.98475 C136.54375,94.78125 137.00025,94.4155 137.31925,93.8875 C137.63825,93.3595 137.86375,92.606 137.99575,91.627 C138.13875,90.626 138.0975,89.8395 137.872,89.2675 C137.6465,88.6955 137.21475,88.29125 136.57675,88.05475 C135.93875,87.81825 135.06975,87.7 133.96975,87.7 C133.28775,87.7 132.70475,87.70275 132.22075,87.70825 C131.73675,87.71375 131.2885,87.7275 130.876,87.7495 C130.4635,87.7715 130.02075,87.81 129.54775,87.865 L129.54775,87.865 L127.94725,99.25 Z M132.34,89.951 L132.389875,89.9501875 C132.849125,89.9460625 133.34825,89.944 133.88725,89.944 C134.21725,89.944 134.4675,89.988 134.638,90.076 C134.8085,90.164 134.91575,90.3125 134.95975,90.5215 C135.00375,90.7305 134.99825,91.022 134.94325,91.396 C134.87725,91.88 134.7865,92.24025 134.671,92.47675 C134.5555,92.71325 134.396,92.87 134.1925,92.947 C133.989,93.024 133.70575,93.0625 133.34275,93.0625 L133.34275,93.0625 L131.902,93.063 L132.34,89.951 Z M138.90875,87.865 L138.57875,90.2245 L141.843,90.225 L140.57525,99.25 L143.66075,99.25 L144.929,90.225 L148.19825,90.2245 L148.52825,87.865 L142.17575,87.865 L138.90875,87.865 Z M151.04175,99.25 L151.732,94.333 L155.032,94.333 L154.34175,99.25 L157.44375,99.25 L159.04425,87.865 L155.94225,87.865 L155.35,92.073 L152.05,92.073 L152.64225,87.865 L149.54025,87.865 L147.93975,99.25 L151.04175,99.25 Z" id="INDEPTH" fill="#FFFFFF"></path>
                <path d="M4.09458327,71.8325 C5.5979166,71.8325 7.11499993,71.81875 8.64583327,71.79125 C10.1766666,71.76375 11.5654166,71.6766667 12.8120833,71.53 L12.8120833,71.53 L12.8945833,67.625 L6.48708327,67.625 C6.02874993,67.625 5.7216666,67.5241667 5.56583327,67.3225 C5.40999993,67.1208333 5.3504166,66.8091667 5.38708327,66.3875 L5.38708327,66.3875 L7.36708327,52.775 L2.19708327,52.775 L0.134583266,67.515 C0.00624993245,68.3766667 0.0979165991,69.1329167 0.409583266,69.78375 C0.721249932,70.4345833 1.19333327,70.93875 1.82583327,71.29625 C2.45833327,71.65375 3.21458327,71.8325 4.09458327,71.8325 Z M19.3662499,71.75 L22.0337499,52.775 L16.8637499,52.775 L14.1962499,71.75 L19.3662499,71.75 Z M30.5129166,72.135 C31.9795833,72.135 33.2537499,71.9883333 34.3354166,71.695 C35.4170833,71.4016667 36.3291666,70.8975 37.0716666,70.1825 C37.8141666,69.4675 38.4237499,68.4820833 38.9004166,67.22625 C39.3770833,65.9704167 39.7437499,64.38 40.0004166,62.455 C40.3487499,59.8516667 40.3029166,57.8258333 39.8629166,56.3775 C39.4229166,54.9291667 38.5887499,53.9025 37.3604166,53.2975 C36.1320833,52.6925 34.5187499,52.39 32.5204166,52.39 C31.0537499,52.39 29.7887499,52.54125 28.7254166,52.84375 C27.6620833,53.14625 26.7637499,53.6595833 26.0304166,54.38375 C25.2970833,55.1079167 24.6966666,56.0979167 24.2291666,57.35375 C23.7616666,58.6095833 23.3904166,60.1816667 23.1154166,62.07 C22.7670833,64.655 22.7899999,66.67625 23.1841666,68.13375 C23.5783333,69.59125 24.3804166,70.6225 25.5904166,71.2275 C26.8004166,71.8325 28.4412499,72.135 30.5129166,72.135 Z M30.6504166,68.2025 C29.8620833,68.2025 29.2754166,68.0466667 28.8904166,67.735 C28.5054166,67.4233333 28.2899999,66.855 28.2441666,66.03 C28.1983333,65.205 28.2945833,64.0133333 28.5329166,62.455 C28.7895833,60.7866667 29.0599999,59.5125 29.3441666,58.6325 C29.6283333,57.7525 30.0133333,57.1475 30.4991666,56.8175 C30.9849999,56.4875 31.6312499,56.3225 32.4379166,56.3225 C33.2262499,56.3225 33.8174999,56.4783333 34.2116666,56.79 C34.6058333,57.1016667 34.8258333,57.67 34.8716666,58.495 C34.9174999,59.32 34.8212499,60.5116667 34.5829166,62.07 C34.3262499,63.72 34.0512499,64.9895833 33.7579166,65.87875 C33.4645833,66.7679167 33.0795833,67.3775 32.6029166,67.7075 C32.1262499,68.0375 31.4754166,68.2025 30.6504166,68.2025 Z M34.9679166,78.9275 L36.8379166,74.665 C35.2062499,74.4083333 33.7120833,74.12875 32.3554166,73.82625 C30.9987499,73.52375 29.6970833,73.1158333 28.4504166,72.6025 L28.4504166,72.6025 L26.9654166,75.105 C27.9370833,75.8566667 29.0829166,76.5579167 30.4029166,77.20875 C31.7229166,77.8595833 33.2445833,78.4325 34.9679166,78.9275 L34.9679166,78.9275 Z M49.2495833,72.135 C51.15625,72.135 52.7008333,71.8783333 53.8833333,71.365 C55.0658333,70.8516667 55.9779166,70.0129167 56.6195833,68.84875 C57.26125,67.6845833 57.7195833,66.1125 57.9945833,64.1325 L57.9945833,64.1325 L59.6170833,52.775 L54.4470833,52.775 L52.8795833,63.94 C52.69625,65.0216667 52.4854166,65.8741667 52.2470833,66.4975 C52.00875,67.1208333 51.6604166,67.5608333 51.2020833,67.8175 C50.74375,68.0741667 50.1204166,68.2025 49.3320833,68.2025 C48.5804166,68.2025 48.0166666,68.0833333 47.6408333,67.845 C47.265,67.6066667 47.045,67.1895833 46.9808333,66.59375 C46.9166666,65.9979167 46.9579166,65.1775 47.1045833,64.1325 L47.1045833,64.1325 L48.7270833,52.775 L43.5570833,52.775 L41.9620833,63.94 C41.7054166,65.92 41.80625,67.5104167 42.2645833,68.71125 C42.7229166,69.9120833 43.5341666,70.7829167 44.6983333,71.32375 C45.8625,71.8645833 47.3795833,72.135 49.2495833,72.135 Z M64.93375,71.75 L67.60125,52.775 L62.43125,52.775 L59.76375,71.75 L64.93375,71.75 Z M67.9129166,71.75 L68.8298698,71.8032813 C69.756276,71.8548438 70.7110416,71.90125 71.6941666,71.9425 C73.005,71.9975 74.4120833,72.025 75.9154166,72.025 C77.4920833,72.025 78.8304166,71.8829167 79.9304166,71.59875 C81.0304166,71.3145833 81.9425,70.82875 82.6666666,70.14125 C83.3908333,69.45375 83.9775,68.4820833 84.4266666,67.22625 C84.8758333,65.9704167 85.2379166,64.38 85.5129166,62.455 C85.8795833,59.8883333 85.8383333,57.8808333 85.3891666,56.4325 C84.94,54.9841667 84.0966666,53.9666667 82.8591666,53.38 C81.6216666,52.7933333 79.9854166,52.5 77.9504166,52.5 C77.08875,52.5 76.2225,52.5091667 75.3516666,52.5275 C74.4808333,52.5458333 73.6420833,52.5779167 72.8354166,52.62375 C72.02875,52.6695833 71.2770833,52.72 70.5804166,52.775 L70.5804166,52.775 L67.9129166,71.75 Z M75.8604166,68.2025 C74.88875,68.2025 73.8941666,68.18875 72.8766666,68.16125 L73.557,68.178 L75.223,56.323 L77.7854166,56.3225 C78.3354166,56.3225 78.7911309,56.3797449 79.1525595,56.4942347 L79.3254166,56.55625 C79.7104166,56.7120833 79.9854166,57.0008333 80.1504166,57.4225 C80.3154166,57.8441667 80.38875,58.4308333 80.3704166,59.1825 C80.3520833,59.9341667 80.2604166,60.8966667 80.0954166,62.07 C79.9304166,63.3533333 79.72875,64.3983333 79.4904166,65.205 C79.2520833,66.0116667 78.9679166,66.635 78.6379166,67.075 C78.3079166,67.515 77.91375,67.8129167 77.4554166,67.96875 C76.9970833,68.1245833 76.4654166,68.2025 75.8604166,68.2025 Z M91.7645833,71.75 L94.4320833,52.775 L89.2620833,52.775 L86.5945833,71.75 L91.7645833,71.75 Z M96.09125,52.775 L95.54125,56.7075 L100.983,56.708 L98.86875,71.75 L104.01125,71.75 L106.125,56.708 L111.57375,56.7075 L112.12375,52.775 L101.53625,52.775 L96.09125,52.775 Z M120.712917,71.75 L121.535,65.747 L129.622917,52.775 L124.122917,52.775 L120.465417,59.32 C120.245417,59.7416667 120.0575,60.1908333 119.901667,60.6675 C119.745833,61.1441667 119.63125,61.5658333 119.557917,61.9325 L119.557917,61.9325 L119.200417,61.9325 C119.200417,61.5291667 119.186667,61.1166667 119.159167,60.695 C119.131667,60.2733333 119.05375,59.8058333 118.925417,59.2925 L118.925417,59.2925 L117.165417,52.775 L111.995417,52.775 L116.382,65.562 L115.515417,71.75 L120.712917,71.75 Z M132.94125,71.75 L138.08375,71.75 L139.042,64.928 L139.25195,64.95475 L139.25195,64.95475 L139.76125,65.0125 C140.622917,65.1041667 141.49375,65.15 142.37375,65.15 C143.987083,65.15 145.28875,64.9804167 146.27875,64.64125 C147.26875,64.3020833 148.029583,63.6925 148.56125,62.8125 C149.092917,61.9325 149.46875,60.6766667 149.68875,59.045 C149.927083,57.3766667 149.858333,56.0658333 149.4825,55.1125 C149.106667,54.1591667 148.387083,53.4854167 147.32375,53.09125 C146.260417,52.6970833 144.812083,52.5 142.97875,52.5 C141.842083,52.5 140.870417,52.5045833 140.06375,52.51375 C139.257083,52.5229167 138.51,52.5458333 137.8225,52.5825 C137.135,52.6191667 136.397083,52.6833333 135.60875,52.775 L135.60875,52.775 L132.94125,71.75 Z M140.262,56.252 L140.345625,56.2503125 C141.111042,56.2434375 141.942917,56.24 142.84125,56.24 C143.39125,56.24 143.808333,56.3133333 144.0925,56.46 C144.376667,56.6066667 144.555417,56.8541667 144.62875,57.2025 C144.702083,57.5508333 144.692917,58.0366667 144.60125,58.66 C144.49125,59.4666667 144.34,60.0670833 144.1475,60.46125 C143.955,60.8554167 143.689167,61.1166667 143.35,61.245 C143.010833,61.3733333 142.53875,61.4375 141.93375,61.4375 L141.93375,61.4375 L139.533,61.438 L140.262,56.252 Z M158.030417,72.135 C159.497083,72.135 160.77125,71.9883333 161.852917,71.695 C162.934583,71.4016667 163.846667,70.8975 164.589167,70.1825 C165.331667,69.4675 165.94125,68.4820833 166.417917,67.22625 C166.894583,65.9704167 167.26125,64.38 167.517917,62.455 C167.86625,59.8516667 167.820417,57.8258333 167.380417,56.3775 C166.940417,54.9291667 166.10625,53.9025 164.877917,53.2975 C163.649583,52.6925 162.03625,52.39 160.037917,52.39 C158.57125,52.39 157.30625,52.54125 156.242917,52.84375 C155.179583,53.14625 154.28125,53.6595833 153.547917,54.38375 C152.814583,55.1079167 152.214167,56.0979167 151.746667,57.35375 C151.279167,58.6095833 150.907917,60.1816667 150.632917,62.07 C150.284583,64.655 150.3075,66.67625 150.701667,68.13375 C151.095833,69.59125 151.897917,70.6225 153.107917,71.2275 C154.317917,71.8325 155.95875,72.135 158.030417,72.135 Z M158.167917,68.2025 C157.379583,68.2025 156.792917,68.0466667 156.407917,67.735 C156.022917,67.4233333 155.8075,66.855 155.761667,66.03 C155.715833,65.205 155.812083,64.0133333 156.050417,62.455 C156.307083,60.7866667 156.5775,59.5125 156.861667,58.6325 C157.145833,57.7525 157.530833,57.1475 158.016667,56.8175 C158.5025,56.4875 159.14875,56.3225 159.955417,56.3225 C160.74375,56.3225 161.335,56.4783333 161.729167,56.79 C162.123333,57.1016667 162.343333,57.67 162.389167,58.495 C162.435,59.32 162.33875,60.5116667 162.100417,62.07 C161.84375,63.72 161.56875,64.9895833 161.275417,65.87875 C160.982083,66.7679167 160.597083,67.3775 160.120417,67.7075 C159.64375,68.0375 158.992917,68.2025 158.167917,68.2025 Z M176.739583,72.135 C178.20625,72.135 179.480417,71.9883333 180.562083,71.695 C181.64375,71.4016667 182.555833,70.8975 183.298333,70.1825 C184.040833,69.4675 184.650417,68.4820833 185.127083,67.22625 C185.60375,65.9704167 185.970417,64.38 186.227083,62.455 C186.575417,59.8516667 186.529583,57.8258333 186.089583,56.3775 C185.649583,54.9291667 184.815417,53.9025 183.587083,53.2975 C182.35875,52.6925 180.745417,52.39 178.747083,52.39 C177.280417,52.39 176.015417,52.54125 174.952083,52.84375 C173.88875,53.14625 172.990417,53.6595833 172.257083,54.38375 C171.52375,55.1079167 170.923333,56.0979167 170.455833,57.35375 C169.988333,58.6095833 169.617083,60.1816667 169.342083,62.07 C168.99375,64.655 169.016667,66.67625 169.410833,68.13375 C169.805,69.59125 170.607083,70.6225 171.817083,71.2275 C173.027083,71.8325 174.667917,72.135 176.739583,72.135 Z M176.877083,68.2025 C176.08875,68.2025 175.502083,68.0466667 175.117083,67.735 C174.732083,67.4233333 174.516667,66.855 174.470833,66.03 C174.425,65.205 174.52125,64.0133333 174.759583,62.455 C175.01625,60.7866667 175.286667,59.5125 175.570833,58.6325 C175.855,57.7525 176.24,57.1475 176.725833,56.8175 C177.211667,56.4875 177.857917,56.3225 178.664583,56.3225 C179.452917,56.3225 180.044167,56.4783333 180.438333,56.79 C180.8325,57.1016667 181.0525,57.67 181.098333,58.495 C181.144167,59.32 181.047917,60.5116667 180.809583,62.07 C180.552917,63.72 180.277917,64.9895833 179.984583,65.87875 C179.69125,66.7679167 179.30625,67.3775 178.829583,67.7075 C178.352917,68.0375 177.702083,68.2025 176.877083,68.2025 Z M191.76375,71.8325 C193.267083,71.8325 194.784167,71.81875 196.315,71.79125 C197.845833,71.76375 199.234583,71.6766667 200.48125,71.53 L200.48125,71.53 L200.56375,67.625 L194.15625,67.625 C193.697917,67.625 193.390833,67.5241667 193.235,67.3225 C193.079167,67.1208333 193.019583,66.8091667 193.05625,66.3875 L193.05625,66.3875 L195.03625,52.775 L189.86625,52.775 L187.80375,67.515 C187.675417,68.3766667 187.767083,69.1329167 188.07875,69.78375 C188.390417,70.4345833 188.8625,70.93875 189.495,71.29625 C190.1275,71.65375 190.88375,71.8325 191.76375,71.8325 Z M207.035417,71.75 L209.702917,52.775 L204.532917,52.775 L201.865417,71.75 L207.035417,71.75 Z M214.799583,71.75 L216.147083,62.3725 C216.220417,61.8041667 216.270833,61.2495833 216.298333,60.70875 C216.325833,60.1679167 216.330417,59.6225 216.312083,59.0725 L216.312083,59.0725 L216.587083,59.0725 C216.697083,59.6041667 216.825417,60.1266667 216.972083,60.64 C217.11875,61.1533333 217.292917,61.6208333 217.494583,62.0425 L217.494583,62.0425 L221.069583,70.1275 C221.289583,70.6408333 221.51875,71.0395833 221.757083,71.32375 C221.995417,71.6079167 222.389583,71.75 222.939583,71.75 L222.939583,71.75 L224.974583,71.75 C225.56125,71.75 226.005833,71.6125 226.308333,71.3375 C226.610833,71.0625 226.79875,70.6316667 226.872083,70.045 L226.872083,70.045 L229.292083,52.775 L224.534583,52.775 L223.187083,62.18 C223.11375,62.6933333 223.0725,63.1929167 223.063333,63.67875 C223.054167,64.1645833 223.067917,64.7008333 223.104583,65.2875 L223.104583,65.2875 L222.802083,65.2875 C222.655417,64.6641667 222.485833,64.0958333 222.293333,63.5825 C222.100833,63.0691667 221.90375,62.5833333 221.702083,62.125 L221.702083,62.125 L218.209583,54.3975 C217.989583,53.9025 217.760417,53.5083333 217.522083,53.215 C217.28375,52.9216667 216.89875,52.775 216.367083,52.775 L216.367083,52.775 L214.332083,52.775 C213.745417,52.775 213.300833,52.9125 212.998333,53.1875 C212.695833,53.4625 212.507917,53.8933333 212.434583,54.48 L212.434583,54.48 L210.014583,71.75 L214.799583,71.75 Z M235.29625,72.135 C236.157917,72.135 236.937083,72.0020833 237.63375,71.73625 C238.330417,71.4704167 238.949167,71.13125 239.49,70.71875 C240.030833,70.30625 240.502917,69.8891667 240.90625,69.4675 L240.90625,69.4675 L240.931,69.441 L241.12625,71.75 L244.89375,71.75 L246.43375,60.805 L241.51125,60.805 L240.727,66.425 L240.496806,66.6013889 L240.496806,66.6013889 L240.19125,66.84125 C239.879583,67.08875 239.526667,67.295 239.1325,67.46 C238.738333,67.625 238.23875,67.7075 237.63375,67.7075 C236.955417,67.7075 236.45125,67.5608333 236.12125,67.2675 C235.79125,66.9741667 235.603333,66.4470833 235.5575,65.68625 C235.511667,64.9254167 235.589583,63.8483333 235.79125,62.455 C235.937917,61.3366667 236.12125,60.4108333 236.34125,59.6775 C236.56125,58.9441667 236.83625,58.3666667 237.16625,57.945 C237.49625,57.5233333 237.90875,57.2254167 238.40375,57.05125 C238.89875,56.8770833 239.50375,56.79 240.21875,56.79 C240.952083,56.79 241.630417,56.7945833 242.25375,56.80375 L242.25375,56.80375 L244.12375,56.83125 C244.747083,56.8404167 245.379583,56.8541667 246.02125,56.8725 L246.02125,56.8725 L246.62625,53.16 C246.002917,52.9766667 245.352083,52.83 244.67375,52.72 C243.995417,52.61 243.307917,52.5275 242.61125,52.4725 C241.914583,52.4175 241.199583,52.39 240.46625,52.39 C238.92625,52.39 237.587917,52.5275 236.45125,52.8025 C235.314583,53.0775 234.342917,53.5679167 233.53625,54.27375 C232.729583,54.9795833 232.074167,55.965 231.57,57.23 C231.065833,58.495 230.67625,60.1083333 230.40125,62.07 C230.07125,64.545 230.066667,66.5204167 230.3875,67.99625 C230.708333,69.4720833 231.290417,70.5308333 232.13375,71.1725 C232.977083,71.8141667 234.03125,72.135 235.29625,72.135 Z" id="LIQUIDITYPOOLING" fill="url(#linearGradient-1)"></path>
                <path d="M33.6709167,0.975 L32.5784167,8.67 L41.613,8.67 L38.0884167,33.75 L48.3959167,33.75 L51.921,8.67 L60.9834167,8.67 L62.0759167,0.975 L42.6959167,0.975 L33.6709167,0.975 Z M70.21425,33.75 L72.144,20.023 L79.981,20.023 L78.05175,33.75 L88.35925,33.75 L92.96675,0.975 L82.65925,0.975 L81.009,12.708 L73.172,12.708 L74.82175,0.975 L64.51425,0.975 L59.90675,33.75 L70.21425,33.75 Z M107.565083,34.415 C110.130083,34.415 112.3705,34.1695833 114.286333,33.67875 C116.202167,33.1879167 117.825083,32.3408333 119.155083,31.1375 C120.485083,29.9341667 121.569667,28.24 122.408833,26.055 C123.248,23.87 123.88925,21.0991667 124.332583,17.7425 C124.93425,13.1825 124.831333,9.64375 124.023833,7.12625 C123.216333,4.60875 121.70425,2.84333333 119.487583,1.83 C117.270917,0.816666667 114.357583,0.31 110.747583,0.31 C108.182583,0.31 105.965917,0.555416667 104.097583,1.04625 C102.22925,1.53708333 100.645917,2.4 99.3475833,3.635 C98.04925,4.87 96.9884167,6.57208333 96.1650833,8.74125 C95.34175,10.9104167 94.6925833,13.6575 94.2175833,16.9825 C93.6159167,21.4791667 93.6634167,24.9941667 94.3600833,27.5275 C95.05675,30.0608333 96.4896667,31.8420833 98.6588333,32.87125 C100.828,33.9004167 103.79675,34.415 107.565083,34.415 Z M107.802583,26.7675 C106.69425,26.7675 105.870917,26.5379167 105.332583,26.07875 C104.79425,25.6195833 104.50925,24.7408333 104.477583,23.4425 C104.445917,22.1441667 104.620083,20.2441667 105.000083,17.7425 C105.443417,15.0191667 105.870917,12.9608333 106.282583,11.5675 C106.69425,10.1741667 107.2405,9.22416667 107.921333,8.7175 C108.602167,8.21083333 109.512583,7.9575 110.652583,7.9575 C111.792583,7.9575 112.63175,8.195 113.170083,8.67 C113.708417,9.145 113.993417,10.02375 114.025083,11.30625 C114.05675,12.58875 113.882583,14.4808333 113.502583,16.9825 C113.090917,19.6741667 112.671333,21.7245833 112.243833,23.13375 C111.816333,24.5429167 111.270083,25.5008333 110.605083,26.0075 C109.940083,26.5141667 109.005917,26.7675 107.802583,26.7675 Z M125.488417,33.75 L135.558417,33.75 L137.246,21.743 L137.517792,21.744375 C138.366006,21.7511607 139.298557,21.7608546 140.315445,21.7734566 L140.830917,21.78 C141.55925,21.78 142.050083,21.8908333 142.303417,22.1125 C142.55675,22.3341667 142.69925,22.9041667 142.730917,23.8225 L142.730917,23.8225 L143.585917,33.75 L154.225917,33.75 L152.990917,23.87 C152.86425,22.54 152.5555,21.5108333 152.064667,20.7825 C151.573833,20.0541667 151.019667,19.52375 150.402167,19.19125 C149.784667,18.85875 149.20675,18.6608333 148.668417,18.5975 L148.668417,18.5975 L148.715917,18.265 C150.48925,18.075 151.882583,17.6316667 152.895917,16.935 C153.90925,16.2383333 154.661333,15.3595833 155.152167,14.29875 C155.643,13.2379167 155.967583,12.09 156.125917,10.855 C156.47425,8.22666667 156.205083,6.16041667 155.318417,4.65625 C154.43175,3.15208333 152.975083,2.08333333 150.948417,1.45 C148.92175,0.816666667 146.388417,0.5 143.348417,0.5 C141.353417,0.5 139.627583,0.507916667 138.170917,0.52375 C136.71425,0.539583333 135.3605,0.579166667 134.109667,0.6425 C132.858833,0.705833333 131.520917,0.816666667 130.095917,0.975 L130.095917,0.975 L125.488417,33.75 Z M139.208,7.781 L139.678671,7.77751953 C140.79121,7.77083984 141.982792,7.7675 143.253417,7.7675 C144.045083,7.7675 144.64675,7.85458333 145.058417,8.02875 C145.470083,8.20291667 145.73925,8.51166667 145.865917,8.955 C145.992583,9.39833333 145.992583,10 145.865917,10.76 C145.707583,11.7733333 145.493833,12.5570833 145.224667,13.11125 C144.9555,13.6654167 144.559667,14.0375 144.037167,14.2275 C143.514667,14.4175 142.778417,14.5125 141.828417,14.5125 L141.828417,14.5125 L138.262,14.513 L139.208,7.781 Z M165.35425,33.75 C166.215917,33.75 166.81125,33.327 167.14025,32.481 L167.14025,32.481 L173.17975,17.535 L167.82175,17.535 L164.29675,27.9925 C164.187083,28.3215 164.08525,28.6505 163.99125,28.9795 C163.89725,29.3085 163.818917,29.6531667 163.75625,30.0135 L163.75625,30.0135 L163.14525,30.0135 C163.160917,29.6688333 163.172667,29.3163333 163.1805,28.956 C163.188333,28.5956667 163.176583,28.2431667 163.14525,27.8985 L163.14525,27.8985 L162.58125,17.535 L157.45825,17.535 L159.29125,32.293 C159.33825,32.7003333 159.510583,33.045 159.80825,33.327 C160.105917,33.609 160.474083,33.75 160.91275,33.75 L160.91275,33.75 L165.35425,33.75 Z M176.900583,33.75 L179.180083,17.535 L174.104083,17.535 L171.824583,33.75 L176.900583,33.75 Z M183.229917,33.844 C184.075917,33.844 184.968917,33.8400833 185.908917,33.83225 C186.848917,33.8244167 187.77325,33.8048333 188.681917,33.7735 C189.590583,33.7421667 190.420917,33.6716667 191.172917,33.562 L191.172917,33.562 L191.266917,29.943 L185.626917,29.943 C185.28225,29.943 185.039417,29.8646667 184.898417,29.708 C184.757417,29.5513333 184.710417,29.3241667 184.757417,29.0265 L184.757417,29.0265 L185.019,27.147 L190.914417,27.1465 L191.337417,23.7625 L185.491,23.763 L185.697417,22.282 C185.737702,21.9731429 185.826906,21.7477347 185.965029,21.6057755 L186.038167,21.54175 C186.218333,21.4085833 186.50425,21.342 186.895917,21.342 L186.895917,21.342 L192.535917,21.342 L193.099917,17.77 C192.37925,17.6603333 191.564583,17.5859167 190.655917,17.54675 C189.74725,17.5075833 188.803333,17.4801667 187.824167,17.4645 C186.845,17.4488333 185.877583,17.441 184.921917,17.441 C183.73125,17.441 182.7795,17.7660833 182.066667,18.41625 C181.353833,19.0664167 180.919083,19.9398333 180.762417,21.0365 L180.762417,21.0365 L179.587417,29.426 C179.43075,30.7106667 179.66575,31.7681667 180.292417,32.5985 C180.919083,33.4288333 181.89825,33.844 183.229917,33.844 Z M200.06375,33.75 C200.502417,33.75 200.882333,33.6403333 201.2035,33.421 C201.524667,33.2016667 201.740083,32.8883333 201.84975,32.481 L201.84975,32.481 L204.17625,23.551 C204.27025,23.1593333 204.356417,22.7598333 204.43475,22.3525 C204.513083,21.9451667 204.583583,21.5456667 204.64625,21.154 L204.64625,21.154 L205.06925,21.154 C205.053583,21.5926667 205.034,22 205.0105,22.376 C204.987,22.752 204.967417,23.1671667 204.95175,23.6215 L204.95175,23.6215 L204.78725,32.293 C204.771583,32.7003333 204.92825,33.045 205.25725,33.327 C205.58625,33.609 205.970083,33.75 206.40875,33.75 L206.40875,33.75 L210.68575,33.75 C211.140083,33.75 211.523917,33.6403333 211.83725,33.421 C212.150583,33.2016667 212.362083,32.8883333 212.47175,32.481 L212.47175,32.481 L216.56075,17.535 L211.55525,17.535 L209.39325,27.4285 C209.29925,27.8201667 209.20525,28.2823333 209.11125,28.815 C209.01725,29.3476667 208.94675,29.8333333 208.89975,30.272 L208.89975,30.272 L208.47675,30.272 C208.492417,29.849 208.504167,29.4025 208.512,28.9325 C208.519833,28.4625 208.52375,28.016 208.52375,27.593 L208.52375,27.593 L208.52375,19.133 C208.52375,18.6786667 208.374917,18.29875 208.07725,17.99325 C207.779583,17.68775 207.403583,17.535 206.94925,17.535 L206.94925,17.535 L203.40075,17.535 C202.445083,17.535 201.841917,18.005 201.59125,18.945 L201.59125,18.945 L199.33525,27.358 C199.225583,27.781 199.112,28.2470833 198.9945,28.75625 C198.877,29.2654167 198.77125,29.7706667 198.67725,30.272 L198.67725,30.272 L198.27775,30.272 C198.309083,29.755 198.344333,29.27325 198.3835,28.82675 C198.422667,28.38025 198.450083,27.9611667 198.46575,27.5695 L198.46575,27.5695 L199.10025,17.535 L194.09475,17.535 L194.04775,32.293 C194.032083,32.7003333 194.18875,33.045 194.51775,33.327 C194.84675,33.609 195.230583,33.75 195.66925,33.75 L195.66925,33.75 L200.06375,33.75 Z" id="THORVIEW" fill="#FFFFFF"></path>
            </g>
            <g id="logo" transform="translate(126.500000, 57.000000)" fill="#FFFFFF">
                <path d="M0,17.25 L12.2121634,12.1783219 L8.34878189,8.31325301 L0,17.25 Z M4.4854004,4.45352839 L8.34878189,8.31325301 L15.25,0 L4.4854004,4.45352839 Z" id="Shape"></path>
                <polygon id="Path" points="21.3391768 6.2643909 19.5 6.2643909 19.5 5.25 24.25 5.25 24.25 6.26622084 22.4166159 6.26622084 22.4166159 12 21.3391768 12"></polygon>
                <polygon id="Path" points="26.25 5.25 27.4072581 5.25 27.4072581 8.16829268 30.3333333 8.16829268 30.3333333 5.25 31.5 5.25 31.5 12 30.3333333 12 30.3333333 9.18292682 27.4072581 9.18292682 27.4072581 12 26.25 12"></polygon>
                <path d="M35.1205875,11.7435609 C34.7499995,11.5718054 34.4705879,11.2462687 34.2823527,10.766951 C34.0941176,10.2876333 34,9.58223736 34,8.65076325 C34,7.72208519 34.0954901,7.01209579 34.2864704,6.52079514 C34.4774507,6.02949449 34.7584308,5.69437151 35.129411,5.51542621 C35.5,5.33887754 35.9970574,5.25040347 36.6205864,5.25000133 C37.2441154,5.24960461 37.7454876,5.33807865 38.124703,5.51542621 C38.4980361,5.69237436 38.7790163,6.02490101 38.9676436,6.51300621 C39.156271,7.00111145 39.2503885,7.71269855 39.2499988,8.64776752 C39.2499988,9.57644563 39.1543102,10.2818415 38.9629377,10.7639553 C38.7715653,11.246069 38.4921538,11.5726042 38.124703,11.7435609 C37.7572523,11.9141181 37.2558801,11.9995964 36.6205864,11.9999986 C35.9852927,12.0003953 35.4852931,11.9149169 35.1205875,11.7435609 Z M37.551174,10.8220726 C37.7660758,10.7022431 37.9205855,10.4761649 38.0147031,10.143838 C38.1088207,9.81151101 38.1558795,9.31222174 38.1558795,8.64597009 C38.1558795,7.95695085 38.107252,7.44168431 38.0099972,7.10017042 C37.9127424,6.75865657 37.7584288,6.53078091 37.5470564,6.41654356 C37.3352918,6.30350442 37.0264685,6.24678517 36.6205864,6.24638576 C36.226469,6.24638576 35.9235281,6.30470272 35.7117635,6.42133672 C35.499999,6.53797068 35.3441167,6.76564661 35.2441168,7.10436445 C35.1441168,7.44268289 35.0941169,7.95655145 35.0941169,8.64597009 C35.0941169,9.3170149 35.139607,9.81630421 35.2305874,10.143838 C35.3215677,10.4713718 35.4741166,10.6974499 35.6882341,10.8220726 C35.8999987,10.941902 36.2117632,11.0018167 36.6235276,11.0018167 C37.0274489,11.0018167 37.3366643,10.941902 37.551174,10.8220726 L37.551174,10.8220726 Z" id="Shape"></path>
                <path d="M42.25,5.25 L44.9851247,5.25 C45.5564618,5.25 46.0092768,5.40105719 46.3435701,5.70317157 C46.6778631,6.00528595 46.8450094,6.55218216 46.8450094,7.34386013 C46.8450094,7.94158306 46.7400616,8.37747355 46.5301661,8.65153156 C46.3207251,8.92621205 46.0331085,9.13060536 45.7053742,9.23766603 L47,12 L45.8603648,12 L44.6933782,9.40234479 C44.3226166,9.40234479 43.8819577,9.39604226 43.3714013,9.38343724 L43.3714013,12 L42.25,12 L42.25,5.25 Z M44.7936659,8.49783138 C45.0854125,8.49783138 45.3117188,8.41406886 45.4725848,8.24654376 C45.6334504,8.07901867 45.7144913,7.77873406 45.7157067,7.34568985 C45.7157067,6.93094332 45.6346662,6.64631335 45.4725848,6.49179991 C45.3105034,6.33728652 45.0841971,6.26104633 44.7936659,6.26307939 L43.3714013,6.26307939 L43.3714013,8.49478176 L44.7936659,8.49783138 Z" id="Shape"></path>
                <path d="M50.2431271,11.7351505 C49.9207214,11.5581865 49.6745033,11.2240322 49.5044724,10.7326875 C49.334442,10.2413429 49.2496185,9.53148963 49.25,8.6031278 C49.25,7.72150365 49.336361,7.03681685 49.5090783,6.54906739 C49.6817957,6.06131793 49.9351146,5.72276944 50.2690346,5.53342201 C50.6021871,5.34447397 51.0339802,5.25 51.5644145,5.25 C51.9128063,5.25035165 52.2606403,5.27900054 52.6047485,5.33568572 C52.906769,5.3822038 53.205467,5.44966417 53.4988485,5.53761641 L53.4988485,6.39327517 C53.3261312,6.35772259 53.0799131,6.32496627 52.7601942,6.29500624 C52.440475,6.26504621 52.1142313,6.25006616 51.7814627,6.25006616 C51.4014844,6.25006616 51.1092084,6.3113844 50.9046343,6.43402081 C50.7000602,6.55665726 50.5519073,6.78595144 50.460175,7.12190336 C50.3680592,7.45745583 50.3220013,7.95678987 50.3220013,8.61990545 C50.3220013,9.28302103 50.3651807,9.7833537 50.4515392,10.1209035 C50.5378981,10.4572549 50.6818291,10.6879472 50.8833324,10.8129805 C51.084836,10.9380137 51.3813343,11.0009298 51.7728269,11.0017287 C52.3499789,11.0067372 52.926857,10.9737151 53.5,10.9028606 L53.5,11.7567218 C52.9760906,11.9165087 52.3226437,11.9976005 51.5396585,12 C50.9977096,12.0003968 50.5655325,11.9121145 50.2431271,11.7351505 Z" id="Path"></path>
                <polygon id="Path" points="56 5.25 57.1572578 5.25 57.1572578 8.16829268 60.0833332 8.16829268 60.0833332 5.25 61.25 5.25 61.25 12 60.0833332 12 60.0833332 9.18292682 57.1572578 9.18292682 57.1572578 12 56 12"></polygon>
                <path d="M65.6660546,5.25 L67.0779117,5.25 L69.25,12 L68.0825026,12 L67.5666317,10.397561 L65.1532002,10.397561 L64.6463799,11.9981707 L63.5,11.9981707 L65.6660546,5.25 Z M67.2951208,9.38414632 L66.3538826,6.22012193 L65.4126441,9.38414632 L67.2951208,9.38414632 Z" id="Shape"></path>
                <polygon id="Path" points="71.75 5.25 73 5.25 73 12 71.75 12"></polygon>
                <polygon id="Path" points="75.5 5.25 76.4297855 5.25 79.5854202 10.0701219 79.5854202 5.25 80.75 5.25 80.75 12 79.8202145 12 76.6645798 7.18292683 76.6645798 12 75.5 12"></polygon>
            </g>
        </g>
    </g>
</svg>