<?xml version="1.0" encoding="UTF-8"?>
<svg width="52px" height="52px" viewBox="0 0 52 52" version="1.1" xmlns="http://www.w3.org/2000/svg" xmlns:xlink="http://www.w3.org/1999/xlink">
    <title>RUNEBase</title>
    <defs>
        <linearGradient x1="0%" y1="100%" x2="100%" y2="0%" id="linearGradient-1">
            <stop stop-color="#FFE43E" offset="0%"></stop>
            <stop stop-color="#F93C35" offset="100%"></stop>
        </linearGradient>
        <circle id="path-2" cx="26" cy="26" r="26"></circle>
    </defs>
    <g id="⚡-Active---THORChain.org" stroke="none" stroke-width="1" fill="none" fill-rule="evenodd">
        <g id="Mobile:-Post-Builder" transform="translate(0.000000, -3.000000)">
            <g id="RUNEBase" transform="translate(0.000000, 3.000000)">
                <mask id="mask-3" fill="white">
                    <use xlink:href="#path-2"></use>
                </mask>
                <use id="Oval" fill="url(#linearGradient-1)" xlink:href="#path-2"></use>
                <path d="M25.7893042,11 L16,11 L16.003654,16.9739106 L25.417012,16.9739106 C26.8711562,16.9739106 28.3568313,17.4045493 29.1391678,18.1650982 C29.9332076,18.9962934 30.330327,19.957788 30.330327,21.049639 C30.330327,23.3366828 28.5636004,25.2741309 26.3662351,25.2741309 L24.3561522,25.2741309 L24.3561522,25.255468 L16.0088589,25.255468 L16.0186694,41 L22.0484855,41 L22.0484855,27.7307884 L30.6650946,41 L38.0350955,41 L31.0560498,30.131372 C32.7598565,29.4610982 33.5943469,28.8337746 34.6480766,27.3584677 C35.9133761,25.5719136 36.5462957,23.6675587 36.5462957,21.6452044 L36.5462957,20.8634928 C36.5462957,17.5444785 35.4694717,15.8785941 33.6430352,14.0522144 C31.8304893,12.261226 29.1293392,11 25.7893042,11 Z" id="Combined-Shape-path" fill="#000B12" mask="url(#mask-3)"></path>
            </g>
        </g>
    </g>
</svg>