<?xml version="1.0" encoding="UTF-8"?>
<svg width="52px" height="52px" viewBox="0 0 52 52" version="1.1" xmlns="http://www.w3.org/2000/svg" xmlns:xlink="http://www.w3.org/1999/xlink">
    <title>Puzzle</title>
    <defs>
        <linearGradient x1="0%" y1="100%" x2="100%" y2="0%" id="linearGradient-1">
            <stop stop-color="#F0425C" offset="0%"></stop>
            <stop stop-color="#EC1D94" offset="100%"></stop>
        </linearGradient>
        <circle id="path-2" cx="26" cy="26" r="26"></circle>
    </defs>
    <g id="⚡-Active---THORChain.org" stroke="none" stroke-width="1" fill="none" fill-rule="evenodd">
        <g id="Mobile:-Post-Builder" transform="translate(0.000000, -3.000000)">
            <g id="Puzzle" transform="translate(0.000000, 3.000000)">
                <mask id="mask-3" fill="white">
                    <use xlink:href="#path-2"></use>
                </mask>
                <use id="Oval" fill="url(#linearGradient-1)" xlink:href="#path-2"></use>
                <g id="puzzle" mask="url(#mask-3)" fill="#000000" fill-rule="nonzero">
                    <g transform="translate(14.000000, 14.000000)" id="Path">
                        <path d="M24.352847,10.9344322 L21.4128862,7.99447143 C20.2038338,6.78541903 20.9426992,5.50919707 22.2602563,5.43169371 C24.4303503,5.29735455 25.6497365,2.98258758 23.877493,1.0553374 C21.9502428,-0.711739175 19.6458097,0.502480107 19.5114705,2.66740725 C19.4288002,3.98496435 18.1422445,4.72899659 16.938359,3.52511109 L14.060401,0.647153043 C13.1975302,-0.215717681 11.7973029,-0.215717681 10.9344322,0.647153043 L8.02030588,3.56127932 C6.81125349,4.77033171 5.52986463,4.02113258 5.44719438,2.70357549 C5.31285522,0.533481451 2.98775447,-0.701405394 1.06050429,1.07083807 C-0.716906066,3.00325514 0.517980779,5.3283559 2.68807482,5.46269505 C4.00563191,5.5453653 4.75483104,6.83192105 3.55094554,8.04097344 L0.647153043,10.939599 C-0.215717681,11.8024698 -0.215717681,13.2026971 0.647153043,14.0655678 L3.52511109,16.9435259 C4.73416348,18.1474114 4.01596569,19.4029658 2.6984086,19.485636 C0.52831456,19.6199752 -0.685904723,21.9295753 1.08633874,23.8568255 C3.01358892,25.6290689 5.31285522,24.4200165 5.44719438,22.2499225 C5.52986463,20.9323654 6.79058593,20.2090007 7.99963832,21.4128862 L10.9034308,24.3166787 C11.7818022,25.1950501 13.2181978,25.1950501 14.0965692,24.3218456 L16.1323241,22.2860907 L17.0055286,21.4128862 C18.1474114,20.2193345 17.408546,18.9637801 16.1064896,18.8811098 C13.9363956,18.7467707 12.7066756,16.4216699 14.4789191,14.4944198 C16.4061693,12.7221763 18.73127,13.9570631 18.8656092,16.1271572 C18.9482794,17.4292136 20.1986669,18.1629121 21.3922187,17.0210292 L22.1827529,16.230495 L24.3115118,14.1017361 C24.3166787,14.0965692 24.3166787,14.0965692 24.3218456,14.0914023 L24.352847,14.060401 C25.2157177,13.1975302 25.2157177,11.7973029 24.352847,10.9344322 Z"></path>
                    </g>
                </g>
            </g>
        </g>
    </g>
</svg>