<svg width="52" height="52" viewBox="0 0 52 52" fill="none" xmlns="http://www.w3.org/2000/svg">
<circle cx="26" cy="26" r="26" fill="white"/>
<mask id="mask0" mask-type="alpha" maskUnits="userSpaceOnUse" x="0" y="0" width="52" height="52">
<circle cx="26" cy="26" r="26" fill="white"/>
</mask>
<g mask="url(#mask0)">
<path d="M27.3521 15.5671C28.0054 15.5671 28.7801 15.6045 29.6761 15.6791C30.5721 15.7351 31.3934 15.8565 32.1401 16.0431V35.2231H29.4521V18.1431C29.1161 18.1245 28.7801 18.1151 28.4441 18.1151C28.1268 18.0965 27.8281 18.0871 27.5481 18.0871V41.1031H24.8601V29.5951C22.5268 29.3898 20.8561 28.7458 19.8481 27.6631C18.8401 26.5805 18.3361 24.9005 18.3361 22.6231C18.3361 20.8871 18.6348 19.5058 19.2321 18.4791C19.8294 17.4525 20.7908 16.7151 22.1161 16.2671C23.4414 15.8005 25.1868 15.5671 27.3521 15.5671Z" fill="black"/>
</g>
</svg>
