<svg width="16" height="16" viewBox="0 0 16 16" fill="none" xmlns="http://www.w3.org/2000/svg">
<path fill-rule="evenodd" clip-rule="evenodd" d="M12.5252 6.57945e-05C12.373 -0.00142219 12.2372 0.104231 12.1896 0.263455L10.46 6.09523H5.53896L3.80938 0.263455C3.76319 0.110184 3.63412 0.00453012 3.48602 6.57945e-05C3.33793 -0.00291017 3.20478 0.0953028 3.15179 0.247087L1.0676 6.33928C1.06676 6.33928 1.06644 6.33984 1.066 6.34063C1.06572 6.34112 1.0654 6.34168 1.06488 6.34225L0.0214322 9.38984C-0.0329143 9.55055 0.0159976 9.73061 0.143712 9.83179L7.79298 15.924L7.79434 15.927C7.79775 15.9298 7.80116 15.932 7.80424 15.934L7.80929 15.9374C7.81089 15.9383 7.81238 15.9393 7.81382 15.9403L7.81676 15.9426C7.81913 15.9444 7.82151 15.9463 7.82423 15.9478C7.82491 15.9478 7.82525 15.9482 7.82559 15.9485C7.82593 15.9489 7.82627 15.9493 7.82695 15.9493C7.82695 15.9493 7.82831 15.9508 7.82967 15.9508C7.83102 15.9523 7.83238 15.9537 7.8351 15.9537L7.83692 15.9553L7.83782 15.956C7.83884 15.9567 7.83986 15.9575 7.84053 15.9582L7.84831 15.9619L7.84834 15.9619L7.84838 15.9619C7.85323 15.9642 7.85843 15.9667 7.86363 15.9686C7.86954 15.9719 7.87545 15.9743 7.88084 15.9766L7.88673 15.979L7.89455 15.9818C7.8989 15.9833 7.90272 15.9846 7.90711 15.9865C7.90833 15.9865 7.90955 15.9868 7.9109 15.9871C7.91254 15.9875 7.91438 15.988 7.91662 15.988C7.92341 15.9909 7.93021 15.9924 7.937 15.9939L7.96417 15.9984C7.97097 15.9984 7.9781 15.9988 7.98523 15.9991C7.99237 15.9995 7.9995 15.9999 8.00629 15.9999L8.01885 15.9988C8.02764 15.9981 8.03598 15.9974 8.04433 15.9954C8.04977 15.9954 8.05384 15.9954 8.05928 15.9939H8.062C8.06471 15.9924 8.06607 15.9924 8.06879 15.9924C8.06945 15.9924 8.07011 15.9921 8.07093 15.9917C8.07179 15.9913 8.07283 15.9909 8.07422 15.9909C8.07558 15.9902 8.07728 15.9898 8.07898 15.9895L8.08072 15.9891C8.08181 15.9888 8.08284 15.9885 8.08374 15.988C8.08917 15.9865 8.09325 15.985 8.09732 15.9835C8.10004 15.9835 8.1014 15.9835 8.10276 15.982H8.10683C8.11227 15.979 8.11906 15.9761 8.12449 15.9746C8.13129 15.9716 8.13672 15.9686 8.14216 15.9657L8.14334 15.9655C8.14375 15.9654 8.14408 15.965 8.14487 15.9642C8.14623 15.9642 8.14759 15.9642 8.14895 15.9627L8.1571 15.9582C8.16524 15.9538 8.17203 15.9493 8.17881 15.9448L8.17882 15.9448L8.17882 15.9448L8.17883 15.9448L8.17884 15.9448C8.18156 15.9433 8.18292 15.9418 8.18428 15.9404C8.18564 15.9404 8.18699 15.9389 8.18835 15.9389C8.19107 15.9366 8.19379 15.9348 8.1965 15.9329C8.19922 15.9311 8.20194 15.9292 8.20466 15.927L8.20737 15.9225L15.8566 9.83179C15.983 9.73061 16.0319 9.55055 15.9776 9.38984L14.9368 6.35267C14.9355 6.34969 14.9341 6.34523 14.9341 6.34225L12.8472 0.247087C12.7956 0.0997671 12.6692 0.00155378 12.5252 6.57945e-05ZM2.1097 6.85713H5.03354L7.07017 13.7201L2.1097 6.85713ZM13.8893 6.85713H10.9655L8.92882 13.7201L13.8893 6.85713ZM1.49966 7.24105L6.15172 13.677L0.765979 9.38686L1.49966 7.24105ZM15.233 9.38686L14.4993 7.24105L9.84728 13.677L15.233 9.38686Z" fill="#15252E"/>
</svg>
