<?xml version="1.0" encoding="UTF-8"?>
<svg width="52px" height="52px" viewBox="0 0 52 52" version="1.1" xmlns="http://www.w3.org/2000/svg" xmlns:xlink="http://www.w3.org/1999/xlink">
    <title>Tools</title>
    <defs>
        <linearGradient x1="0%" y1="100%" x2="100%" y2="0%" id="linearGradient-1">
            <stop stop-color="#00CCFF" offset="0%"></stop>
            <stop stop-color="#33FF99" offset="100%"></stop>
        </linearGradient>
        <circle id="path-2" cx="26" cy="26" r="26"></circle>
    </defs>
    <g id="⚡-Active---THORChain.org" stroke="none" stroke-width="1" fill="none" fill-rule="evenodd">
        <g id="Mobile:-Post-Builder" transform="translate(0.000000, -3.000000)">
            <g id="Mobile:-Single-Post" transform="translate(0.000000, -0.000000)">
                <g id="Tools" transform="translate(0.000000, 3.000000)">
                    <mask id="mask-3" fill="white">
                        <use xlink:href="#path-2"></use>
                    </mask>
                    <use id="Oval" fill="url(#linearGradient-1)" xlink:href="#path-2"></use>
                    <g id="settings" mask="url(#mask-3)" fill="#000B12" fill-rule="nonzero">
                        <g transform="translate(13.000000, 12.000000)" id="Path">
                            <path d="M14.941908,12.9755327 C15.2537547,12.8160541 15.6011539,12.7317437 15.9615737,12.7317437 C16.5588566,12.7317437 17.1204023,12.9636202 17.5437086,13.3847103 L18.4549622,12.473549 C20.71001,13.2640163 23.3181824,12.7579695 25.1209278,10.9553164 C26.6377753,9.43846894 27.2359816,7.35148777 26.916655,5.38427715 C26.8814719,5.16763742 26.728088,4.9889512 26.5192975,4.92153986 C26.3105071,4.85403618 26.0813085,4.90888869 25.9261701,5.06411946 L24.5731414,6.41714814 C23.4712892,7.51900033 21.684704,7.51900033 20.5828519,6.41714814 C19.4809073,5.31529596 19.4809073,3.52871079 20.5828519,2.4268586 L21.9358805,1.07382992 C22.0911113,0.91859915 22.1464255,0.689400598 22.0788295,0.480517792 C22.0113258,0.271542641 21.8323626,0.118528136 21.6156305,0.0833449578 C19.6485122,-0.235981631 17.5614387,0.362224743 16.0446836,1.87907221 C14.2151583,3.70859748 13.7227785,6.36737456 14.5642198,8.64504672 L12.5878671,10.6213994 L14.941908,12.9755327 Z"></path>
                            <path d="M11.3404803,16.5568293 L8.99632021,14.2126692 L0.799378432,22.4095187 C-0.266459477,23.4753566 -0.266459477,25.2033955 0.799378432,26.2692334 C1.86521634,27.3350713 3.59325522,27.3350713 4.65909313,26.2692334 L11.7253713,19.2030476 C11.012658,18.4865481 10.8842071,17.404827 11.3404803,16.5568293 Z"></path>
                            <path d="M16.5686451,14.3683617 C16.4010402,14.2007568 16.1812608,14.1169082 15.9615737,14.1169082 C15.7418866,14.1169082 15.5221072,14.2007568 15.3545023,14.3683617 L14.8651698,14.8576942 L6.14860669,6.14113103 L6.55602974,5.73370798 C6.92725383,5.36257624 6.88117402,4.74691679 6.45805244,4.43534712 L2.90168876,1.81618574 C2.55992251,1.56454753 2.08564218,1.60028477 1.78552321,1.90040375 L0.275509219,3.41051008 C-0.0246097559,3.71062906 -0.060347,4.18500173 0.191291217,4.52667563 L2.81036025,8.08303931 C3.12192992,8.50606855 3.73721999,8.55261008 4.10872111,8.18101661 L4.51614416,7.77350122 L13.2327073,16.4900644 L12.7089304,17.0138412 C12.3736283,17.3491434 12.3736283,17.8926819 12.7089304,18.2279841 L20.7501797,26.2692334 C21.8160176,27.3350713 23.5440565,27.3350713 24.6098944,26.2692334 C25.6757323,25.2033955 25.6757323,23.4753566 24.6098944,22.4095187 L16.5686451,14.3683617 Z"></path>
                        </g>
                    </g>
                </g>
            </g>
        </g>
    </g>
</svg>