<?xml version="1.0" encoding="UTF-8"?>
<svg width="52px" height="52px" viewBox="0 0 52 52" version="1.1" xmlns="http://www.w3.org/2000/svg" xmlns:xlink="http://www.w3.org/1999/xlink">
    <title>Ecosystem</title>
    <defs>
        <linearGradient x1="0%" y1="100%" x2="100%" y2="0%" id="linearGradient-1">
            <stop stop-color="#00CCFF" offset="0%"></stop>
            <stop stop-color="#33FF99" offset="100%"></stop>
        </linearGradient>
        <circle id="path-2" cx="26" cy="26" r="26"></circle>
    </defs>
    <g id="⚡-Active---THORChain.org" stroke="none" stroke-width="1" fill="none" fill-rule="evenodd">
        <g id="Mobile:-Post-Builder" transform="translate(0.000000, -3.000000)">
            <g id="Ecosystem" transform="translate(0.000000, 3.000000)">
                <mask id="mask-3" fill="white">
                    <use xlink:href="#path-2"></use>
                </mask>
                <use id="Oval" fill="url(#linearGradient-1)" xlink:href="#path-2"></use>
                <g id="molecule" mask="url(#mask-3)" fill="#000000" fill-rule="nonzero">
                    <g transform="translate(13.000000, 13.000000)" id="Path">
                        <path d="M20.9231863,14.9519608 L17.0561765,13.4644608 C17.3191667,12.2206863 17.0713235,10.8730882 16.270098,9.7697549 L20.3113235,5.72852941 C22.3529902,6.97073529 25,5.49730392 25,3.08823529 C25,1.38539216 23.6146078,-8.32667268e-15 21.9117647,-8.32667268e-15 C19.5006863,-8.32667268e-15 18.0304902,2.64906863 19.2714706,4.68867647 L15.2302451,8.72990196 C13.4951961,7.46995098 11.1165196,7.55617647 9.47431373,8.96303922 L7.41764706,7.21480392 C8.44372549,5.17259804 6.95161765,2.74509804 4.65686275,2.74509804 C2.95401961,2.74509804 1.56862745,4.1304902 1.56862745,5.83333333 C1.56862745,8.36073529 4.44426471,9.79906863 6.46470588,8.33480392 L8.52102941,10.0827451 C7.54833333,11.6779412 7.62529412,13.7091176 8.72995098,15.2302451 L6.04019608,17.919951 C3.49617647,16.1952451 0,18.0135784 0,21.127451 C0,23.2627941 1.73720588,25 3.87254902,25 C6.98382353,25 8.80661765,21.5064706 7.08,18.9598529 L9.7697549,16.2701471 C10.8969608,17.0887255 12.3044118,17.3448529 13.6148039,17.0217157 L15.2865196,20.9731863 C13.7051961,22.3763725 14.700049,25 16.8137255,25 C18.0841176,25 19.1176471,23.9664706 19.1176471,22.6960784 C19.1176471,21.3759314 17.9955882,20.2980882 16.6405392,20.3993627 L14.9684804,16.4470588 C15.6092157,16.044902 16.1456373,15.4912745 16.5269608,14.8365686 L20.3946569,16.3243627 C20.3395588,17.6419118 21.3963235,18.7254902 22.6960784,18.7254902 C23.9664706,18.7254902 25,17.6919608 25,16.4215686 C25,14.2846078 22.3046078,13.2883333 20.9231863,14.9519608 Z"></path>
                    </g>
                </g>
            </g>
        </g>
    </g>
</svg>