<?xml version="1.0" encoding="UTF-8"?>
<svg width="52px" height="52px" viewBox="0 0 52 52" version="1.1" xmlns="http://www.w3.org/2000/svg" xmlns:xlink="http://www.w3.org/1999/xlink">
    <title>THORChainPlus</title>
    <defs>
        <circle id="path-1" cx="26" cy="26" r="26"></circle>
    </defs>
    <g id="⚡-Active---THORChain.org" stroke="none" stroke-width="1" fill="none" fill-rule="evenodd">
        <g id="Mobile:-Post-Builder" transform="translate(0.000000, -3.000000)">
            <g id="Mobile:-Single-Post" transform="translate(0.000000, -0.000000)">
                <g id="THORChainPlus" transform="translate(0.000000, 3.000000)">
                    <mask id="mask-2" fill="white">
                        <use xlink:href="#path-1"></use>
                    </mask>
                    <use id="Oval" fill="#000B12" xlink:href="#path-1"></use>
                    <path d="M15.0691861,40.9383805 L33.1690358,33.2149322 C33.5590722,33.0484985 33.740338,32.5973903 33.5739042,32.2073539 C33.5368028,32.120407 33.4839648,32.0410587 33.4180477,31.9733001 L27.1227932,25.5021701 L27.1227932,25.5021701 L14.1997164,39.7156188 C13.9144401,40.0293799 13.9375317,40.5149956 14.2512928,40.8002719 C14.4734654,41.0022745 14.7930034,41.0562313 15.0691861,40.9383805 Z M20.8298235,19.0423331 L27.1227932,25.5021701 L27.1227932,25.5021701 L37.8294039,12.250383 C38.0959066,11.9205272 38.0445488,11.437083 37.714693,11.1705803 C37.4939749,10.9922539 37.1929009,10.9501924 36.9317613,11.0612009 L21.0794342,17.7999078 C20.6891699,17.9658062 20.5072854,18.4166653 20.6731839,18.8069297 C20.7103743,18.8944176 20.763488,18.9742386 20.8298235,19.0423331 Z" id="Shape" fill="#FF4954" fill-rule="nonzero" mask="url(#mask-2)"></path>
                </g>
            </g>
        </g>
    </g>
</svg>