<?xml version="1.0" encoding="utf-8"?>
<!-- Generator: Adobe Illustrator 23.1.0, SVG Export Plug-In . SVG Version: 6.00 Build 0)  -->
<svg version="1.1" id="Layer_1" xmlns="http://www.w3.org/2000/svg" xmlns:xlink="http://www.w3.org/1999/xlink" x="0px" y="0px"
	 viewBox="0 0 24.8 24" style="enable-background:new 0 0 24.8 24;" xml:space="preserve">
<style type="text/css">
	.st0{fill-rule:evenodd;clip-rule:evenodd;fill:#000B12;}
	.st1{fill-rule:evenodd;clip-rule:evenodd;fill:#FFFFFF;filter:url(#Adobe_OpacityMaskFilter);}
	.st2{mask:url(#path-1-inside-1_1_);fill:#D1D5DA;}
	.st3{fill:#000B12;}
	.st4{fill:#F3BA2F;}
</style>
<path class="st0" d="M12.7,0.6c-0.5-0.3-1.1-0.2-1.4,0.2L6.7,7.4C6.4,7.9,6.5,8.5,6.9,8.8l3.7,2.6l-6,8.5c-0.3,0.5-0.2,1.1,0.2,1.4
	l2.3,1.6c0.5,0.3,1.1,0.2,1.4-0.2l6-8.5l3.6,2.5c0.5,0.3,1.1,0.2,1.4-0.2l4.6-6.6c0.3-0.5,0.2-1.1-0.2-1.4L12.7,0.6z"/>
<defs>
	<filter id="Adobe_OpacityMaskFilter" filterUnits="userSpaceOnUse" x="3.4" y="-0.6" width="21.9" height="24.7">
		<feColorMatrix  type="matrix" values="1 0 0 0 0  0 1 0 0 0  0 0 1 0 0  0 0 0 1 0"/>
	</filter>
</defs>
<mask maskUnits="userSpaceOnUse" x="3.4" y="-0.6" width="21.9" height="24.7" id="path-1-inside-1_1_">
	<path class="st1" d="M12.7,0.6c-0.5-0.3-1.1-0.2-1.4,0.2L6.7,7.4C6.4,7.9,6.5,8.5,6.9,8.8l3.7,2.6l-6,8.5c-0.3,0.5-0.2,1.1,0.2,1.4
		l2.3,1.6c0.5,0.3,1.1,0.2,1.4-0.2l6-8.5l3.6,2.5c0.5,0.3,1.1,0.2,1.4-0.2l4.6-6.6c0.3-0.5,0.2-1.1-0.2-1.4L12.7,0.6z"/>
</mask>
<path class="st2" d="M12.7,0.6l-0.6,0.8L12.7,0.6z M6.9,8.8L7.5,8L6.9,8.8z M10.6,11.4l0.8,0.6l0.6-0.8l-0.8-0.6L10.6,11.4z
	 M4.9,21.3l-0.6,0.8L4.9,21.3z M7.1,22.9l0.6-0.8L7.1,22.9z M8.5,22.7l-0.8-0.6L8.5,22.7z M14.5,14.1l0.6-0.8l-0.8-0.6l-0.6,0.8
	L14.5,14.1z M18.2,16.7l0.6-0.8L18.2,16.7z M23.9,8.5l0.6-0.8L23.9,8.5z M12.1,1.4L12.1,1.4l1.1-1.6c-0.9-0.6-2.2-0.4-2.8,0.5
	L12.1,1.4z M7.5,8l4.6-6.6l-1.6-1.1L5.9,6.9L7.5,8z M7.5,8L7.5,8L5.9,6.9C5.2,7.8,5.4,9,6.3,9.6L7.5,8z M11.2,10.6L7.5,8L6.3,9.6
	l3.7,2.6L11.2,10.6z M5.4,20.5l6-8.5l-1.6-1.1l-6,8.5L5.4,20.5z M5.4,20.5l-1.6-1.1c-0.6,0.9-0.4,2.2,0.5,2.8L5.4,20.5z M7.7,22.1
	l-2.3-1.6l-1.1,1.6l2.3,1.6L7.7,22.1z M7.7,22.1l-1.1,1.6c0.9,0.6,2.2,0.4,2.8-0.5L7.7,22.1z M13.7,13.6l-6,8.5l1.6,1.1l6-8.5
	L13.7,13.6z M18.7,15.9l-3.6-2.5L13.9,15l3.6,2.5L18.7,15.9z M18.7,15.9L18.7,15.9l-1.1,1.6c0.9,0.6,2.2,0.4,2.8-0.5L18.7,15.9z
	 M23.3,9.3l-4.6,6.6l1.6,1.1l4.6-6.6L23.3,9.3z M23.3,9.3l1.6,1.1c0.6-0.9,0.4-2.2-0.5-2.8L23.3,9.3z M12.1,1.4l11.2,7.9l1.1-1.6
	L13.2-0.2L12.1,1.4z"/>
<path class="st3" d="M3.7,8.2h15c1.7,0,3,1.3,3,3v2c0,1.7-1.3,3-3,3h-15c-1.7,0-3-1.3-3-3v-2C0.7,9.6,2,8.2,3.7,8.2z"/>
<path class="st4" d="M4.8,13.2c0-0.2-0.1-0.3-0.2-0.4c-0.1-0.1-0.4-0.2-0.7-0.3c-0.4-0.1-0.6-0.2-0.8-0.3c-0.6-0.3-0.8-0.7-0.8-1.2
	c0-0.3,0.1-0.5,0.2-0.7C2.5,10,2.7,9.8,3,9.7c0.3-0.1,0.6-0.2,1-0.2c0.4,0,0.7,0.1,1,0.2c0.3,0.1,0.5,0.3,0.6,0.5
	c0.2,0.2,0.2,0.5,0.2,0.8h-1c0-0.2-0.1-0.4-0.2-0.5c-0.1-0.1-0.3-0.2-0.6-0.2c-0.3,0-0.4,0.1-0.6,0.2c-0.1,0.1-0.2,0.2-0.2,0.4
	c0,0.2,0.1,0.3,0.2,0.4c0.2,0.1,0.4,0.2,0.7,0.3c0.6,0.2,1,0.4,1.3,0.7c0.3,0.3,0.4,0.6,0.4,1c0,0.4-0.2,0.8-0.5,1
	C5,14.5,4.6,14.6,4,14.6c-0.4,0-0.7-0.1-1-0.2c-0.3-0.1-0.6-0.3-0.7-0.6C2.1,13.6,2,13.3,2,13h1c0,0.5,0.3,0.8,1,0.8
	c0.2,0,0.4,0,0.6-0.1C4.7,13.6,4.8,13.4,4.8,13.2z M10.6,12.2c0,0.5-0.1,0.9-0.3,1.3c-0.2,0.4-0.4,0.7-0.7,0.9
	c-0.3,0.2-0.7,0.3-1.1,0.3c-0.4,0-0.8-0.1-1.1-0.3c-0.3-0.2-0.6-0.5-0.8-0.8c-0.2-0.4-0.3-0.8-0.3-1.3V12c0-0.5,0.1-0.9,0.3-1.3
	c0.2-0.4,0.4-0.7,0.7-0.9c0.3-0.2,0.7-0.3,1.1-0.3c0.4,0,0.8,0.1,1.1,0.3c0.3,0.2,0.6,0.5,0.7,0.9c0.2,0.4,0.3,0.8,0.3,1.3V12.2z
	 M9.6,12c0-0.5-0.1-0.9-0.3-1.2c-0.2-0.3-0.5-0.4-0.8-0.4c-0.3,0-0.6,0.1-0.8,0.4c-0.2,0.3-0.3,0.7-0.3,1.2v0.2
	c0,0.5,0.1,0.9,0.3,1.2c0.2,0.3,0.5,0.4,0.8,0.4c0.3,0,0.6-0.1,0.8-0.4c0.2-0.3,0.3-0.7,0.3-1.2V12z M15.4,12.2
	c0,0.5-0.1,0.9-0.3,1.3c-0.2,0.4-0.4,0.7-0.7,0.9c-0.3,0.2-0.7,0.3-1.1,0.3c-0.4,0-0.8-0.1-1.1-0.3c-0.3-0.2-0.6-0.5-0.8-0.8
	c-0.2-0.4-0.3-0.8-0.3-1.3V12c0-0.5,0.1-0.9,0.3-1.3c0.2-0.4,0.4-0.7,0.7-0.9c0.3-0.2,0.7-0.3,1.1-0.3s0.8,0.1,1.1,0.3
	c0.3,0.2,0.6,0.5,0.7,0.9c0.2,0.4,0.3,0.8,0.3,1.3V12.2z M14.4,12c0-0.5-0.1-0.9-0.3-1.2c-0.2-0.3-0.5-0.4-0.8-0.4
	c-0.3,0-0.6,0.1-0.8,0.4c-0.2,0.3-0.3,0.7-0.3,1.2v0.2c0,0.5,0.1,0.9,0.3,1.2c0.2,0.3,0.5,0.4,0.8,0.4c0.3,0,0.6-0.1,0.8-0.4
	c0.2-0.3,0.3-0.7,0.3-1.2V12z M20.2,14.6h-1l-2-3.3v3.3h-1v-5h1l2,3.3V9.6h1V14.6z"/>
</svg>
