<?xml version="1.0" encoding="UTF-8"?>
<svg width="317px" height="112px" viewBox="0 0 317 112" version="1.1" xmlns="http://www.w3.org/2000/svg" xmlns:xlink="http://www.w3.org/1999/xlink">
    <title>Group 2</title>
    <defs>
        <rect id="path-1" x="0" y="0" width="317" height="112"></rect>
    </defs>
    <g id="⚡-Active---THORChain.org" stroke="none" stroke-width="1" fill="none" fill-rule="evenodd">
        <g id="Mobile:-Post-Builder" transform="translate(-61.000000, -168.000000)">
            <g id="Mobile:-Single-Post" transform="translate(0.000000, -0.000000)">
                <g id="Card:-Image" transform="translate(5.920771, 164.000000)">
                    <g id="Group-2" transform="translate(55.079229, 4.000000)">
                        <mask id="mask-2" fill="white">
                            <use xlink:href="#path-1"></use>
                        </mask>
                        <use id="Rectangle" fill="#E4E3E4" xlink:href="#path-1"></use>
                        <g id="THORMon" mask="url(#mask-2)" fill-rule="nonzero">
                            <g transform="translate(54.000000, 28.000000)">
                                <path d="M70.0426059,36.6550279 L70.0426059,21.1843575 L75.7579622,21.1843575 L75.7579622,18.3449721 L61,18.3449721 L61,21.1843575 L66.6616909,21.1843575 L66.6616909,36.6550279 L70.0426059,36.6550279 Z M86.1541266,36.6550279 L86.1541266,28.2695531 L93.4794424,28.2695531 L93.4794424,36.6550279 L96.8335247,36.6550279 L96.8335247,18.3449721 L93.4794424,18.3449721 L93.4794424,25.5363128 L86.1541266,25.5363128 L86.1541266,18.3449721 L82.8000443,18.3449721 L82.8000443,36.6550279 L86.1541266,36.6550279 Z M112.38156,37 C118.043251,37 120.028867,34.7709497 120.028867,27.5 C120.028867,20.2290503 118.043251,18 112.38156,18 C106.746701,18 104.761085,20.2290503 104.761085,27.5 C104.761085,34.7709497 106.746701,37 112.38156,37 Z M112.38156,34.1606145 C109.268971,34.1606145 108.302996,32.5949721 108.302996,27.5 C108.302996,22.4050279 109.268971,20.8393855 112.38156,20.8393855 C115.520981,20.8393855 116.486956,22.4050279 116.486956,27.5 C116.486956,32.5949721 115.520981,34.1606145 112.38156,34.1606145 Z M131.256844,36.6550279 L131.256844,29.3310056 L134.584094,29.3310056 C135.711065,29.3310056 136.355049,29.7821229 136.730706,30.976257 L138.206503,36.6550279 L141.775246,36.6550279 L140.111621,30.9231844 C139.709132,29.1717877 138.555327,28.4287709 137.643017,28.2164804 L137.643017,28.0837989 C140.192119,27.7653631 141.10443,26.1997207 141.10443,23.4664804 C141.10443,19.3002793 139.226144,18.1061453 134.664592,18.1061453 C131.498338,18.1061453 130.049375,18.1326816 127.929594,18.3449721 L127.929594,36.6550279 L131.256844,36.6550279 Z M134.584094,26.5977654 L131.256844,26.5977654 L131.256844,20.8393855 L134.584094,20.8393855 C136.945368,20.8393855 137.696682,21.4231844 137.696682,23.6787709 C137.696682,25.9343575 136.945368,26.5712291 134.584094,26.5977654 Z M152.225076,36.6550279 L152.225076,27.5530726 C153.996032,26.3854749 154.720513,26.0139665 155.740154,26.0139665 C156.810777,26.0139665 157.348638,26.4210999 157.376742,27.6676465 L157.376946,36.6550279 L160.516368,36.6550279 L160.516368,27.5796089 C162.233658,26.4120112 162.958139,26.0139665 164.058278,26.0139665 C165.292581,26.0139665 165.668238,26.5446927 165.695071,27.8715084 L165.695071,36.6550279 L168.888157,36.6550279 L168.888157,26.8896648 C168.888157,24.5544693 167.653855,23.2807263 165.319413,23.2807263 C163.575291,23.2807263 161.965331,23.9972067 160.328539,25.4567039 C159.872384,24.023743 158.745412,23.2807263 156.974457,23.2807263 C155.149836,23.2807263 153.539876,24.0768156 151.849419,25.5628492 L151.634758,23.6522346 L148.978324,23.6522346 L148.978324,36.6550279 L152.225076,36.6550279 Z M182.7994,37 C187.521948,37 189.26607,35.1424581 189.26607,30.1536313 C189.26607,25.1648045 187.521948,23.2807263 182.7994,23.2807263 C178.050019,23.2807263 176.279064,25.1648045 176.279064,30.1536313 C176.279064,35.1424581 178.050019,37 182.7994,37 Z M182.7994,34.4259777 C180.38446,34.4259777 179.686811,33.4972067 179.686811,30.1536313 C179.686811,26.7835196 180.38446,25.8547486 182.7994,25.8547486 C185.160674,25.8547486 185.885155,26.7835196 185.885155,30.1536313 C185.885155,33.4972067 185.160674,34.4259777 182.7994,34.4259777 Z M200.011059,36.6550279 L199.984227,27.6061453 C201.83568,26.5977654 203.016317,26.0139665 204.331117,26.0139665 C205.377591,26.0139665 205.726416,26.4120112 205.726416,27.8715084 L205.726416,36.6550279 L209,36.6550279 L209,26.8896648 C209,24.5544693 207.712032,23.2807263 205.377591,23.2807263 C203.44564,23.2807263 201.567354,24.1564246 199.689068,25.5893855 L199.474406,23.6522346 L196.737475,23.6522346 L196.737475,36.6550279 L200.011059,36.6550279 Z" id="THORmon" fill="#303030"></path>
                                <path d="M15.2884049,15.386014 L52,0 L29.9783493,26.8908676 L41.4733079,38.5428391 L0,56 L26.742433,26.9929336 L15.2884049,15.386014 Z M28.412047,28.6853301 L9.15686091,49.5696935 L37.3206136,37.7146099 L28.412047,28.6853301 Z M44.1190065,5.87595464 L19.4441059,16.2166638 L28.3016103,25.1913501 L44.1190065,5.87595464 Z" id="Shape" fill="#FF194B"></path>
                            </g>
                        </g>
                    </g>
                </g>
            </g>
        </g>
    </g>
</svg>