<?xml version="1.0" encoding="UTF-8"?>
<svg width="345px" height="71px" viewBox="0 0 345 71" version="1.1" xmlns="http://www.w3.org/2000/svg" xmlns:xlink="http://www.w3.org/1999/xlink">
    <title>SS_horizontal_white</title>
    <g id="Desktop" stroke="none" stroke-width="1" fill="none" fill-rule="evenodd">
        <g id="Interfaces---Individual" transform="translate(-1104.000000, -7085.000000)" fill="#FFFFFF" fill-rule="nonzero">
            <g id="Content" transform="translate(135.000000, 148.000000)">
                <g id="List-View" transform="translate(0.000000, 105.000000)">
                    <g id="Blocks" transform="translate(351.000000, 14.000000)">
                        <g id="Technical-Docs-Copy-2" transform="translate(0.000000, 6727.000000)">
                            <g id="Video/Image" transform="translate(549.000000, 0.000000)">
                                <g id="SS_horizontal_white" transform="translate(69.000000, 91.000000)">
                                    <polygon id="Path" points="304 55 309 55 309 30 304 30"></polygon>
                                    <rect id="Rectangle" x="304" y="23" width="5" height="5"></rect>
                                    <path d="M102.85413,22.0966387 C98.1142355,22.0966387 93.0474517,23.9537815 93.0474517,28.5420168 C93.0474517,32.5840336 97.6783831,33.7857143 103.181019,34.7142857 C110.644991,35.9159664 118,37.3907563 118,45.8571429 C117.945518,54.2689076 109.936731,57 102.799649,57 C96.2073814,57 89.887522,54.5966387 87,48.3151261 L90.8681898,46.0756303 C93.2653779,50.5 98.2776801,52.6302521 102.85413,52.6302521 C107.376098,52.6302521 113.42355,51.210084 113.42355,45.6932773 C113.478032,41.0504202 108.247803,39.6848739 102.636204,38.8655462 C95.4446397,37.7184874 88.4165202,36.0798319 88.4165202,28.487395 C88.3075571,20.6764706 96.2618629,18 102.690685,18 C108.247803,18 113.532513,19.1470588 116.855888,24.7731092 L113.314587,26.9579832 C111.353251,23.6260504 107.049209,22.1512605 102.85413,22.0966387 Z" id="Path"></path>
                                    <path d="M126.398664,19.0539359 L126.398664,34.2099125 C128.681514,30.7580175 132.300668,29.6253644 135.697105,29.5714286 C143.269488,29.5714286 147,34.425656 147,41.5991254 L147,55.9460641 L142.601336,55.9460641 L142.601336,41.6530612 C142.601336,36.5291545 139.873051,33.6166181 134.973274,33.6166181 C130.073497,33.6166181 126.454343,37.3921283 126.454343,42.138484 L126.454343,56 L122,56 L122,19 L126.398664,19.0539359 L126.398664,19.0539359 Z" id="Path"></path>
                                    <path d="M172.792899,55.4642941 L172.686391,50.7500823 C170.662722,54.3393117 166.721893,56 163.207101,56 C155.804734,56 150,50.8572235 150,42.3930704 C150,33.9824879 155.911243,28.9468526 163.260355,29.0004232 C167.094675,29.0004232 170.928994,30.7682526 172.792899,34.1431997 L172.846154,29.4289879 L177,29.4289879 L177,55.3571529 L172.899408,55.3571529 L172.792899,55.4642941 Z M163.420118,33.1252452 C158.307692,33.1252452 154.207101,36.8217292 154.207101,42.5537822 C154.207101,48.2858352 158.307692,52.0357764 163.420118,52.0357764 C175.828402,52.0357764 175.828402,33.0717879 163.420118,33.1252452 L163.420118,33.1252452 Z" id="Shape"></path>
                                    <path d="M182,29.488178 L186.047337,29.488178 L186.260355,34.5326843 C188.284024,31.0069541 192.118343,29 196.16568,29 C203.568047,29.162726 209,34.4784423 209,42.5605007 C209,50.8595271 203.621302,56.2294854 195.899408,56.2294854 C192.224852,56.2294854 188.177515,54.6564673 186.153846,50.9137691 L186.153846,68 L182,68 L182,29.488178 Z M204.739645,42.6689847 C204.739645,36.7566064 200.905325,33.2851182 195.686391,33.2851182 C190.307692,33.2851182 186.686391,37.2990264 186.686391,42.6689847 C186.686391,48.038943 190.52071,52.0528512 195.686391,52.1070932 C200.798817,52.1070932 204.739645,48.581363 204.739645,42.6689847 Z" id="Shape"></path>
                                    <path d="M237.304551,51.3928571 C234.632303,54.5 230.051307,56 225.906596,56 C217.726245,56 212,50.6964286 212,42.4464286 C212,34.625 217.726245,29 225.688453,29 C233.759732,29 239.922263,33.875 238.886085,44.2142857 L216.471925,44.2142857 C216.962746,48.9821429 220.94385,51.9821429 226.015667,51.9821429 C229.015129,51.9821429 232.614483,50.8035714 234.41416,48.7142857 L237.304551,51.3928571 L237.304551,51.3928571 Z M234.741374,40.7321429 C234.523232,35.6964286 230.978413,32.9642857 225.797525,32.9642857 C221.216528,32.9642857 217.180889,35.6964286 216.471925,40.6785714 L234.741374,40.7321429 L234.741374,40.7321429 Z" id="Shape"></path>
                                    <path d="M256.85413,22.0966387 C252.114236,22.0966387 247.047452,23.9537815 247.047452,28.5420168 C247.047452,32.5840336 251.678383,33.7857143 257.181019,34.7142857 C264.644991,35.9159664 272,37.3907563 272,45.8571429 C271.945518,54.2689076 263.936731,57 256.799649,57 C250.207381,57 243.887522,54.5966387 241,48.3151261 L244.86819,46.0756303 C247.265378,50.5 252.27768,52.6302521 256.85413,52.6302521 C261.376098,52.6302521 267.42355,51.210084 267.42355,45.6932773 C267.478032,41.0504202 262.247803,39.6848739 256.636204,38.8655462 C249.44464,37.7184874 242.41652,36.0798319 242.41652,28.487395 C242.307557,20.6764706 250.261863,18 256.690685,18 C262.247803,18 267.532513,19.1470588 270.855888,24.7731092 L267.314587,26.9579832 C265.29877,23.6260504 260.994728,22.1512605 256.85413,22.0966387 Z" id="Path"></path>
                                    <path d="M279.398664,19.0539359 L279.398664,34.2099125 C281.681514,30.7580175 285.300668,29.6253644 288.697105,29.5714286 C296.269488,29.5714286 300,34.425656 300,41.5991254 L300,55.9460641 L295.601336,55.9460641 L295.601336,41.6530612 C295.601336,36.5291545 292.873051,33.6166181 287.973274,33.6166181 C283.073497,33.6166181 279.454343,37.3921283 279.454343,42.138484 L279.454343,56 L275,56 L275,19 L279.398664,19.0539359 L279.398664,19.0539359 Z" id="Path"></path>
                                    <g id="Group" transform="translate(312.000000, 18.000000)">
                                        <polygon id="Path" points="4.23214286 37.7551897 4.23214286 37.7007874 4.17857143 37.7007874"></polygon>
                                        <path d="M9.32142857,9.57480315 C9.32142857,5.65783822 11.0892857,3.86256263 13.875,3.86256263 C13.9285714,3.86256263 13.9821429,3.86256263 14.0357143,3.86256263 L15,0.108804581 C14.5714286,0.0544022906 14.1964286,-7.73103048e-15 13.7678571,-7.73103048e-15 C8.30357143,-7.73103048e-15 5.08928571,3.53614889 5.08928571,9.57480315 L5.08928571,11.6420902 L0,11.6420902 L0,15.5046528 L5.08928571,15.5046528 L5.08928571,37.6463851 L9.32142857,37.6463851 L9.32142857,15.5046528 L14.4642857,15.5046528 L14.4642857,11.6420902 L9.32142857,11.6420902 L9.32142857,9.57480315 Z" id="Path"></path>
                                    </g>
                                    <path d="M344.163763,52.9012972 C343.850174,52.9566759 343.484321,53.0120545 343.170732,53.0120545 C340.139373,53.0120545 339.198606,51.0184225 339.198606,47.8618383 L339.198606,34.0725498 L344.581882,34.0725498 L344.581882,30.196043 L339.250871,30.196043 L339.250871,22 L335.069686,22.498408 L335.069686,30.1406643 L330,30.1406643 L330,34.0171711 L335.069686,34.0171711 L335.069686,47.8064597 C335.069686,53.7319772 337.630662,57.0546974 343.066202,56.9993187 C343.745645,56.9993187 344.372822,56.8885613 345,56.777804 L344.163763,52.9012972 Z" id="Path"></path>
                                    <path d="M65,0.108479756 L42.518797,9.05805959 L21.5037594,9.05805959 L0,0 L4.88721805,29.4522536 L0.217209691,45.3987777 L12.4352548,52.7211612 C18.245614,56.1925134 23.4043442,60.4774637 27.8571429,65.5760122 L32.6357561,71 L37.6315789,65.250573 C41.9214703,60.3147441 46.9172932,56.1382735 52.4561404,52.7211612 L64.4569758,45.3987777 L60.112782,29.4522536 L65,0.108479756 Z M50.1211362,49.8464477 C46.0484545,52.3957219 42.2472849,55.3246753 38.8262322,58.6333079 L34.6449457,54.0771581 L50.1211362,49.8464477 Z M30.3550543,54.0771581 L26.2823726,58.579068 C22.8070175,55.2704354 19.005848,52.3957219 14.9331662,49.9006875 L30.3550543,54.0771581 Z M26.336675,49.1413293 L4.72431078,43.2834225 L7.6566416,33.1948052 L26.336675,49.1413293 Z M18.1913116,11.6615737 L7.92815372,25.0588235 L4.7786132,6.02062643 L18.1913116,11.6615737 Z M53.2706767,31.4591291 L32.4728488,49.5752483 L11.2949039,31.4591291 L53.2706767,31.4591291 L53.2706767,31.4591291 Z M10.53467,27.7165775 L22.0467836,12.7463713 L41.9757728,12.7463713 L54.7368421,27.7165775 L10.53467,27.7165775 Z M57.1804511,32.9236058 L60.0041771,43.2834225 L38.5547201,49.1955691 L57.1804511,32.9236058 Z M60.2756892,5.96638655 L57.1261487,24.841864 L45.9398496,11.6615737 L60.2756892,5.96638655 Z" id="Shape"></path>
                                </g>
                            </g>
                        </g>
                    </g>
                </g>
            </g>
        </g>
    </g>
</svg>