<svg width="113" height="13" viewBox="0 0 113 13" fill="none" xmlns="http://www.w3.org/2000/svg">
<g clip-path="url(#clip0_181_2174)">
<path d="M22.5556 11V2.86H25.9986C26.7319 2.86 27.3039 3.03233 27.7146 3.377C28.1326 3.72167 28.4222 4.19833 28.5836 4.807C28.7522 5.41567 28.8366 6.12333 28.8366 6.93C28.8366 8.30133 28.6019 9.32433 28.1326 9.999C27.6632 10.6663 26.9519 11 25.9986 11H22.5556ZM24.1836 9.537H25.8336C26.3396 9.537 26.6952 9.317 26.9006 8.877C27.1059 8.437 27.2086 7.788 27.2086 6.93C27.2086 6.226 27.1572 5.687 27.0546 5.313C26.9519 4.93167 26.7979 4.67133 26.5926 4.532C26.3946 4.39267 26.1416 4.323 25.8336 4.323H24.1836V9.537ZM32.0121 11.055C31.8361 11.055 31.6345 11.0367 31.4071 11C31.1798 10.9707 30.9598 10.8973 30.7471 10.78C30.5418 10.6627 30.3695 10.4867 30.2301 10.252C30.0981 10.01 30.0321 9.68 30.0321 9.262V4.719C30.0321 4.235 30.1275 3.85733 30.3181 3.586C30.5088 3.31467 30.7471 3.12767 31.0331 3.025C31.3191 2.915 31.6051 2.86 31.8911 2.86C32.7125 2.86 33.3981 2.87467 33.9481 2.904C34.4981 2.93333 34.9858 2.96633 35.4111 3.003V4.367H32.3751C32.1478 4.367 31.9718 4.422 31.8471 4.532C31.7225 4.642 31.6601 4.81067 31.6601 5.038V6.215L34.8831 6.303V7.59L31.6601 7.678V8.8C31.6601 9.086 31.7261 9.28033 31.8581 9.383C31.9975 9.47833 32.1588 9.526 32.3421 9.526H35.4111V10.89C34.9198 10.9413 34.3661 10.9817 33.7501 11.011C33.1341 11.0403 32.5548 11.055 32.0121 11.055ZM38.6306 11L36.0786 2.86H37.7616L39.6646 9.24L41.5676 2.86H43.2396L40.6876 11H38.6306ZM45.8266 11.055C45.6506 11.055 45.4489 11.0367 45.2216 11C44.9942 10.9707 44.7742 10.8973 44.5616 10.78C44.3562 10.6627 44.1839 10.4867 44.0446 10.252C43.9126 10.01 43.8466 9.68 43.8466 9.262V4.719C43.8466 4.235 43.9419 3.85733 44.1326 3.586C44.3232 3.31467 44.5616 3.12767 44.8476 3.025C45.1336 2.915 45.4196 2.86 45.7056 2.86C46.5269 2.86 47.2126 2.87467 47.7626 2.904C48.3126 2.93333 48.8002 2.96633 49.2256 3.003V4.367H46.1896C45.9622 4.367 45.7862 4.422 45.6616 4.532C45.5369 4.642 45.4746 4.81067 45.4746 5.038V6.215L48.6976 6.303V7.59L45.4746 7.678V8.8C45.4746 9.086 45.5406 9.28033 45.6726 9.383C45.8119 9.47833 45.9732 9.526 46.1566 9.526H49.2256V10.89C48.7342 10.9413 48.1806 10.9817 47.5646 11.011C46.9486 11.0403 46.3692 11.055 45.8266 11.055ZM52.3351 11C51.6971 11 51.2167 10.8533 50.8941 10.56C50.5714 10.2667 50.4101 9.77167 50.4101 9.075V2.86H52.0381V8.811C52.0381 9.08233 52.1041 9.26933 52.2361 9.372C52.3754 9.47467 52.5514 9.526 52.7641 9.526H55.3381V11H52.3351ZM59.3891 11.066C58.8317 11.066 58.3441 11.0147 57.9261 10.912C57.5081 10.802 57.1597 10.604 56.8811 10.318C56.6024 10.0247 56.3897 9.60667 56.2431 9.064C56.1037 8.52133 56.0341 7.81367 56.0341 6.941C56.0341 6.06833 56.1037 5.36067 56.2431 4.818C56.3897 4.268 56.6024 3.84633 56.8811 3.553C57.1671 3.25967 57.5154 3.058 57.9261 2.948C58.3441 2.838 58.8317 2.783 59.3891 2.783C59.9464 2.783 60.4341 2.838 60.8521 2.948C61.2701 3.058 61.6184 3.25967 61.8971 3.553C62.1757 3.84633 62.3847 4.268 62.5241 4.818C62.6634 5.36067 62.7331 6.06833 62.7331 6.941C62.7331 7.81367 62.6634 8.52133 62.5241 9.064C62.3847 9.60667 62.1757 10.0247 61.8971 10.318C61.6184 10.604 61.2664 10.802 60.8411 10.912C60.4231 11.0147 59.9391 11.066 59.3891 11.066ZM59.3891 9.603C59.7117 9.603 59.9831 9.57 60.2031 9.504C60.4304 9.43067 60.6064 9.29867 60.7311 9.108C60.8631 8.91733 60.9584 8.64967 61.0171 8.305C61.0757 7.953 61.1051 7.49833 61.1051 6.941C61.1051 6.36167 61.0757 5.896 61.0171 5.544C60.9584 5.18467 60.8631 4.91333 60.7311 4.73C60.5991 4.53933 60.4231 4.411 60.2031 4.345C59.9831 4.279 59.7117 4.246 59.3891 4.246C59.0664 4.246 58.7951 4.279 58.5751 4.345C58.3624 4.411 58.1864 4.53933 58.0471 4.73C57.9151 4.91333 57.8161 5.18467 57.7501 5.544C57.6914 5.896 57.6621 6.36167 57.6621 6.941C57.6621 7.49833 57.6877 7.953 57.7391 8.305C57.7977 8.64967 57.8931 8.91733 58.0251 9.108C58.1571 9.29867 58.3331 9.43067 58.5531 9.504C58.7731 9.57 59.0517 9.603 59.3891 9.603ZM63.9345 11V2.86H67.3665C67.6305 2.86 67.8981 2.893 68.1695 2.959C68.4481 3.01767 68.7011 3.14233 68.9285 3.333C69.1631 3.51633 69.3501 3.795 69.4895 4.169C69.6361 4.543 69.7095 5.038 69.7095 5.654C69.7095 6.27733 69.6361 6.77967 69.4895 7.161C69.3501 7.535 69.1668 7.821 68.9395 8.019C68.7121 8.217 68.4665 8.349 68.2025 8.415C67.9385 8.481 67.6818 8.514 67.4325 8.514C67.2565 8.514 67.0438 8.503 66.7945 8.481C66.5525 8.459 66.3178 8.43333 66.0905 8.404C65.8631 8.37467 65.6871 8.35267 65.5625 8.338V11H63.9345ZM65.5625 7.051H67.1795C67.4655 7.051 67.6855 6.94467 67.8395 6.732C67.9935 6.51933 68.0705 6.16367 68.0705 5.665C68.0705 5.17367 67.9898 4.829 67.8285 4.631C67.6745 4.42567 67.4691 4.323 67.2125 4.323H65.5625V7.051ZM72.7465 11.055C72.5705 11.055 72.3688 11.0367 72.1415 11C71.9142 10.9707 71.6942 10.8973 71.4815 10.78C71.2762 10.6627 71.1038 10.4867 70.9645 10.252C70.8325 10.01 70.7665 9.68 70.7665 9.262V4.719C70.7665 4.235 70.8618 3.85733 71.0525 3.586C71.2432 3.31467 71.4815 3.12767 71.7675 3.025C72.0535 2.915 72.3395 2.86 72.6255 2.86C73.4468 2.86 74.1325 2.87467 74.6825 2.904C75.2325 2.93333 75.7202 2.96633 76.1455 3.003V4.367H73.1095C72.8822 4.367 72.7062 4.422 72.5815 4.532C72.4568 4.642 72.3945 4.81067 72.3945 5.038V6.215L75.6175 6.303V7.59L72.3945 7.678V8.8C72.3945 9.086 72.4605 9.28033 72.5925 9.383C72.7318 9.47833 72.8932 9.526 73.0765 9.526H76.1455V10.89C75.6542 10.9413 75.1005 10.9817 74.4845 11.011C73.8685 11.0403 73.2892 11.055 72.7465 11.055ZM77.33 11V2.86H80.696C81.1213 2.86 81.51 2.93333 81.862 3.08C82.214 3.21933 82.4926 3.47967 82.698 3.861C82.9106 4.235 83.017 4.77033 83.017 5.467C83.017 5.973 82.9546 6.37633 82.83 6.677C82.7053 6.97033 82.544 7.19767 82.346 7.359C82.148 7.52033 81.9426 7.645 81.73 7.733L83.248 11H81.587L80.278 7.986C80.0946 7.986 79.8783 7.986 79.629 7.986C79.3796 7.97867 79.156 7.97133 78.958 7.964V11H77.33ZM78.958 6.677H80.41C80.7033 6.677 80.938 6.59633 81.114 6.435C81.2973 6.26633 81.389 5.94367 81.389 5.467C81.389 5.005 81.2973 4.70067 81.114 4.554C80.9306 4.4 80.696 4.323 80.41 4.323H78.958V6.677ZM86.6795 11.066C86.2615 11.066 85.8141 11.044 85.3375 11C84.8681 10.9487 84.4648 10.879 84.1275 10.791V9.504C84.4501 9.53333 84.8388 9.559 85.2935 9.581C85.7555 9.59567 86.1918 9.603 86.6025 9.603C87.0205 9.603 87.3505 9.548 87.5925 9.438C87.8345 9.32067 87.9555 9.10067 87.9555 8.778V8.481C87.9555 8.239 87.8821 8.05567 87.7355 7.931C87.5888 7.799 87.3871 7.733 87.1305 7.733H86.4375C85.6601 7.733 85.0625 7.56433 84.6445 7.227C84.2338 6.88233 84.0285 6.29933 84.0285 5.478V5.082C84.0285 4.29 84.2521 3.71067 84.6995 3.344C85.1541 2.97733 85.8068 2.794 86.6575 2.794C87.1048 2.794 87.5485 2.82333 87.9885 2.882C88.4358 2.94067 88.8135 3.003 89.1215 3.069V4.356C88.7841 4.334 88.4065 4.312 87.9885 4.29C87.5778 4.268 87.1965 4.257 86.8445 4.257C86.4631 4.257 86.1551 4.31567 85.9205 4.433C85.6931 4.55033 85.5795 4.79233 85.5795 5.159V5.379C85.5795 5.665 85.6601 5.87033 85.8215 5.995C85.9828 6.11967 86.2211 6.182 86.5365 6.182H87.3395C88.0655 6.182 88.6081 6.38 88.9675 6.776C89.3268 7.172 89.5065 7.67067 89.5065 8.272V8.734C89.5065 9.372 89.3855 9.85967 89.1435 10.197C88.9088 10.5343 88.5788 10.7653 88.1535 10.89C87.7355 11.0073 87.2441 11.066 86.6795 11.066Z"/>
<path d="M0.146447 7.14645C-0.0488155 7.34171 -0.0488155 7.65829 0.146447 7.85355L3.32843 11.0355C3.52369 11.2308 3.84027 11.2308 4.03553 11.0355C4.2308 10.8403 4.2308 10.5237 4.03553 10.3284L1.20711 7.5L4.03553 4.67157C4.2308 4.47631 4.2308 4.15973 4.03553 3.96447C3.84027 3.7692 3.52369 3.7692 3.32843 3.96447L0.146447 7.14645ZM17.5 8C17.7761 8 18 7.77614 18 7.5C18 7.22386 17.7761 7 17.5 7V8ZM0.5 8H17.5V7H0.5V8Z"/>
<path d="M95.5 7C95.2239 7 95 7.22386 95 7.5C95 7.77614 95.2239 8 95.5 8V7ZM112.854 7.85355C113.049 7.65829 113.049 7.34171 112.854 7.14645L109.672 3.96447C109.476 3.7692 109.16 3.7692 108.964 3.96447C108.769 4.15973 108.769 4.47631 108.964 4.67157L111.793 7.5L108.964 10.3284C108.769 10.5237 108.769 10.8403 108.964 11.0355C109.16 11.2308 109.476 11.2308 109.672 11.0355L112.854 7.85355ZM95.5 8H112.5V7H95.5V8Z"/>
</g>
</svg>
