<?xml version="1.0" encoding="UTF-8"?>
<svg width="337px" height="34px" viewBox="0 0 337 34" version="1.1" xmlns="http://www.w3.org/2000/svg" xmlns:xlink="http://www.w3.org/1999/xlink">
    <title>LP_University Square- transparent </title>
    <g id="Desktop" stroke="none" stroke-width="1" fill="none" fill-rule="evenodd">
        <g id="Liquidity-Provider-Tools" transform="translate(-1108.000000, -745.000000)" fill="#000B12" fill-rule="nonzero">
            <g id="Content" transform="translate(142.000000, 148.000000)">
                <g id="Lego-Blocks" transform="translate(0.000000, 105.000000)">
                    <g id="Blocks" transform="translate(344.000000, 14.000000)">
                        <g id="Technical-Docs-Copy-2" transform="translate(0.000000, 363.000000)">
                            <g id="Video/Image" transform="translate(549.000000, 0.000000)">
                                <g id="LP_University-Square--transparent-" transform="translate(73.000000, 115.000000)">
                                    <path d="M82.3143969,0.645401369 L91.0438445,0.645401369 L88.3042822,19.6259085 C87.8400123,22.9355692 87.0661583,25.5629826 85.9827201,27.5081485 C84.9704062,29.3890725 83.3408444,30.8724889 81.362616,31.7139038 C79.3658402,32.5713209 76.7578246,32.9999958 73.5385691,32.9999958 C70.3809017,32.9999958 67.8192692,32.5480844 65.8536714,31.6442615 C63.9429295,30.7999221 62.4599954,29.2244722 61.7441027,27.278309 C60.9701069,25.2717465 60.7999285,22.6138944 61.2335673,19.3047527 L63.9265198,0.645401369 L72.6562905,0.645401369 L69.9164136,19.6258875 C69.6849433,20.9843546 69.6149135,22.3649692 69.7077536,23.7395522 C69.8155632,24.7355246 70.187067,25.4325005 70.8222649,25.8304799 C71.4562244,26.2289783 72.408045,26.4280984 73.6777268,26.4278403 C74.7681071,26.480279 75.8541893,26.2590807 76.8350683,25.7847965 C77.6705212,25.2814905 78.2964649,24.4989265 78.5997275,23.5785935 C79.0907344,22.1904029 79.448284,20.7594451 79.6676206,19.3047527 L82.3143969,0.645401369 Z M115.002935,16.3634404 C114.881452,17.1931218 114.811767,18.0294274 114.794275,18.8675978 C114.778214,19.6801042 114.801386,20.5764415 114.86379,21.5566096 L114.352915,21.5566096 C114.127742,20.5898473 113.840865,19.6381892 113.494009,18.7073628 C113.168775,17.8500074 112.835979,17.0380017 112.495622,16.2713456 L106.598829,3.35694567 C106.299328,2.65146897 105.909108,1.98719229 105.437836,1.38056953 C105.035225,0.89075477 104.385167,0.645708534 103.487664,0.645430823 L100.051582,0.645430823 C99.2401849,0.587217585 98.4363295,0.833056387 97.799535,1.33416235 C97.2305524,1.91792205 96.8926883,2.68477138 96.8476392,3.49467767 L92.7614179,32.3569603 L100.840747,32.3569603 L103.116265,16.6845753 C103.239464,15.7359007 103.324554,14.8091246 103.371535,13.904247 C103.418028,13.0011479 103.425702,12.0895646 103.394555,11.169497 L103.858935,11.169497 C104.044689,12.0586433 104.2614,12.9320441 104.50907,13.7896997 C104.736215,14.5941195 105.031345,15.3781945 105.391336,16.1336262 L111.427717,29.645496 C111.716199,30.3632593 112.107176,31.0363702 112.58871,31.6442783 C112.990647,32.1201991 113.656127,32.3577612 114.585152,32.3569645 L118.021225,32.3569645 C118.832677,32.4149187 119.636488,32.168823 120.273162,31.6675093 C120.841871,31.0838606 121.179702,30.3173394 121.225053,29.5077177 L125.311151,0.645435031 L117.278453,0.645435031 L115.002935,16.3634404 Z M127.307937,32.3569561 L136.037384,32.3569561 L140.541368,0.645426615 L131.812022,0.645426615 L127.307937,32.3569561 Z M157.350353,22.1540332 C157.102162,22.7668991 156.877815,23.3949943 156.677313,24.0383187 C156.474342,24.6866904 156.311422,25.3466869 156.189457,26.0146485 L154.982296,26.0146485 L154.982296,24.0383187 C154.982052,23.3619805 154.935564,22.686434 154.843151,22.0163096 L153.078492,0.6454182 L144.302673,0.6454182 L148.388894,29.8753144 C148.494362,31.3084622 149.723941,32.4036972 151.174947,32.3569645 L158.882873,32.3569645 C160.368665,32.3569645 161.390187,31.6370522 161.947442,30.1972277 L174.391707,0.6454182 L165.244047,0.6454182 L157.350353,22.1540332 Z M190.410622,0.530109254 C188.553551,0.515438263 186.711753,0.507712849 184.885228,0.506933015 C182.624984,0.506933015 180.821858,1.10459079 179.475848,2.29990633 C178.085653,3.57721308 177.204226,5.30553608 176.991555,7.17116227 L174.577003,24.4058649 C174.267042,26.7962491 174.708099,28.7419088 175.900174,30.2428438 C177.091731,31.7440818 178.972237,32.4947302 181.541693,32.4947302 C183.151131,32.4947302 184.845996,32.4869866 186.626289,32.4714993 C188.406093,32.4559951 190.155165,32.4255591 191.873504,32.3801913 C193.591542,32.3337827 195.177958,32.2187346 196.632753,32.0350471 L196.772348,25.8305094 L185.349612,25.8305094 C184.575271,25.8305094 184.033475,25.6543242 183.724225,25.3019539 C183.392921,24.8609811 183.274158,24.2981749 183.399436,23.7628126 L184.080231,18.9372149 L196.214871,18.9372149 L196.957975,13.100236 L184.903865,13.100236 L185.442254,9.28525358 C185.482288,8.6589969 185.755219,8.06960136 186.208395,7.63076966 C186.751716,7.28126287 187.396661,7.119641 188.042556,7.17113282 L199.558282,7.17113282 L200.533313,1.05863524 C199.109172,0.874445565 197.530392,0.744186514 195.796973,0.667858085 C194.062996,0.592009338 192.267547,0.546088854 190.410626,0.530096631 L190.410622,0.530109254 Z M229.57656,4.13772575 C230.396276,5.57860789 230.63616,7.5549714 230.296211,10.0668163 C230.133539,11.275053 229.789263,12.4524254 229.2748,13.5598855 C228.78361,14.5964591 228.02233,15.4848271 227.069248,16.1336304 C225.859095,16.8859959 224.478707,17.3282579 223.052669,17.4205008 L223.006174,17.6960027 C223.606579,17.8043335 224.181347,18.0224013 224.701076,18.3390508 C225.32149,18.72522 225.839009,19.2533681 226.210002,19.8789705 C226.698629,20.7475309 226.984231,21.7135001 227.045781,22.7057649 L228.439038,32.3569645 L219.477451,32.3569645 L218.362939,22.6593577 C218.300382,21.7098472 218.10688,21.0972196 217.782434,20.8214751 C217.297307,20.5001976 216.715222,20.3540239 216.134027,20.407526 C214.445638,20.3852965 212.988372,20.3711795 211.754365,20.365175 L210.051152,32.3569645 L201.55395,32.3569645 L206.057933,0.645435031 C207.388634,0.49220592 208.650078,0.384901501 209.842267,0.323521774 C211.03337,0.262388902 212.310349,0.223946977 213.673205,0.208195998 C215.034786,0.193522201 216.659911,0.186056265 218.548579,0.18579819 C220.910613,0.128669374 223.267504,0.430890573 225.536851,1.08189563 C227.409422,1.67924063 228.755993,2.69784646 229.576565,4.13771313 L229.57656,4.13772575 Z M221.589894,7.81498458 C221.469578,7.31530419 221.103089,6.9092067 220.614978,6.73470167 C219.919084,6.50784152 219.187648,6.40667268 218.455581,6.43602356 C216.716429,6.43602356 215.151013,6.4435975 213.729686,6.45725162 L212.635951,14.1573048 L216.87714,14.1573048 C217.742107,14.1889291 218.60608,14.0721582 219.430815,13.8121606 C220.048073,13.5844501 220.554532,13.1325896 220.847202,12.5484664 C221.234003,11.7343587 221.492386,10.8663559 221.613343,9.97472146 C221.741639,9.25965463 221.733688,8.52714576 221.589902,7.81497195 L221.589894,7.81498458 Z M248.405458,0.00162955664 C246.593543,-0.0168379043 244.783472,0.121691942 242.995963,0.415633442 C241.608879,0.62985379 240.271981,1.08906395 239.049014,1.77136772 C237.972495,2.40812265 237.090056,3.32126156 236.495202,4.41402709 C235.795581,5.76049286 235.362263,7.22684476 235.218547,8.73424563 C235.05906,9.98188598 235.106059,11.2469135 235.357696,12.4795899 C235.622936,13.6618814 236.208839,14.7502187 237.052373,15.6275149 C238.169862,16.7426089 239.483904,17.6460932 240.929692,18.2934094 L246.919586,21.004878 C247.373179,21.1952568 247.808354,21.4260426 248.219741,21.6943879 C248.496182,21.8681225 248.708017,22.1261545 248.823267,22.4295308 C248.918185,22.8067992 248.918185,23.2013503 248.823267,23.5786187 C248.759951,24.0700016 248.540548,24.5287691 248.196717,24.8887243 C247.780226,25.2534269 247.262463,25.4855922 246.710815,25.5550033 C245.812531,25.6949761 244.903565,25.7566079 243.994388,25.7391888 C243.560551,25.7391888 242.848613,25.7314451 241.858576,25.7159578 C240.867147,25.700507 239.652048,25.6698087 238.213277,25.623863 C236.773977,25.5782342 235.156526,25.54007 233.360924,25.5093703 L232.525144,31.5297184 C234.752756,32.0850866 237.018803,32.4766884 239.304756,32.7013219 C241.440568,32.9001798 243.143107,33 244.412375,33 C247.383958,33 249.767445,32.7397442 251.562838,32.2192325 C253.203951,31.8041261 254.643443,30.827028 255.625907,29.4613021 C256.53861,28.144251 257.149997,26.2906609 257.460069,23.900532 C257.652399,22.5402032 257.613149,21.1575954 257.343948,19.8101024 C257.078782,18.6429085 256.482792,17.5747776 255.625907,16.7310371 C254.482092,15.6736351 253.152292,14.8325176 251.702318,14.2493113 L246.130429,11.7668869 C245.592323,11.5116267 245.07262,11.2199809 244.575012,10.8940204 C244.261491,10.702649 244.023737,10.4106681 243.901406,10.0667784 C243.805002,9.72308477 243.773591,9.36471778 243.808756,9.00972646 C243.874771,8.61865128 244.016681,8.24393123 244.226646,7.90626311 C244.414332,7.62906796 244.680995,7.41331697 244.992787,7.28639548 C245.378573,7.13387705 245.785679,7.04072251 246.199953,7.01016988 C246.679606,6.96448222 247.244612,6.94150936 247.894969,6.94125128 C249.163787,6.94125128 250.432902,6.94899493 251.702314,6.96448222 C252.971245,6.97998635 254.209516,6.99521556 255.417128,7.01016988 C256.624292,7.02639493 257.707659,7.04934816 258.66723,7.07902957 L259.410236,1.51826366 C257.619306,0.954981935 255.776047,0.570029318 253.907866,0.369129483 C251.972834,0.155603438 250.138701,0.0330936443 248.405466,0.00160010245 L248.405458,0.00162955664 Z M261.407009,32.3569645 L270.136452,32.3569645 L274.640436,0.645435031 L265.91109,0.645435031 L261.407009,32.3569645 Z M288.106113,0.645435031 L278.911927,0.645435031 L277.983392,7.21756945 L287.172501,7.21756945 L283.601547,32.3569645 L292.284835,32.3569645 L295.855343,7.21756945 L305.054222,7.21756945 L305.982647,0.645435031 L288.106091,0.645435031 L288.106113,0.645435031 Z M337,0.645422408 L327.713275,0.645422408 L321.537635,11.5834925 C321.157913,12.306731 320.83952,13.0599293 320.58574,13.8353242 C320.350399,14.5281027 320.156598,15.2340329 320.005349,15.9494281 L319.401709,15.9494281 C319.401709,15.2761895 319.378387,14.586716 319.331743,13.8810077 C319.270927,13.089649 319.138933,12.3052349 318.937329,11.5370853 L315.965636,0.645422408 L307.235861,0.645422408 L314.644156,22.0164064 L313.179693,32.3569645 L321.955525,32.3569645 L323.344734,22.3246066 L337,0.645422408 Z" id="Shape"></path>
                                    <path d="M38.2660246,22.5862223 C38.3092965,22.5921293 38.3535219,22.5976073 38.3968764,22.6034469 L38.2612116,22.6034469 L38.2636175,22.5948339 L38.2660246,22.5862223 Z M20.4847705,24.5718385 L12.2937782,25.1255628 L12.294859,25.1233104 L2.4978061,25.8024044 L2.3485119,26.840552 C2.12950444,28.2697931 2.28571898,29.5238095 2.81715553,30.6026012 C3.33122849,31.6644078 4.17566886,32.5418961 5.23083429,33.1107414 C6.3087955,33.7035173 7.59763237,34 9.09734492,34 C9.9466249,34 10.7992769,33.9968086 11.6553009,33.9904257 L11.654414,34 L19.0041929,34 C19.5106572,34 19.9558789,33.6736209 20.0955414,33.1999448 L21.5761191,25.9811894 C21.6744261,25.6477814 21.6060857,25.2888065 21.3915661,25.0117791 C21.1770465,24.7347518 20.841258,24.5718385 20.4847705,24.5718385 L20.4847705,24.5718385 Z M23.1750011,32.8612138 C23.0418852,33.0818112 23.0409925,33.3550204 23.1726641,33.5764368 C23.3043357,33.7978533 23.5482213,33.9332563 23.811122,33.930933 L30.4423996,33.8776635 C31.157128,33.8712706 31.7851459,33.4148771 31.9942979,32.7498672 L34.8855459,23.5573847 L26.3112293,24.1517391 L23.1750011,32.8612138 Z M50.4089932,5.35710389 C49.7645284,3.76770076 48.5311016,2.6440356 46.7087128,1.9861084 C44.8858366,1.3288986 42.4032668,1 39.2610035,1 C37.3121146,1 35.6465687,1.00766843 34.2643656,1.0230053 C32.8811629,1.03867533 31.6006142,1.07689196 30.4227194,1.13765518 C30.3239013,1.14280668 29.5564461,1.15642638 29.478918,1.17600682 L28.6510655,1.20553893 C27.7235632,1.22369036 26.2145452,1.77609221 25.8630424,2.61138365 L22.7686145,9.96497648 C22.6760983,10.184833 22.7026981,10.4351387 22.8394906,10.6319256 C22.9762831,10.8287125 23.2051472,10.9459117 23.4493077,10.9442075 L24.8559064,10.9343388 L25.7877052,10.9277859 C26.0348247,10.9260568 26.2660603,11.0461103 26.4021685,11.2468045 C26.5382767,11.4474987 26.5607701,11.7015734 26.4619403,11.9219583 L25.2080997,15.164816 L23.7514436,18.9322986 L21.9601347,23.4387904 L26.4193861,23.0873429 L32.3877374,22.673621 C32.3877374,22.673621 43.220507,21.8152161 44.9175175,21.2490864 C46.6144411,20.6836846 47.9185694,19.6670188 48.8299026,18.1990889 C49.7409664,16.7314833 50.3851721,14.6370377 50.7625197,11.915752 C51.1705975,9.13372992 51.0527554,6.94751389 50.4089932,5.35710389 Z M42.0420686,11.2736201 C41.8535803,12.619405 41.594344,13.6207429 41.2643595,14.2776338 C40.9858951,14.8328676 40.6166238,15.2278175 40.1592622,15.466611 C40.0897838,15.5013426 40.0184441,15.5324298 39.9455493,15.5597391 C39.8732305,15.586359 39.7973916,15.6113154 39.7180324,15.6346083 C39.4530074,15.7100172 39.1823035,15.7650526 38.908419,15.7992068 C38.5765151,15.8413933 38.2425373,15.866349 37.907905,15.8739679 C37.786108,15.8772838 37.6607723,15.8789308 37.5318981,15.8789308 L34.5248676,15.8789308 L37.234668,7.26343281 C37.6812199,7.26194934 38.1417696,7.26116773 38.6101081,7.26076272 C38.7662207,7.2606285 38.9197278,7.26038534 39.0784743,7.26038534 C39.1956435,7.26038534 39.3092725,7.26228225 39.4193613,7.26607607 C39.6394771,7.2736816 39.8454472,7.28890188 40.0372715,7.31173691 C40.4347587,7.34876236 40.8229821,7.45074602 41.1856103,7.61339769 C41.6629845,7.85936438 41.9641965,8.26914823 42.0892463,8.84274926 C42.2144529,9.42398319 42.198727,10.2342735 42.0420686,11.2736201 Z M13.4264281,1.33387009 L4.00188896,1.33387009 C3.63729884,1.33387009 3.32863903,1.59566922 3.27886882,1.94708964 L1.69955667,13.1006104 L0,24.9186486 L9.79705292,24.2395546 L13.3638667,16.8436326 C13.4500262,16.6252749 13.4201556,16.3796401 13.2840017,16.1868761 C13.1478477,15.9941121 12.9228715,15.8789403 12.6824806,15.8789402 L9.8382715,15.8789402 C9.60684545,15.8789432 9.38913209,15.7721531 9.25150212,15.5911253 C9.11387214,15.4100975 9.07263727,15.1762872 9.14036809,14.9609721 L13.4264281,1.33387009 Z" id="Shape"></path>
                                </g>
                            </g>
                        </g>
                    </g>
                </g>
            </g>
        </g>
    </g>
</svg>