<?xml version="1.0" encoding="UTF-8"?>
<svg width="52px" height="52px" viewBox="0 0 52 52" version="1.1" xmlns="http://www.w3.org/2000/svg" xmlns:xlink="http://www.w3.org/1999/xlink">
    <title>THORWallet</title>
    <defs>
        <circle id="path-1" cx="26" cy="26" r="26"></circle>
        <linearGradient x1="12.0707596%" y1="100%" x2="87.9292404%" y2="0%" id="linearGradient-3">
            <stop stop-color="#04D0F5" offset="0%"></stop>
            <stop stop-color="#31FC9C" offset="100%"></stop>
        </linearGradient>
    </defs>
    <g id="⚡-Active---THORChain.org" stroke="none" stroke-width="1" fill="none" fill-rule="evenodd">
        <g id="Mobile:-Post-Builder" transform="translate(0.000000, -3.000000)">
            <g id="THORWallet" transform="translate(0.000000, 3.000000)">
                <mask id="mask-2" fill="white">
                    <use xlink:href="#path-1"></use>
                </mask>
                <use id="Oval" fill="#000000" xlink:href="#path-1"></use>
                <path d="M12,41 L34,31.9198671 L27.0401854,25 L12,41 Z M20,18.0357143 L26.8190412,25 L39,10 L20,18.0357143 Z" id="Shape" fill="url(#linearGradient-3)" fill-rule="nonzero" mask="url(#mask-2)"></path>
            </g>
        </g>
    </g>
</svg>