<?xml version="1.0" encoding="UTF-8"?>
<svg width="306px" height="66px" viewBox="0 0 306 66" version="1.1" xmlns="http://www.w3.org/2000/svg" xmlns:xlink="http://www.w3.org/1999/xlink">
    <title>logo_thorstarter_white</title>
    <g id="Desktop" stroke="none" stroke-width="1" fill="none" fill-rule="evenodd">
        <g id="Project-Funding" transform="translate(-1123.000000, -1364.000000)" fill-rule="nonzero">
            <g id="Content" transform="translate(142.000000, 148.000000)">
                <g id="Lego-Blocks" transform="translate(0.000000, 105.000000)">
                    <g id="Blocks" transform="translate(344.000000, 14.000000)">
                        <g id="Technical-Docs-Copy-3" transform="translate(0.000000, 766.000000)">
                            <g id="Video/Image" transform="translate(549.000000, 0.000000)">
                                <g id="Group" transform="translate(88.000000, 331.000000)">
                                    <polygon id="Path" fill="#FFFFFF" points="41.2743989 28.2250804 34.4519128 28.2250804 34.4519128 21.5614147 55.6400817 21.5614147 55.6400817 28.2250804 48.9021482 28.2250804 48.9021482 50.0836013 41.2743989 50.0836013"></polygon>
                                    <polygon id="Path" fill="#FFFFFF" points="82.1406564 21.5614147 82.1406564 50.0836013 74.5129071 50.0836013 74.5129071 39.0057877 66.5886938 39.0057877 66.5886938 50.0836013 59.0457091 50.0836013 59.0457091 21.5614147 66.5886938 21.5614147 66.5886938 32.4694533 74.5129071 32.4694533 74.5129071 21.5614147"></polygon>
                                    <path d="M98.6137977,50.6353698 C94.2914418,50.6353698 91.1697756,49.461164 89.2485872,47.1125402 C87.355795,44.7639164 86.4093988,41.0430868 86.4093988,35.9498392 C86.4093988,30.7999292 87.355795,27.0224373 89.2485872,24.6173634 C91.1413794,22.2122894 94.2632575,21.0096463 98.6137977,21.0096463 C102.964338,21.0096463 106.086216,22.2122894 107.979008,24.6173634 C109.8718,27.0224373 110.818197,30.7859228 110.818197,35.9073954 C110.818197,40.802643 109.885787,44.4810289 108.021391,46.9427653 C106.156782,49.4045016 103.020918,50.6353698 98.6137977,50.6353698 Z M98.6137977,44.0990353 C99.7155248,44.0990353 100.577156,43.8301544 101.198692,43.2926046 C101.848413,42.7266173 102.314618,41.8637364 102.597096,40.703537 C102.879573,39.5151125 103.020918,37.9164695 103.020918,35.9073954 C103.020918,32.9081094 102.696058,30.7717042 102.046338,29.4983923 C101.396406,28.1968553 100.252296,27.5459807 98.6137977,27.5459807 C97.0034832,27.5459807 95.8593739,28.1968553 95.1812576,29.4983923 C94.5315373,30.7999292 94.2066772,32.9505531 94.2066772,35.9498392 C94.2066772,38.6095756 94.4891551,40.6328682 95.0541107,42.0192926 C95.6192784,43.4057171 96.80577,44.0990353 98.6137977,44.0990353 Z" id="Shape" fill="#FFFFFF"></path>
                                    <path d="M115.202431,21.5614147 L126.601566,21.5614147 C130.161253,21.5614147 132.830913,22.3960708 134.610756,24.0655949 C136.418784,25.735119 137.322798,28.1968553 137.322798,31.4508039 C137.322798,34.7047524 136.164491,37.4353698 133.847875,39.6424437 L136.941358,50.0836013 L128.678086,50.0836013 L126.601566,41.4675241 L122.745415,41.4675241 L122.745415,50.0836013 L115.202431,50.0836013 L115.202431,21.5614147 Z M126.728713,35.0160772 C127.632727,35.0160772 128.32483,34.6765274 128.805233,33.9974276 C129.313608,33.2901029 129.567902,32.4412283 129.567902,31.4508039 C129.567902,30.4888167 129.285424,29.6681671 128.720468,28.9890675 C128.183697,28.3099678 127.477396,27.970418 126.601566,27.970418 L122.745415,27.970418 L122.745415,35.0160772 L126.728713,35.0160772 Z" id="Shape" fill="#FFFFFF"></path>
                                    <path d="M150.249602,50.6778136 C147.820039,50.6778136 145.051417,50.2675949 141.943737,49.4469454 L140.418187,49.1073954 L141.181068,43.3350482 C144.910072,43.844373 147.791642,44.0990353 149.82578,44.0990353 C152.029234,44.0990353 153.131173,43.3350482 153.131173,41.8070739 C153.131173,41.2695241 152.876879,40.8450868 152.368292,40.5337621 C151.888101,40.2224373 151.167602,39.8828875 150.20722,39.5151125 C149.585684,39.2886752 149.133678,39.1048939 148.851199,38.9633441 C145.658754,37.8880322 143.384522,36.657164 142.028501,35.2707395 C140.700665,33.8843151 140.036959,32.1441222 140.036959,30.0501608 C140.036959,27.0790997 140.940972,24.829582 142.749,23.3016077 C144.557027,21.7736334 147.014775,21.0096463 150.122455,21.0096463 C151.393712,21.0096463 152.594401,21.0945338 153.724313,21.2643087 C154.88262,21.4340836 156.987324,21.8018585 160.038424,22.3678456 L159.445072,28.2250804 C155.772648,27.800643 152.947446,27.5884244 150.969888,27.5884244 C148.653274,27.5884244 147.495179,28.2250804 147.495179,29.4983923 C147.495179,29.9228296 147.777657,30.2906046 148.342612,30.6019292 C148.907567,30.8848167 149.797595,31.2528039 151.012272,31.7054662 C152.255344,32.1581286 153.060394,32.4694533 153.427637,32.6392283 C155.292245,33.4032154 156.733031,34.152984 157.750205,34.888746 C158.767167,35.5960708 159.501652,36.459164 159.953659,37.4778136 C160.405666,38.496463 160.631776,39.7839936 160.631776,41.340193 C160.631776,43.3208296 160.165571,45.0185787 159.233372,46.4334405 C158.329146,47.8198649 157.086286,48.8809581 155.504157,49.6167202 C153.950423,50.324045 152.198764,50.6778136 150.249602,50.6778136 Z" id="Path" fill="#FFFFFF"></path>
                                    <polygon id="Path" fill="#FFFFFF" points="169.230715 28.2250804 162.408229 28.2250804 162.408229 21.5614147 183.596397 21.5614147 183.596397 28.2250804 176.858463 28.2250804 176.858463 50.0836013 169.230715 50.0836013"></polygon>
                                    <path d="M199.83135,46.4334405 L191.525697,46.4334405 L190.974728,50.0836013 L183.346978,50.0836013 L188.813443,21.5614147 L202.543391,21.5614147 L208.009857,50.0836013 L200.38232,50.0836013 L199.83135,46.4334405 Z M196.610722,27.7581993 L194.746114,27.7581993 L192.796952,39.8971061 L198.560094,39.8971061 L196.610722,27.7581993 Z" id="Shape" fill="#FFFFFF"></path>
                                    <path d="M211.376492,21.5614147 L222.776052,21.5614147 C226.336163,21.5614147 229.004127,22.3960708 230.784182,24.0655949 C232.593906,25.735119 233.496648,28.1968553 233.496648,31.4508039 C233.496648,34.7047524 232.339611,37.4353698 230.021302,39.6424437 L233.115208,50.0836013 L224.852784,50.0836013 L222.776052,41.4675241 L218.919265,41.4675241 L218.919265,50.0836013 L211.376492,50.0836013 L211.376492,21.5614147 Z M222.903199,35.0160772 C223.805942,35.0160772 224.498891,34.6765274 224.97993,33.9974276 C225.488517,33.2901029 225.742811,32.4412283 225.742811,31.4508039 C225.742811,30.4888167 225.45885,29.6681671 224.895165,28.9890675 C224.356911,28.3099678 223.651247,27.970418 222.776052,27.970418 L218.919265,27.970418 L218.919265,35.0160772 L222.903199,35.0160772 Z" id="Shape" fill="#FFFFFF"></path>
                                    <polygon id="Path" fill="#FFFFFF" points="242.602479 28.2250804 235.781053 28.2250804 235.781053 21.5614147 256.96795 21.5614147 256.96795 28.2250804 250.231287 28.2250804 250.231287 50.0836013 242.602479 50.0836013"></polygon>
                                    <polygon id="Path" fill="#FFFFFF" points="267.91741 28.140193 267.91741 32.5967846 276.985097 32.5967846 276.985097 39.0482316 267.91741 39.0482316 267.91741 43.5048232 279.528034 43.5048232 279.528034 50.0836013 260.373365 50.0836013 260.373365 21.5614147 279.528034 21.5614147 279.528034 28.140193"></polygon>
                                    <path d="M283.878574,21.5614147 L295.279404,21.5614147 C298.837396,21.5614147 301.507479,22.3960708 303.287534,24.0655949 C305.095139,25.735119 306,28.1968553 306,31.4508039 C306,34.7047524 304.840845,37.4353698 302.524654,39.6424437 L305.61856,50.0836013 L297.356135,50.0836013 L295.279404,41.4675241 L291.422617,41.4675241 L291.422617,50.0836013 L283.878574,50.0836013 L283.878574,21.5614147 Z M295.406551,35.0160772 C296.309294,35.0160772 297.002243,34.6765274 297.483282,33.9974276 C297.991869,33.2901029 298.246163,32.4412283 298.246163,31.4508039 C298.246163,30.4888167 297.962202,29.6681671 297.398517,28.9890675 C296.860263,28.3099678 296.154598,27.970418 295.279404,27.970418 L291.422617,27.970418 L291.422617,35.0160772 L295.406551,35.0160772 Z" id="Shape" fill="#FFFFFF"></path>
                                    <polygon id="Path" fill="#28DBD1" points="0 37.5627009 22.8832479 0 13.6917835 28.8617364 24.3664155 28.8617364 1.69504927 66 10.8059323 37.5627009"></polygon>
                                </g>
                            </g>
                        </g>
                    </g>
                </g>
            </g>
        </g>
    </g>
</svg>