<?xml version="1.0" encoding="UTF-8"?>
<svg width="36px" height="36px" viewBox="0 0 36 36" version="1.1" xmlns="http://www.w3.org/2000/svg" xmlns:xlink="http://www.w3.org/1999/xlink">
    <title>Avatar Copy 4</title>
    <defs>
        <circle id="path-1" cx="18" cy="18" r="18"></circle>
    </defs>
    <g id="⚡-Active---THORChain.org" stroke="none" stroke-width="1" fill="none" fill-rule="evenodd">
        <g id="Mobile:-Story-Card-Builder" transform="translate(-13.000000, -24.000000)">
            <g id="Heading-Copy" transform="translate(13.000000, 9.500000)">
                <g id="Avatar-Copy-4" transform="translate(0.000000, 14.500000)">
                    <mask id="mask-2" fill="white">
                        <use xlink:href="#path-1"></use>
                    </mask>
                    <use id="Oval" fill="#DC0114" xlink:href="#path-1"></use>
                    <path d="M8.30769231,28.3846154 L23.5384615,22.0983695 L18.7201284,17.3076923 L8.30769231,28.3846154 Z M13.8461538,12.4862637 L18.5670285,17.3076923 L27,6.92307692 L13.8461538,12.4862637 Z" id="Shape" fill="#000B12" fill-rule="nonzero" mask="url(#mask-2)"></path>
                </g>
            </g>
        </g>
    </g>
</svg>