{
    "nixpkgs": {
        "branch": "nixpkgs-unstable",
        "description": "Nix Packages collection",
        "homepage": "",
        "owner": "NixOS",
        "repo": "nixpkgs",
        "rev": "70dc433f2eb84cc7ed848a30feaa5aab5890d23c",
        "sha256": "1x771zz28a1bka522p95373azifhbr9pm2jmd14j13aivi85bdcj",
        "type": "tarball",
        "url": "https://github.com/NixOS/nixpkgs/archive/70dc433f2eb84cc7ed848a30feaa5aab5890d23c.tar.gz",
        "url_template": "https://github.com/<owner>/<repo>/archive/<rev>.tar.gz"
    }
}
