{
    "niv": {
        "branch": "master",
        "description": "Easy dependency management for Nix projects",
        "homepage": "https://github.com/nmattia/niv",
        "owner": "nmattia",
        "repo": "niv",
        "rev": "82e5cd1ad3c387863f0545d7591512e76ab0fc41",
        "sha256": "090l219mzc0gi33i3psgph6s2pwsc8qy4lyrqjdj4qzkvmaj65a7",
        "type": "tarball",
        "url": "https://github.com/nmattia/niv/archive/82e5cd1ad3c387863f0545d7591512e76ab0fc41.tar.gz",
        "url_template": "https://github.com/<owner>/<repo>/archive/<rev>.tar.gz"
    },
    "nixpkgs": {
        "branch": "master",
        "description": "Nix Packages collection",
        "homepage": "",
        "owner": "NixOS",
        "repo": "nixpkgs",
        "rev": "3a4ca363a64fbdc289e290f65aab71ba5a6b5f48",
        "sha256": "1a3cm17vqrybc0l1vpjr7c9jsl7d97pagir2ysfhspyann5vmyxc",
        "type": "tarball",
        "url": "https://github.com/NixOS/nixpkgs/archive/3a4ca363a64fbdc289e290f65aab71ba5a6b5f48.tar.gz",
        "url_template": "https://github.com/<owner>/<repo>/archive/<rev>.tar.gz"
    }
}
