{
    "id": "lu5tYjSel521BgnmXzytxv6WXpTqkVHR",
    "secret": "3AAVbdQeQItrJ_USp7YllF7OK2LkrRJArzNowb-HXfxJozP6uxMbSuZmSULArgUt",
    "entity": "admin",
    "slug": "admin-web",
    "scopes": {
        "client_credentials": [],
        "password": [
            "super",
            "admin",
            "zest"
        ]
    }
}
