{
    "camera": {
        "detector": {
            "checkerboard": {
                "width": 9,
                "height": 6,
                "checker_length": 0.061,
                "variances": [0.01, 0.01, 0.01]
            }
        },
        "descriptor": null
    }
}
