{
    "camera": {
        "detector": {
            "markerboard": {
                "width": 9,
                "height": 6,
                "checker_length": 0.061,
                "marker_length": 0.05,
                "marker_dictionary": "Aruco6x6_250",
                "variances": [0.01, 0.01, 0.01]
            }
        },
        "descriptor": null
    }
}
