{
    "camera": {
        "descriptor": {
            "targets": [{
                    "coordinates": [1.3, 1.3, 1.3],
                    "id": 1,
                    "variances": [1.3, 1.3, 1.3]
                },
                {
                    "coordinates": [1.3, 1.3, 1.3],
                    "id": 1,
                    "variances": [1.3, 1.3, 1.3]
                }
            ]
        },
        "detector": {
            "markers": { "marker_dictionary": "Aruco4x4_50", "marker_length": 1.3 }
        }
    }
}