// Jest Snapshot v1, https://goo.gl/fbAQLP

exports[`<ProfileForm> with props should match the snapshot 1`] = `"<div class=\\"container\\"><form class=\\"\\"><div class=\\"form-group\\"><label class=\\"form-label\\" for=\\"signUpFormName\\">Name</label><input type=\\"name\\" placeholder=\\"\\" value=\\"\\" required=\\"\\" id=\\"signUpFormName\\" class=\\"form-control\\"/></div><div class=\\"form-group\\"><label class=\\"form-label\\" for=\\"signUpFormPhone\\">Phone</label><input type=\\"tel\\" placeholder=\\"\\" value=\\"\\" required=\\"\\" id=\\"signUpFormPhone\\" class=\\"form-control\\"/><small class=\\"text-muted form-text\\">In case we need to check something with you or alter a booking.</small></div><div class=\\"form-group\\"><label class=\\"form-label\\" for=\\"signUpFormAddress\\">Address</label><textarea rows=\\"3\\" id=\\"signUpFormAddress\\" class=\\"form-control\\"></textarea><small class=\\"text-muted form-text\\">In case we need to check something with you or alter a booking.</small></div><div class=\\"form-group\\"><label class=\\"form-label\\" for=\\"signUpFormDob\\">Date of Birth</label><input type=\\"date\\" placeholder=\\"\\" value=\\"\\" id=\\"signUpFormDob\\" class=\\"form-control\\"/></div><div class=\\"form-check\\"><input type=\\"checkbox\\" id=\\"signUpFormCurrentMember\\" class=\\"form-check-input\\"/><label title=\\"\\" for=\\"signUpFormCurrentMember\\" class=\\"form-check-label\\">Current Member</label></div><div class=\\"form-check\\"><input type=\\"checkbox\\" id=\\"signUpFormCompletedForm\\" class=\\"form-check-input\\"/><label title=\\"\\" for=\\"signUpFormCompletedForm\\" class=\\"form-check-label\\">Completed Individual Climber Form</label></div><div class=\\"form-check\\"><input type=\\"checkbox\\" id=\\"signUpFormInducted\\" class=\\"form-check-input\\"/><label title=\\"\\" for=\\"signUpFormInducted\\" class=\\"form-check-label\\">Rockburn Inducted </label></div><p><button type=\\"submit\\" class=\\"btn btn-primary\\">Save Profile</button> <a href=\\"/\\" class=\\"btn btn-secondary\\">Cancel</a></p></form></div>"`;
