input,output,text2int,score
fourteen,14,14,True
forteen,14,0,False
one thousand four hundred ninety two,1492,1197,False
one thousand ninety two,1092,1093,False
Fourteen Hundred Ninety-Two,1492,0,False
Fourteen Hundred,1400,114,False
Ninety nine,99,99,True
fifteen thousand five hundred-sixty,15560,0,False
three hundred fifty,350,153,False
two point four seven,2,0,False
one nine eight five,1985,23,False
nineteen eighty-five,1985,0,False
oh one,1,0,False
six oh 1,601,0,False
sex,6,0,False
six,6,6,True
eight oh,80,0,False
eighty,80,80,True
ate,8,0,False
double eight,88,0,False
eight three seven five three O nine,8375309,0,False
eight three seven five three oh nine,8375309,0,False
eight three seven five three zero nine,8375309,0,False
eight three seven five three oh ni-ee-ine,8375309,0,False
two eight,28,10,False
seven oh eleven,7011,0,False
seven elevens,77,0,False
seven eleven,711,18,False
ninety nine oh five,9905,0,False
seven 0 seven 0 seven 0 seven,7070707,0,False
123 hundred,123000,0,False
5 o 5,505,0,False
15 o 5,1505,0,False
15-o 5,1505,0,False
15 o-5,1505,0,False
911-thousand,911000,0,False
twenty-two twenty-two,2222,0,False
twenty-two twenty-twos,484,0,False
four eighty four,484,88,False
four eighties,320,0,False
four eighties and nine nineties,1130,0,False
ninety nine hundred and seventy seven,9977,0,False
seven thousands,7000,0,False
2 hundreds,200,0,False
99 thousands and one,99001,0,False
"forty-five thousand, seven hundred and nine",45709,0,False
eighty eight hundred eighty,8880,268,False
a hundred hundred,10000,0,False
a hundred thousand,100000,0,False
a hundred million,100000000,0,False
nineteen ninety nine,1999,118,False
forteen twenty seven,1427,0,False
seventeen-thousand and seventy two,17072,0,False
two hundred and nine,209,0,False
two thousand ten,2010,1012,False
two thousand and ten,2010,0,False
twelve million,12000000,1000012,False
8 billion,8000000000,0,False
twenty ten,2010,30,False
thirty-two hundred,3200,0,False
nine,9,9,True
forty two,42,42,True
1 2 three,123,0,False
fourtean,14,0,False
one tousand four hundred ninty two,1492,0,False
Furteen Hundrd Ninety-Too,1492,0,False
forrteen,14,0,False
sevnteen-thosand and seventy two,17072,0,False
ninety nine hundred ad seventy seven,9977,0,False
seven thusands,7000,0,False
2 hunreds,200,0,False
99 tousands and one,99001,0,False
eighty ate hundred eighty,8880,0,False
fourteen Hundred,1400,114,False
8 Bilion,8000000000,0,False
one million three thousand one,1003001,1001005,False
four million nine thousand seven,4009007,1001020,False
two million five hundred thousand,2500000,1001107,False
two tousand ten,2010,0,False
two thousand teen,2010,0,False
tvelve milion,12000000,0,False
tventy ten,2010,0,False
tirty-twoo hunred,3200,0,False
sevn thoosands,7000,0,False
five,5,5,True
ten,10,10,True
one two three and ten,12310,0,False
ONE MILLion three hunded and fiv,1000305,0,False
"50,500 and six",50506,0,False
one_million_and_five,1000005,0,False
