<?xml version="1.0" encoding="utf-8"?>
<!-- Generator: Adobe Illustrator 16.0.3, SVG Export Plug-In . SVG Version: 6.00 Build 0)  -->
<!DOCTYPE svg PUBLIC "-//W3C//DTD SVG 1.1//EN" "http://www.w3.org/Graphics/SVG/1.1/DTD/svg11.dtd">
<svg version="1.1" id="Ebene_1" xmlns="http://www.w3.org/2000/svg" xmlns:xlink="http://www.w3.org/1999/xlink" x="0px" y="0px"
	 width="260px" height="260px" viewBox="0 0 260 260" enable-background="new 0 0 260 260" xml:space="preserve">
<g>
	<path fill-rule="evenodd" clip-rule="evenodd" fill="#AE665A" d="M197.527,0.46c1.611,0.951,3.497,0.932,5.231,1.466
		c4.41,1.357,8.472,3.341,12.023,6.303c0.742,0.618,1.443,1.024,2.485,0.959c19.141-1.174,28.592,11.297,31.609,25.741
		c2.038,9.754,1.172,19.263-2.599,28.497c-0.492,0.467-1.082,0.392-1.646,0.238c-3.402-0.932-6.764-0.607-10.107,0.298
		c-1.261,0.097-2.259-0.551-3.291-1.141c-6.481-3.7-11.695-8.88-16.62-14.365c-2.425-2.7-4.771-5.479-6.988-8.364
		c-1.573-2.048-2.255-2.11-4.421-0.539c-8.64,6.269-17.64,11.95-27.269,16.579c-7.106,3.415-14.447,6.202-22.242,7.644
		c-0.917,0.169-1.828,0.346-2.77,0.288c-4.28-1.114-8.548-1.517-12.793,0.17c-0.313,0.124-0.66,0.023-0.979-0.098
		c-1.846-2.329-1.347-5.208-1.545-7.809c-0.904-11.917,0.983-23.323,7.63-33.508c7.225-11.07,17.961-17.083,30.402-20.558
		c3.682-1.028,7.468-1.163,11.19-1.802c0.677,0,1.354,0,2.031,0c0.339,0.319,0.678,0.319,1.016,0
		C191.094,0.46,194.311,0.46,197.527,0.46z"/>
	<path fill-rule="evenodd" clip-rule="evenodd" fill="#F6C3A7" d="M186.354,260.508c-3.622-1.52-7.563-1.996-11.159-3.705
		c-13.095-6.225-20.945-16.417-23.951-30.549c-0.525-2.47,0.087-5.037-0.951-7.404c-0.432-1.371-0.303-2.694,0.335-3.975
		c1.433-0.32,1.168,0.874,1.309,1.566c3.624,17.816,16.023,30.39,33.818,33.354c10.885,1.813,21.186-0.453,30.332-6.969
		c8.726-6.216,13.991-14.703,16.451-25.044c0.377-1.583,0.249-3.2,0.521-4.776c0.118-0.691,0.195-1.956,1.46-0.805
		c0.404,2.259,0.83,4.518-0.418,6.67c-0.274,20.688-14.71,37.54-35.228,41.115c-0.491,0.085-1.028,0.004-1.345,0.521
		C193.803,260.508,190.078,260.508,186.354,260.508z"/>
	<path fill-rule="evenodd" clip-rule="evenodd" fill="#F6C3A7" d="M110.178,218.905c0.007,20.346-14.408,37.394-34.733,41.069
		c-0.49,0.088-1.032,0.002-1.338,0.533c-3.894,0-7.788,0-11.682,0c-2.792-1.393-5.953-1.565-8.824-2.795
		c-14.823-6.344-23.74-17.26-26.297-33.282c-0.294-1.848-0.421-3.677-0.44-5.53c-1.199-1.977-0.813-4.064-0.436-6.148
		c1.597-1.457,1.454,0.396,1.491,0.953c0.145,2.21,0.557,4.353,1.122,6.483c4.195,15.831,18.241,28.138,34.515,29.889
		c23.053,2.479,40.848-12.755,45.03-31.706c0.256-1.161,0.279-2.358,0.575-3.498c0.151-0.581,0.228-1.838,1.389-0.723
		C111.033,215.784,111.215,217.393,110.178,218.905z"/>
	<path fill-rule="evenodd" clip-rule="evenodd" fill="#AE665A" d="M84.772,0.46c4.045,2.772,3.773,5.794-0.671,8.137
		c-6.545,3.448-10.185,8.903-11.038,16.237c0.317,1.164,0.264,2.344,0.017,3.498c-0.559,2.612-2.641,4.253-5.15,3.626
		c-3.838-0.959-7.067-2.985-9.103-6.556c-4.45-5.286-6.922-11.349-7.138-18.283c-0.095-3.07,1.355-4.944,3.784-4.989
		c2.307-0.042,3.759,1.675,3.978,4.605c0.394,5.271,1.984,10.035,6.084,14.122c1.258-3.872,2.625-7.35,4.755-10.506
		c3.03-4.49,7.381-7.297,11.943-9.891C83.08,0.46,83.926,0.46,84.772,0.46z"/>
	<path fill-rule="evenodd" clip-rule="evenodd" fill="#CEA39B" d="M187.877,0.46c-0.338,0.526-0.677,0.599-1.016,0
		C187.2,0.46,187.539,0.46,187.877,0.46z"/>
	<path fill-rule="evenodd" clip-rule="evenodd" fill="#FCD3BA" d="M58.827,25.401c2.177,1.947,4.322,3.918,6.987,5.232
		c3.94,1.943,6.473,0.511,6.787-3.908c0.046-0.653-0.084-1.358,0.462-1.892c8.544,0.66,15.985,4.006,22.453,9.5
		c7.954,6.757,12.729,15.344,14.501,25.659c0.226,1.313-0.797,3.149,1.167,3.994c-0.412,5.308-0.32,10.62-0.12,15.931
		c-0.212,1.688-0.089,3.403-0.373,5.086c-0.712,6.4-2.695,12.369-6.31,17.717c-7.501,11.1-17.716,17.74-31.206,19.369
		c-18.512,2.235-35.711-8.71-42.781-23.753c-2.055-4.373-3.648-8.918-3.689-13.85c-0.005-0.687-0.187-1.336-0.353-1.993
		c-0.203-0.861-0.174-1.739-0.209-2.614c0.065-5.279-0.37-10.563,0.209-15.834c1.303-1.821,0.909-4.039,1.375-6.056
		c3.864-16.72,14.082-27.362,30.478-32.19C58.432,25.734,58.621,25.538,58.827,25.401z"/>
	<path fill-rule="evenodd" clip-rule="evenodd" fill="#E48F7B" d="M13.271,193.93c-5.243-13.826-3.736-26.799,4.978-38.825
		c0.684-0.942,0.731-1.749,0.418-2.799c-2.15-7.215,0.322-13.422,4.327-19.257c0.961-1.4,2.328-1.68,3.763-0.768
		c7.67,4.876,15.886,4.925,24.386,2.919c4.92-1.161,9.875-2.18,14.813-3.262c1.071-0.948,2.42-1.062,3.744-1.254
		c4.166-0.838,8.376-0.261,12.562-0.402c7.491,0.376,13.729,3.31,18.394,9.251c1.609,2.049,3.479,3.455,5.915,4.506
		c11.675,5.038,18.223,13.998,20.05,26.596c1.056,7.276-0.024,14.303-1.676,21.321c-0.192,0.817-0.391,1.656-1.096,2.235
		c-0.649,0.329-1.321,0.273-1.954,0.01c-3.331-1.389-6.698-1.352-10.106-0.338c-0.486,0.145-0.993,0.156-1.497,0.057
		c-1.06-0.295-1.651-1.15-2.229-1.972c-3.458-4.911-6.611-10.008-9.087-15.492c-1.395-3.089-2.089-3.467-5.495-2.732
		c-5.696,1.229-11.402,2.368-17.18,3.191c-7.908,1.127-15.661,0.163-23.403-1.271c-2.989-0.553-5.975-1.134-8.938-1.822
		c-3.605-0.837-4.202-0.604-5.789,2.662c-2.403,4.947-5.074,9.739-8.197,14.266c-0.844,1.224-1.545,2.666-3.17,3.136
		c-1.793,0.125-3.446-0.726-5.233-0.726c-1.945-0.001-3.864,0.005-5.711,0.769C15.032,194.271,14.131,194.738,13.271,193.93z"/>
	<path fill-rule="evenodd" clip-rule="evenodd" fill="#F6C3A7" d="M82.78,130.932c-4.432,0.25-8.896-0.327-13.306,0.519
		c-1.108-0.698-2.437,0.479-3.522-0.415c-14.852-1.209-26.043-8.266-33.607-21.083c-3.361-5.695-4.966-11.923-5.449-18.473
		c-0.056-0.758,0.073-1.585-1.038-1.666c0.49-2.342-0.301-4.871,1.038-7.088c0.766,3.838,1.027,7.757,2.489,11.479
		c5.646,14.368,15.923,23.341,30.988,26.613c12.338,2.68,23.643-0.15,33.585-7.705c8.114-6.165,13.34-14.432,15.649-24.443
		c0.258-1.12-0.415-2.391,0.561-3.389c1.011,1.322,0.637,3.013,1.192,4.457c-0.864,2.254-0.49,4.675-0.97,6.997
		c-3.27,15.813-12.376,26.676-27.404,32.574c-0.785,0.308-1.591,0.566-2.44,0.657c-0.746,0.08-1.463,0.302-2.278,0.308
		C79.83,130.57,81.529,128.805,82.78,130.932z"/>
	<path fill-rule="evenodd" clip-rule="evenodd" fill="#EAB9A0" d="M13.271,193.93c1.967,0.001,3.511-1.45,5.5-1.512
		c2.789-0.087,5.493,0.189,8.131,1.098c0.471,0.424,0.664,0.993,0.669,1.585c0.047,4.702,0.406,9.41-0.205,14.101
		c-1.982,2.344-4.77,2.194-7.398,2.171c-5.784-0.051-11.266-4.25-12.38-9.263C8.183,198.48,11.149,196.498,13.271,193.93z"/>
	<path fill-rule="evenodd" clip-rule="evenodd" fill="#EAB9A0" d="M26.352,64.047c0.842,1.209,0.495,2.588,0.505,3.896
		c0.033,4.09,0.001,8.181-0.006,12.271c-2.604,2.455-5.883,1.973-8.829,1.479c-4.997-0.838-8.706-3.708-10.522-8.648
		c1.648-7.017,9.009-11.455,16.178-9.741C24.578,63.517,25.461,63.797,26.352,64.047z"/>
	<path fill-rule="evenodd" clip-rule="evenodd" fill="#E7A890" d="M7.5,73.044c1.427,0.67,1.594,2.293,2.551,3.359
		c4.736,5.272,10.452,5.85,16.801,3.811c0.014,0.837,0.028,1.675,0.043,2.512c-0.008,1.576-0.081,3.155,0,4.727
		c0.052,1.015-0.273,1.758-1.038,2.361c-5.543,2.195-10.559,1.022-14.754-2.917C7.114,83.15,5.886,78.395,7.5,73.044z"/>
	<path fill-rule="evenodd" clip-rule="evenodd" fill="#E7A890" d="M7.589,202.109c2.271,3.975,5.145,7.124,9.866,8.306
		c3.282,0.821,6.287-0.188,9.395-0.686c0.737,0.829,0.761,1.67,0.042,2.523c-0.01,2.216-0.019,4.432-0.028,6.647
		c-5.608,2.124-10.792,1.771-15.489-2.367C7.395,213.026,5.779,207.195,7.589,202.109z"/>
	<path fill-rule="evenodd" clip-rule="evenodd" fill="#F9E4DC" d="M65.952,131.035c1.18,0.093,2.438-0.473,3.523,0.415
		c-1.173,0.163-2.346,0.325-3.519,0.488C65.955,131.637,65.953,131.336,65.952,131.035z"/>
	<path fill-rule="evenodd" clip-rule="evenodd" fill="#C0A09C" d="M198.545,130.923c18.544,2.55,32.85,11.683,42.508,27.751
		c6.711,11.165,8.66,23.447,7.726,36.292c-0.592,0.277-1.176,0.122-1.687-0.153c-3.751-2.02-7.662-2.114-11.687-1.053
		c-0.408,0.107-0.829,0.076-1.228-0.091c-1.042-1.046-1.059-2.441-1.229-3.765c-2.553-19.982-20.102-35.39-40.328-35.392
		c-21.45-0.001-38.74,15.455-41.142,36.781c-0.094,0.829-0.003,1.713-0.716,2.354c-2.126,0.353-4.116-0.67-6.257-0.556
		c-2.232,0.119-4.412,0.25-6.363,1.408c-1.783,1.059-2.647,0.422-3.007-1.416c-0.896-12.205,1.461-23.758,7.687-34.293
		c9.667-16.354,24.028-25.882,42.915-28.466c0.536-0.017,1.073-0.014,1.609-0.031c0.971,0.028,1.863-0.413,2.819-0.475
		c1.565-0.086,3.131-0.099,4.697-0.005C196.171,129.919,197.291,130.642,198.545,130.923z"/>
	<path fill-rule="evenodd" clip-rule="evenodd" fill="#F6C3A7" d="M194.968,130.486c-1.683-0.002-3.366-0.003-5.05-0.005
		c-0.702-0.582-1.411,0.12-2.117-0.009c-0.381,0.008-0.762,0.008-1.145,0.008c-7.702-0.517-14.423-3.61-20.34-8.316
		c-10.127-8.055-15.775-18.539-16.201-31.629c-0.02-0.592-0.108-1.178-0.156-1.769c0.118-1.186-0.005-2.423,0.725-3.482
		c1.457-0.047,1.166,1.185,1.344,1.962c3.618,15.763,13.024,26.528,28.455,31.217c13.844,4.206,26.782,1.639,38.122-7.693
		c7.628-6.279,12.17-14.365,14.054-24.014c0.278-1.425,0.123-2.881,0.398-4.289c0.137-0.698,0.213-1.961,1.467-0.783
		c0.394,2.419,0.873,4.842-0.425,7.158c-0.262,20.384-14.352,37.147-34.495,41.021c-0.657,0.126-1.344,0.105-2.017,0.153
		C196.845,130.899,195.754,129.847,194.968,130.486z"/>
	<path fill-rule="evenodd" clip-rule="evenodd" fill="#EAB9A0" d="M234.071,63.519c4.058-1.643,8.127-1.555,12.207-0.092
		c3.283,2.135,6.18,4.586,7.113,8.651c-1.385,6.013-9.054,10.434-15.798,9.027c-1.432-0.298-3.084-0.315-3.966-1.871
		c-0.659-4.7-0.274-9.416-0.233-14.125C233.4,64.511,233.623,63.954,234.071,63.519z"/>
	<path fill-rule="evenodd" clip-rule="evenodd" fill="#EAB9A0" d="M234.102,193.462c5.13-1.821,10.035-1.444,14.677,1.504
		c1.895,2.148,4.085,4.105,4.61,7.139c-1.376,6.016-9.059,10.437-15.813,9.021c-1.432-0.3-3.089-0.314-3.957-1.888
		c-0.645-4.733-0.286-9.479-0.216-14.221C233.412,194.429,233.629,193.873,234.102,193.462z"/>
	<path fill-rule="evenodd" clip-rule="evenodd" fill="#E7A88F" d="M234.115,209.728c2.784,0.398,5.477,1.492,8.394,0.847
		c4.991-1.104,8.486-4.063,10.88-8.47c1.615,5.007,0.594,9.484-2.868,13.365c-3.786,4.243-8.554,5.423-14.004,4.128
		c-0.817-0.194-1.612-0.481-2.417-0.726c-0.008-2.375-0.016-4.751-0.023-7.127C233.492,211.061,233.523,210.39,234.115,209.728z"/>
	<path fill-rule="evenodd" clip-rule="evenodd" fill="#E7A890" d="M234.113,79.703c2.785,0.397,5.478,1.493,8.396,0.847
		c4.993-1.104,8.487-4.065,10.883-8.472c1.61,5.005,0.595,9.483-2.873,13.357c-3.788,4.233-8.559,5.406-14.004,4.129
		c-0.817-0.192-1.611-0.479-2.416-0.723c-0.007-2.542-0.014-5.085-0.021-7.627C233.671,80.7,233.661,80.196,234.113,79.703z"/>
	<path fill-rule="evenodd" clip-rule="evenodd" fill="#F9DBCA" d="M194.968,130.486c0.752-0.828,1.725-0.428,2.618-0.471
		c0.32,0.302,0.64,0.604,0.959,0.907C197.303,131.183,196.146,130.747,194.968,130.486z"/>
	<path fill-rule="evenodd" clip-rule="evenodd" fill="#FCD3BA" d="M234.113,79.703c-0.012,0.503-0.023,1.007-0.035,1.511
		c-0.953,2.79-0.518,5.771-1.371,8.62c-4.976,16.621-15.782,27.172-32.825,30.377c-15.332,2.883-28.566-1.94-39.021-13.542
		c-5.216-5.789-8.583-12.666-9.598-20.534c-0.039-0.3-0.304-0.571-0.464-0.855c-1.249-1.761-0.57-3.87-1.046-5.773
		c0.465-4.212,0.176-8.441,0.289-12.661c0.033-1.232-0.168-2.607,1.272-3.323c10.851-1.617,20.752-5.874,30.313-11.015
		c7.525-4.047,14.681-8.694,21.561-13.766c2.2-1.622,3.043-1.467,4.825,0.784c5.837,7.368,11.926,14.494,19.534,20.14
		c2.035,1.51,4.132,2.935,6.522,3.851C234.086,68.914,234.1,74.308,234.113,79.703z"/>
	<path fill-rule="evenodd" clip-rule="evenodd" fill="#EAB9A0" d="M151.315,63.524c-0.843,1.213-0.446,2.596-0.521,3.911
		c-0.228,4.08,0.487,8.198-0.488,12.249c-3.132,2.132-6.525,2.06-9.935,0.986c-4.396-1.385-7.744-4.014-9.287-8.55
		c0.901-3.556,3.389-5.94,6.048-8.198C141.804,61.777,146.541,61.96,151.315,63.524z"/>
	<path fill-rule="evenodd" clip-rule="evenodd" fill="#E7A88F" d="M131.085,72.119c1.458,1.489,2.325,3.43,3.957,4.819
		c3.69,3.14,7.748,4.564,12.564,3.293c0.886-0.234,1.799-0.368,2.7-0.548c0.883,1.802,0.303,3.734,0.493,5.597
		c-0.062,1.195,0.203,2.437-0.512,3.538c-0.256,0.849-0.994,1.09-1.715,1.338c-7.378,2.534-16.165-2.338-18.056-10
		c-0.014-0.311-0.048-0.63,0.003-0.912c0.005,0.037-0.038,0.179-0.037,0.208c-0.01,0.388-0.007,0.747-0.018,1.115
		c-1.758,7.478-9.815,12.483-16.96,10.541c-0.88-0.24-1.837-0.377-2.298-1.346c-1.751-1.168-0.776-2.969-1.04-4.481
		c0.24-1.688-0.479-3.469,0.497-5.085c0.796-0.647,1.598-0.176,2.389,0c6.097,1.355,11.115-0.606,14.664-5.688
		c0.511-0.733,0.798-1.992,2.199-1.401c0.049,0.142,0.088,0.286,0.115,0.433c0.346,0.406,0.197,0.862,0.144,1.231
		c0.211-0.697,0.521-1.442,0.78-2.205C130.979,72.411,131.021,72.262,131.085,72.119z"/>
	<path fill-rule="evenodd" clip-rule="evenodd" fill="#EAB9A0" d="M129.917,73.107c-0.979,0.036-1.097,0.91-1.478,1.524
		c-3.482,5.613-10.048,8.021-16.333,5.99c-0.476-0.154-0.96-0.284-1.441-0.426c-1.068-4.06-0.265-8.194-0.46-12.289
		c-0.064-1.354-0.514-2.91,0.979-3.92C119.375,60.96,127.46,64.896,129.917,73.107z"/>
	<path fill-rule="evenodd" clip-rule="evenodd" fill="#F5D9CE" d="M130.956,72.566c-0.06,0.472-0.066,0.958-0.198,1.409
		c-0.075,0.261-0.352,0.465-0.537,0.694c-0.063-0.376-0.126-0.752-0.188-1.128C130.34,73.216,130.648,72.891,130.956,72.566z"/>
	<path fill-rule="evenodd" clip-rule="evenodd" fill="#E7A890" d="M150.798,214.797c-0.097,1.359,0.278,2.778-0.506,4.053
		c-8.121,3.268-15.902-0.082-19.081-8.213c-0.243-0.622-0.5-1.239-0.751-1.857c-0.193-0.195-0.342-0.42-0.446-0.675
		c-0.292-1.061-0.159-2.146-0.19-3.225c-0.007-0.273,0.017-0.544,0.057-0.814c0.156-0.816,0.385-1.595,1.138-2.087
		c1.032-0.036,1.409,0.78,1.9,1.455c3.775,5.176,8.567,7.803,15.122,6.053c0.897-0.239,1.832-0.439,2.661,0.26
		C151.783,211.411,151.892,213.093,150.798,214.797z"/>
	<path fill-rule="evenodd" clip-rule="evenodd" fill="#E7A890" d="M130.491,208.245c-0.01,0.177-0.021,0.355-0.031,0.533
		c-1.33,3.058-2.473,6.22-5.282,8.357c-4.663,3.551-9.697,3.758-15.001,1.77c-0.007-1.709-0.015-3.419-0.021-5.128
		c-0.976-1.174-0.762-2.462-0.366-3.767c0.746-1.104,1.801-0.727,2.757-0.494c6.81,1.653,11.926-0.708,15.616-6.513
		c0.273-0.429,0.539-0.866,1.065-1.036c1.389,0.161,0.73,1.51,1.259,2.172c0,0.151,0.002,0.302,0.005,0.453
		C130.063,205.811,130.064,207.027,130.491,208.245z"/>
	<path fill-rule="evenodd" clip-rule="evenodd" fill="#FCD3BA" d="M150.798,214.797c-0.162-1.697,0.357-3.46-0.488-5.092
		c-0.79-1.161-0.297-2.44-0.304-3.662c-0.016-3.174-0.022-6.347,0.006-9.521c0.01-1.087-0.004-2.186,0.739-3.1
		c0.635-19.005,14.62-35.369,33.798-38.928c20.619-3.826,39.723,7.392,47.142,27.133c1.429,3.8,2,7.81,2.411,11.834
		c0.004,5.422,0.009,10.844,0.013,16.266c-0.012,0.673-0.024,1.345-0.038,2.018c-1.011,2.604-0.522,5.415-1.343,8.116
		c-5.07,16.687-15.871,27.267-33.073,30.423c-22.792,4.181-43.077-10.403-48.198-32.111
		C151.197,217.049,151.808,215.759,150.798,214.797z"/>
	<path fill-rule="evenodd" clip-rule="evenodd" fill="#FCD3BA" d="M110.209,209.739c-0.018,1.347-0.036,2.692-0.054,4.038
		c-0.89,2.186-0.835,4.561-1.411,6.83c-3.783,14.927-17.789,27.505-33.147,29.79c-14.467,2.153-26.984-1.79-37.128-12.206
		c-6.554-6.729-10.695-14.886-11.09-24.562c-0.021-0.517-0.042-1.018-0.487-1.377c-0.014-0.841-0.027-1.683-0.042-2.523
		c0.018-5.405,0.035-10.811,0.052-16.215c4.528-5.307,7.741-11.417,10.775-17.637c1.762-3.612,2.047-3.652,6.089-2.813
		c8.891,1.844,17.751,4.021,26.938,3.634c7.765-0.328,15.32-2.049,22.877-3.691c3.782-0.822,4.407-0.452,5.978,3.013
		c2.829,6.237,6.302,12.106,10.593,17.468c0.15,0.304,0.083-0.125,0.148,0.199C111.375,199.042,111.506,204.396,110.209,209.739z"/>
	<path fill-rule="evenodd" clip-rule="evenodd" fill="#F85750" d="M68.568,110.571c-5.617-0.369-10.656-1.9-13.818-7.049
		c-1.524-2.482-1.18-4.675,0.833-6.024c1.935-1.296,4.153-0.611,5.749,1.777c3.028,4.529,11.4,4.452,14.444-0.133
		c1.473-2.219,3.698-2.896,5.588-1.702c1.977,1.248,2.385,3.402,1.097,5.778C80.075,107.621,74.572,110.535,68.568,110.571z"/>
	<path fill-rule="evenodd" clip-rule="evenodd" fill="#565D76" d="M83.196,76.719c-0.001-1.177-0.088-2.362,0.018-3.53
		c0.189-2.095,1.879-3.685,3.854-3.567c2.086,0.124,3.597,1.247,3.763,3.374c0.202,2.591,0.17,5.216,0.017,7.813
		c-0.123,2.076-1.975,3.598-3.965,3.417c-2.074-0.188-3.462-1.306-3.663-3.473C83.098,79.419,83.198,78.065,83.196,76.719z"/>
	<path fill-rule="evenodd" clip-rule="evenodd" fill="#565D76" d="M53.833,76.989c0,1.261,0.103,2.533-0.023,3.782
		c-0.219,2.162-1.607,3.278-3.682,3.458c-1.994,0.172-3.828-1.354-3.946-3.436c-0.147-2.598-0.182-5.223,0.021-7.814
		c0.167-2.133,1.692-3.327,3.773-3.333c2.08-0.006,3.518,1.182,3.805,3.312c0.178,1.321,0.033,2.686,0.033,4.031
		C53.82,76.989,53.826,76.989,53.833,76.989z"/>
	<path fill-rule="evenodd" clip-rule="evenodd" fill="#EAB9A0" d="M123.796,193.94c1.332,1.896,3.454,3.09,4.571,5.19
		c0.504,0.947,1.189,1.804,1.111,2.961c-3.439,6.931-10.611,10.561-18.269,7.725c-0.302-0.111-0.667-0.056-1-0.077
		c-0.019-5.417-0.037-10.834-0.057-16.252C114.759,191.867,119.301,192.193,123.796,193.94z"/>
	<path fill-rule="evenodd" clip-rule="evenodd" fill="#EAB9A0" d="M131.09,202.152c0.766-2.243,1.857-4.329,3.599-5.937
		c1.041-0.96,0.814-2.105,0.989-3.221c0.401,1.072,0.54,1.931,2.192,0.942c4.111-2.46,8.525-1.785,12.882-0.515
		c-0.165,5.427,0.574,10.879-0.443,16.282c-3.189,0.55-6.291,1.684-9.641,0.51c-3.747-1.313-6.596-3.567-8.606-6.955
		C131.814,202.844,131.417,202.519,131.09,202.152z"/>
	<path fill-rule="evenodd" clip-rule="evenodd" fill="#F9D9C7" d="M187.854,129.999c0.717,0.037,1.509-0.245,2.063,0.483
		c-0.854,0.061-1.621,0.653-2.524,0.409C187.113,130.369,187.618,130.253,187.854,129.999z"/>
	<path fill-rule="evenodd" clip-rule="evenodd" fill="#EEE3DF" d="M187.854,129.999c-0.154,0.297-0.308,0.595-0.462,0.893
		c-0.519,0.012-1.037,0.024-1.556,0.037c0.325-0.299,0.648-0.598,0.973-0.896C187.157,130.021,187.506,130.01,187.854,129.999z"/>
	<path fill-rule="evenodd" clip-rule="evenodd" fill="#F85750" d="M192.481,110.567c-5.626-0.372-10.575-1.918-13.736-6.922
		c-1.618-2.561-1.257-4.888,0.859-6.212c1.953-1.223,4.061-0.507,5.71,1.94c2.95,4.378,11.369,4.314,14.32-0.109
		c1.54-2.31,3.599-3.015,5.538-1.897c2.084,1.202,2.573,3.508,1.15,5.942C203.209,108.64,198.09,110.184,192.481,110.567z"/>
	<path fill-rule="evenodd" clip-rule="evenodd" fill="#565D76" d="M170.066,76.906c0-1.262-0.098-2.533,0.022-3.783
		c0.199-2.079,1.947-3.653,3.917-3.498c2.082,0.163,3.561,1.297,3.704,3.439c0.174,2.595,0.181,5.222-0.007,7.816
		c-0.155,2.153-1.685,3.311-3.762,3.331c-2.085,0.021-3.536-1.135-3.826-3.272c-0.18-1.321-0.033-2.687-0.033-4.033
		C170.077,76.906,170.072,76.906,170.066,76.906z"/>
	<path fill-rule="evenodd" clip-rule="evenodd" fill="#565D76" d="M207.139,76.796c0.003-1.261-0.123-2.538,0.03-3.78
		c0.265-2.142,1.677-3.338,3.755-3.369c2.088-0.031,3.644,1.159,3.822,3.274c0.224,2.671,0.235,5.393-0.007,8.061
		c-0.19,2.098-1.739,3.292-3.85,3.23c-2.076-0.061-3.497-1.221-3.728-3.382C207.02,79.5,207.136,78.142,207.139,76.796z"/>
	<path fill-rule="evenodd" clip-rule="evenodd" fill="#F3D4C8" d="M130.965,79.723c-0.316,0.167-0.634,0.335-0.949,0.503
		c-0.005-0.504-0.01-1.008-0.014-1.512c0.254-0.297,0.37-0.863,0.965-0.494C130.966,78.72,130.966,79.221,130.965,79.723z"/>
	<path fill-rule="evenodd" clip-rule="evenodd" fill="#EAB39D" d="M130.967,78.219c-0.321,0.164-0.644,0.329-0.965,0.494
		c0.025-0.458-0.193-1.085,0.367-1.269C130.956,77.253,130.894,77.854,130.967,78.219z"/>
	<path fill-rule="evenodd" clip-rule="evenodd" fill="#EEC4B3" d="M130.491,208.245c-0.809-1.217-0.804-2.434,0-3.651
		C130.491,205.811,130.491,207.027,130.491,208.245z"/>
	<path fill-rule="evenodd" clip-rule="evenodd" fill="#C0A09C" d="M192.279,228.443c-3.477,6.288-9.049,8.065-15.246,8.652
		c-2.745,0.261-4.028-0.67-4.44-3.198c-1.617-9.939,3.431-17.805,12.179-20.156c6.472-1.739,12.83-1.577,18.927,1.572
		c5.561,2.873,8.05,7.657,8.547,13.675c0.097,1.175,0.029,2.365,0.016,3.549c-0.042,3.778-1.431,4.973-5.188,4.557
		C201.021,236.425,195.823,234.249,192.279,228.443z"/>
	<path fill-rule="evenodd" clip-rule="evenodd" fill="#EAB9A0" d="M192.198,175.696c-2.7,0-5.402,0.035-8.103-0.01
		c-2.54-0.044-3.689-1.099-3.84-3.387c-0.141-2.16,1.256-4.109,3.455-4.161c5.82-0.137,11.648-0.137,17.469-0.001
		c2.199,0.051,3.601,1.997,3.461,4.155c-0.147,2.291-1.296,3.352-3.832,3.393C197.939,175.731,195.068,175.696,192.198,175.696z"/>
	<path fill-rule="evenodd" clip-rule="evenodd" fill="#EAB9A0" d="M192.3,189.909c-1.86-0.002-3.723,0.067-5.579-0.019
		c-2.406-0.112-3.965-1.799-3.919-4.084c0.04-2.021,1.723-3.501,4.09-3.518c3.72-0.026,7.439-0.028,11.158,0.001
		c2.371,0.019,4.027,1.513,4.046,3.562c0.021,2.286-1.543,3.886-3.964,4.057c-0.084,0.006-0.169,0.003-0.254,0.003
		C196.019,189.911,194.159,189.911,192.3,189.909z"/>
	<path fill-rule="evenodd" clip-rule="evenodd" fill="#565D76" d="M177.76,200.438c0.001,1.262,0.114,2.536-0.024,3.782
		c-0.24,2.168-1.68,3.322-3.741,3.38c-2.099,0.058-3.654-1.14-3.839-3.247c-0.234-2.672-0.232-5.394-0.002-8.064
		c0.183-2.109,1.729-3.307,3.832-3.254c2.068,0.051,3.51,1.203,3.747,3.368C177.878,197.734,177.76,199.093,177.76,200.438z"/>
	<path fill-rule="evenodd" clip-rule="evenodd" fill="#565D76" d="M207.126,200.142c0-1.178-0.075-2.36,0.016-3.531
		c0.164-2.086,1.821-3.676,3.813-3.601c2.104,0.081,3.629,1.204,3.8,3.318c0.216,2.672,0.231,5.393-0.016,8.061
		c-0.195,2.102-1.768,3.28-3.868,3.213c-2.086-0.066-3.465-1.288-3.703-3.427c-0.146-1.329-0.027-2.688-0.027-4.033
		C207.135,200.142,207.131,200.142,207.126,200.142z"/>
	<path fill-rule="evenodd" clip-rule="evenodd" fill="#E48F7B" d="M88.377,230.893c0.002,6.279-0.555,6.622-7,5.838
		c-4.91-0.599-8.83-2.715-11.762-6.627c-0.786-1.049-1.173-1.176-1.988-0.06c-3.389,4.644-8.264,6.455-13.754,7.046
		c-3.789,0.407-5.155-0.757-5.166-4.569c-0.006-1.939-0.107-3.921,0.232-5.812c1.614-8.984,8.513-12.989,17.028-13.9
		c4.687-0.501,9.294,0.151,13.574,2.254C84.769,217.631,88.849,223.139,88.377,230.893z"/>
	<path fill-rule="evenodd" clip-rule="evenodd" fill="#565D76" d="M83.131,200.211c0-1.177-0.079-2.36,0.017-3.529
		c0.172-2.103,1.835-3.648,3.787-3.643c2.009,0.006,3.766,1.482,3.884,3.58c0.141,2.515,0.147,5.051-0.01,7.563
		c-0.131,2.097-1.928,3.542-3.932,3.492c-2.013-0.051-3.579-1.539-3.737-3.681c-0.093-1.254-0.017-2.521-0.017-3.782
		C83.125,200.211,83.128,200.211,83.131,200.211z"/>
	<path fill-rule="evenodd" clip-rule="evenodd" fill="#565D76" d="M53.81,200.325c0,1.27,0.097,2.548-0.021,3.806
		c-0.199,2.121-1.896,3.589-3.922,3.543c-2.023-0.045-3.651-1.557-3.745-3.704c-0.102-2.364-0.103-4.74-0.004-7.104
		c0.091-2.191,1.675-3.745,3.659-3.821c2.107-0.081,3.849,1.484,4.025,3.729c0.093,1.177,0.017,2.367,0.017,3.552
		C53.815,200.325,53.813,200.325,53.81,200.325z"/>
</g>
</svg>
