<?xml version="1.0" encoding="utf-8"?>
<!-- Generator: Adobe Illustrator 16.0.3, SVG Export Plug-In . SVG Version: 6.00 Build 0)  -->
<!DOCTYPE svg PUBLIC "-//W3C//DTD SVG 1.1//EN" "http://www.w3.org/Graphics/SVG/1.1/DTD/svg11.dtd">
<svg version="1.1" id="Ebene_1" xmlns="http://www.w3.org/2000/svg" xmlns:xlink="http://www.w3.org/1999/xlink" x="0px" y="0px"
	 width="260px" height="260px" viewBox="0 0 260 260" enable-background="new 0 0 260 260" xml:space="preserve">
<path fill="#1A568F" d="M0,0h260v260H0V0z"/>
<g>
	<path fill-rule="evenodd" clip-rule="evenodd" fill="#FFFFFF" d="M160.25,131.713c4.266,0.871,8.227,1.68,12.351,2.522
		c-1.22,4.116-2.384,7.75-3.371,11.431c-3.684,13.721-5.377,27.708-5.418,41.902c-0.021,7.165-0.004,14.33-0.004,21.495
		c0,0.711,0,1.423,0,2.286c-22.23,0-44.327,0-66.649,0c0-0.829,0.006-1.592,0-2.355c-0.084-9.898,0.022-19.805-0.3-29.695
		c-0.469-14.394-3.161-28.426-7.652-42.11c-0.26-0.793-0.495-1.594-0.896-2.892c4.167-0.853,8.175-1.673,11.792-2.412
		c0.372,7.897-0.013,15.407,1.223,22.641c2.42,14.161,16.025,24.235,30.509,23.522c14.729-0.725,27.035-11.923,28.321-26.36
		C160.723,145.303,160.25,138.825,160.25,131.713z"/>
	<path fill-rule="evenodd" clip-rule="evenodd" fill="#FFFFFF" d="M114.501,75.828c10.667,2.797,21.347,3.023,32.093,0.059
		c1.93,7.754,6.632,13.281,12.877,17.684c0.393,0.276,0.771,0.927,0.747,1.382c-0.196,3.832-0.395,7.667-0.797,11.48
		c-0.16,1.521-0.558,3.147-1.317,4.452c-4.731,8.142-11.478,13.453-21.212,13.811c-5.385,0.198-10.849,0.298-16.173-0.378
		c-10.814-1.373-19.376-11.523-19.56-22.406c-0.036-2.144-0.162-4.3-0.469-6.418c-0.17-1.17,0.175-1.75,1.093-2.366
		c4.625-3.101,8.356-7.038,10.756-12.108C113.284,79.451,113.78,77.763,114.501,75.828z"/>
	<path fill-rule="evenodd" clip-rule="evenodd" fill="#FFFFFF" d="M170.134,211.501c0.384-13.451,0.406-26.669,1.246-39.834
		c0.733-11.517,3.456-22.735,7.416-33.897c3.055,1.804,5.581,3.979,7.854,6.495c7.544,8.348,10.74,18.213,10.608,29.368
		c-0.13,11.009-0.025,22.021-0.03,33.031c-0.001,3.825-1.028,4.835-4.897,4.836C185.169,211.504,178.006,211.501,170.134,211.501z"
		/>
	<path fill-rule="evenodd" clip-rule="evenodd" fill="#FFFFFF" d="M90.342,211.485c-7.872,0-15.555,0.047-23.237-0.029
		c-2.137-0.021-3.307-1.45-3.352-3.779c-0.058-2.931-0.037-5.863-0.014-8.794c0.084-10.55-0.333-21.136,0.411-31.64
		c0.89-12.551,7.301-22.253,17.883-29.488C91.153,161.705,90.884,186.45,90.342,211.485z"/>
	<path fill-rule="evenodd" clip-rule="evenodd" fill="#FFFFFF" d="M130.477,131.286c6.381-0.001,12.763-0.012,19.145,0.004
		c3.104,0.008,4.26,1.136,4.232,4.252c-0.045,5.204,0.179,10.441-0.327,15.606c-1.122,11.459-11.331,20.256-23.036,20.262
		c-11.68,0.004-21.934-8.803-23.048-20.251c-0.528-5.422-0.309-10.922-0.305-16.387c0.001-2.296,1.374-3.465,3.804-3.476
		C117.454,131.269,123.965,131.287,130.477,131.286z"/>
	<path fill-rule="evenodd" clip-rule="evenodd" fill="#FFFFFF" d="M98.896,86.163c-0.642-5.333-2.374-10.308-1.449-15.486
		c1.708-9.56,9.164-17.164,19.588-18.706c9.261-1.369,18.791-1.67,27.999,0.249c9.837,2.05,16.669,8.251,18.315,18.452
		c0.701,4.342-0.582,9.006-0.985,13.521c-0.051,0.575-0.238,1.138-0.469,2.195c-1.205-1.245-2.296-2.208-3.19-3.326
		c-2.662-3.325-4.592-6.925-4.194-11.418c0.163-1.844-1.225-3.331-3.209-3.501c-1.006-0.086-2.099,0.053-3.063,0.367
		c-11.517,3.743-23.042,3.648-34.6,0.217c-0.992-0.295-2.021-0.572-3.045-0.628c-2.732-0.152-4.245,1.438-4.103,4.163
		C106.726,76.777,103.673,82.519,98.896,86.163z"/>
</g>
</svg>
