<?xml version="1.0" encoding="utf-8"?>
<!-- Generator: Adobe Illustrator 16.0.3, SVG Export Plug-In . SVG Version: 6.00 Build 0)  -->
<!DOCTYPE svg PUBLIC "-//W3C//DTD SVG 1.1//EN" "http://www.w3.org/Graphics/SVG/1.1/DTD/svg11.dtd">
<svg version="1.1" id="Ebene_1" xmlns="http://www.w3.org/2000/svg" xmlns:xlink="http://www.w3.org/1999/xlink" x="0px" y="0px"
	 width="260px" height="260px" viewBox="0 0 260 260" enable-background="new 0 0 260 260" xml:space="preserve">
<g>
	<path fill-rule="evenodd" clip-rule="evenodd" fill="#B0B2B4" d="M5.098,174.162c-2.019-6.149-3.234-12.498-4.65-18.796
		c0-0.677,0-1.354,0-2.031c0.427-1.354,0.427-2.709,0-4.063c0-1.354,0-2.709,0-4.063c1.339-2.249,1.003-4.614,0.579-7.024
		c-0.271-1.537-0.146-3.134-0.579-4.658c0-0.339,0-0.677,0-1.016c0.55-0.956,0.129-1.997,0.262-2.989
		c-0.121-0.862,0.27-1.777-0.262-2.598c0-0.847,0-1.693,0-2.54c1.333-0.878,2.222-2.461,4.051-2.552
		c0.217-0.178,0.462-0.305,0.733-0.382c0.428-0.06,0.839,0.005,1.239,0.158c2.302,0.948,3.147,2.818,3.296,5.156
		c0.19,2.998,0.569,5.977,0.978,8.951c0.612,7.022,3.092,13.472,6.213,19.693c4.291,8.554,11.407,16.946,17.562,21.015
		c-0.178-3.379-0.816-6.901,1.271-10.136c3.956-2.905,7.484-1.68,8.507,2.948c0.045,3.721,0.103,7.443,0.015,11.163
		c-0.043,1.852,0.652,2.891,2.347,3.72c5.215,2.554,10.691,4.182,16.369,5.268c1.366,0.261,3.293,0.06,3.177,2.403
		c-0.1,2.351,0.361,4.731-0.398,7.041c-0.823,1.078-1.95,0.771-3.03,0.646c-5.339-0.615-10.407-2.238-15.415-4.106
		c-2.924-1.091-3.009-0.998-3.041,2.008c-0.003,0.254-0.003,0.508,0,0.763c0.09,7.518-0.963,6.314,6.171,9.356
		c3.901,1.663,7.963,2.861,12.173,3.507c1.165,0.178,2.383,0.28,3.137,1.403c0.623,1.57,0.374,3.208,0.384,4.824
		c-0.002,0.422,0.037,0.844,0.006,1.265c-0.191,2.613-0.755,3.142-3.326,2.765c-5.194-0.764-10.239-2.121-15.134-4.028
		c-3.172-1.235-3.357-1.11-3.373,2.372c-0.013,3.038,0.018,6.076-0.015,9.114c-0.011,1,0.083,2.049-0.718,2.859
		c-1.189,1.876-2.652,3.331-5.11,2.717c-2.336-0.585-3.384-2.338-3.484-5.5c-0.024-0.76-0.049-1.52-0.073-2.278
		c-0.649-0.973-0.631-2.075-0.63-3.179c0.001-3.297-0.072-6.596,0.027-9.889c0.06-1.978-0.671-3.265-2.29-4.434
		c-10.656-7.693-19.286-17.146-24.947-29.141C6.249,178.025,5.627,176.117,5.098,174.162z"/>
	<path fill-rule="evenodd" clip-rule="evenodd" fill="#B0B2B4" d="M260.508,155.366c-1.095,1.941-0.896,4.162-1.304,6.247
		c-0.835,4.264-2.288,8.353-3.347,12.55c-2.517,8.82-7.506,16.212-13.573,22.894c-4.204,4.629-8.713,8.984-14.002,12.42
		c-1.282,0.832-1.674,2.009-1.664,3.464c0.023,3.466,0.008,6.931,0.007,10.396c-0.001,1.104,0.019,2.206-0.631,3.179
		c-0.024,0.84-0.02,1.682-0.079,2.519c-0.162,2.276-0.658,4.359-3.199,5.169c-2.583,0.824-4.084-0.7-5.451-2.516
		c-0.915-1.087-0.637-2.404-0.655-3.643c-0.044-3.124,0.032-6.249-0.032-9.372c-0.048-2.301-0.424-2.577-2.579-1.725
		c-4.81,1.904-9.76,3.285-14.849,4.156c-3.944,0.675-4.336,0.292-4.381-3.817c0.01-1.616-0.23-3.251,0.356-4.822
		c0.714-1.154,1.93-1.271,3.096-1.448c5.489-0.838,10.619-2.787,15.697-4.942c1.985-0.843,2.896-2.127,2.74-4.302
		c-0.122-1.685-0.073-3.386-0.013-5.077c0.063-1.749-0.526-2.327-2.258-1.631c-3.458,1.392-7.015,2.488-10.625,3.423
		c-1.977,0.512-3.988,0.763-5.997,1.048c-0.926,0.132-1.873,0.221-2.575-0.633c-0.839-2.31-0.327-4.704-0.45-7.057
		c-0.192-1.6,0.881-2.03,2.128-2.265c2.495-0.468,4.971-0.991,7.419-1.684c3.35-0.948,6.563-2.187,9.729-3.641
		c1.881-0.864,2.709-1.968,2.638-4.058c-0.124-3.634-0.049-7.275,0.002-10.913c0.966-4.646,4.546-5.921,8.483-3.029
		c2.115,3.122,1.358,6.651,1.434,10.243c8.386-6.571,14.667-14.643,18.941-24.282c2.335-5.263,4.199-10.668,4.695-16.462
		c0.421-2.981,0.776-5.968,0.975-8.97c0.154-2.34,0.981-4.221,3.29-5.181c0.4-0.165,0.814-0.23,1.245-0.164
		c0.271,0.08,0.518,0.211,0.738,0.39c1.969,0.202,2.99,1.657,4.051,3.06c0,0.677,0,1.354,0,2.032
		c-0.531,0.819-0.141,1.732-0.262,2.594c0.132,0.994-0.288,2.037,0.262,2.994c0,0.339,0,0.677,0,1.016
		c-0.514,2.605-0.596,5.268-1.018,7.886c-0.227,1.406,0.602,2.551,1.018,3.797c0,1.354,0,2.709,0,4.063
		c-0.427,1.354-0.427,2.709,0,4.063C260.508,154.012,260.508,154.689,260.508,155.366z"/>
	<path fill-rule="evenodd" clip-rule="evenodd" fill="#C0C1C3" d="M260.508,153.335c-0.801-1.354-0.774-2.709,0-4.063
		C260.508,150.626,260.508,151.98,260.508,153.335z"/>
	<path fill-rule="evenodd" clip-rule="evenodd" fill="#C0C1C3" d="M0.448,149.271c0.775,1.354,0.801,2.709,0,4.063
		C0.448,151.98,0.448,150.626,0.448,149.271z"/>
	<path fill-rule="evenodd" clip-rule="evenodd" fill="#DCDCDD" d="M260.508,132.51c-0.977-0.878-0.317-2.018-0.485-3.025
		c0.15-0.254,0.313-0.25,0.485-0.023C260.508,130.478,260.508,131.494,260.508,132.51z"/>
	<path fill-rule="evenodd" clip-rule="evenodd" fill="#DCDCDD" d="M0.933,129.485c-0.167,1.007,0.491,2.147-0.485,3.025
		c0-1.016,0-2.032,0-3.048C0.621,129.224,0.782,129.242,0.933,129.485z"/>
	<path fill-rule="evenodd" clip-rule="evenodd" fill="#C3C5C7" d="M0.933,129.485c-0.162-0.011-0.323-0.019-0.485-0.023
		c0-0.847,0-1.693,0-2.54C1.284,127.649,0.856,128.615,0.933,129.485z"/>
	<path fill-rule="evenodd" clip-rule="evenodd" fill="#C3C5C7" d="M260.508,129.462c-0.162,0.004-0.324,0.012-0.485,0.022
		c0.078-0.87-0.351-1.836,0.485-2.562C260.508,127.769,260.508,128.615,260.508,129.462z"/>
	<path fill-rule="evenodd" clip-rule="evenodd" fill="#D0D3D5" d="M224.935,166.566c-4.134-2.172-6.778-1.3-7.611,2.51
		c0.046,2.483-1.487,3.528-3.576,4.442c-8.343,3.654-17.146,5.265-26.131,5.405c-16.714,0.264-33.435,0.088-50.152,0.069
		c-0.592-0.001-1.183-0.022-1.762-0.13c-0.917-0.155-1.386-0.787-1.83-1.562c-2.059-3.581-4.749-3.62-6.748-0.103
		c-0.434,0.765-0.844,1.458-1.785,1.635c-1.091,0.213-2.193,0.168-3.291,0.168c-15.804,0.005-31.609,0.13-47.412-0.045
		c-9.436-0.104-18.662-1.627-27.422-5.437c-2.093-0.91-3.63-1.956-3.582-4.444c-0.833-3.81-3.479-4.682-7.612-2.51
		c-0.841,0.377-1.474-0.117-2.074-0.556c-10.683-7.804-19.198-17.336-23.839-29.949c-0.438-3.219-1.021-6.422-1.021-9.685
		c0-2.207-1.379-3.464-3.055-4.529c-0.836-1.409-0.783-2.946-0.703-4.352c-0.587,1.311,0.799,2.929-0.311,4.346
		c-0.173-0.004-0.346-0.007-0.52-0.01c0.111-6.834-0.25-13.689,0.552-20.496c1.429-12.113,5.574-23.233,12.764-33.119
		C23.229,60.775,29.8,54.513,37.74,49.782c1.422-0.847,1.852-1.877,1.842-3.498c-0.068-11.502,0.011-23.006-0.08-34.509
		c-0.016-2.055,0.475-2.927,2.656-2.725c2.014,0.188,4.056,0.072,6.085,0.089c0.871,0.987,0.725,2.207,0.737,3.373
		c0.036,3.458,0.062,6.917-0.005,10.374c-0.038,1.94,0.728,2.725,2.677,2.686c3.457-0.069,6.916-0.042,10.374-0.005
		c1.164,0.013,2.387-0.139,3.365,0.751c-0.643,0.836-1.561,0.489-2.36,0.495c-4.317,0.033-8.634,0.056-12.951-0.006
		c-1.426-0.021-1.936,0.485-1.917,1.913c0.061,4.57,0.037,9.142,0.014,13.713c-0.007,1.295,0.269,1.959,1.765,1.352
		c9.665-3.927,19.797-4.691,30.071-4.207c2.343,0.111,2.798-0.728,2.774-2.882c-0.109-9.733,0.011-19.469-0.094-29.203
		c-0.022-2.056,0.626-2.689,2.601-2.537c2.02,0.156,4.06,0.057,6.091,0.069c0.399,0.458,0.667,0.995,0.673,1.596
		c0.059,5.195,0.373,10.394-0.137,15.584c-0.701,0.573-0.534,1.375-0.536,2.118c-0.011,4.226,0.057,8.453-0.034,12.677
		c-0.04,1.818,0.519,2.576,2.446,2.563c9.973-0.065,19.946-0.072,29.918,0.007c1.844,0.015,2.264-0.661,2.253-2.365
		c-0.063-9.888,0.017-19.777-0.072-29.665c-0.018-1.97,0.519-2.526,2.544-2.618c7.079-0.322,14.155-0.52,21.238-0.407
		c0.846,0.014,1.895-0.492,2.511,0.603c-0.999,0.844-2.217,0.672-3.375,0.685c-3.446,0.039-6.894,0.067-10.337-0.006
		c-1.963-0.041-2.687,0.775-2.649,2.692c0.066,3.444,0.045,6.892,0.002,10.337c-0.014,1.155,0.162,2.382-0.767,3.338
		c-0.016,5.067,0.021,10.136-0.075,15.202c-0.031,1.638,0.479,2.207,2.156,2.197c9.967-0.063,19.934-0.076,29.899,0.005
		c2.065,0.017,2.576-0.795,2.563-2.706c-0.067-9.713,0.046-19.427-0.086-29.139c-0.032-2.307,0.731-2.678,2.869-2.813
		c6.822-0.432,13.644-0.418,20.468-0.399c0.87,0.002,1.878-0.411,2.596,0.498c-0.968,0.891-2.182,0.786-3.352,0.797
		c-3.117,0.028-6.235,0.002-9.353,0.012c-3.666,0.012-3.711,0.056-3.726,3.613c-0.013,3.202,0.022,6.404-0.018,9.606
		c-0.015,1.078,0.109,2.216-0.748,3.103c-0.015,5.067,0.048,10.136-0.082,15.2c-0.048,1.885,0.723,2.215,2.385,2.225
		c6.304,0.039,12.631-0.435,18.88,0.979c3.69,0.834,7.416,1.5,10.899,3.042c1.815,0.804,2.491,0.442,2.472-1.711
		c-0.093-10.049,0.018-20.1-0.088-30.149c-0.022-2.118,0.589-2.864,2.699-2.672c2.013,0.183,4.049,0.091,6.074,0.12
		c0.791,0.921,0.675,2.053,0.686,3.135c0.035,3.373-0.009,6.747,0.021,10.12c0.025,2.942,0.185,3.094,3.204,3.119
		c3.289,0.027,6.578-0.013,9.867,0.017c1.171,0.011,2.386-0.092,3.354,0.799c-1.743,0.986-3.63,0.368-5.441,0.432
		c-3.296,0.116-6.6,0.083-9.898,0.011c-1.444-0.031-1.911,0.521-1.899,1.931c0.051,6.092,0.093,12.185-0.023,18.275
		c-0.033,1.785,1.161,2.323,2.263,3.004c8.607,5.328,15.682,12.24,21.198,20.699c6.765,10.373,10.543,21.691,11.231,34.158
		c0.313,5.663,0.111,11.311,0.398,16.958c-0.173,0.003-0.346,0.006-0.52,0.01c-1.014-1.471,0.079-2.995-0.27-4.748
		c0.007,1.789,0.103,3.365-0.744,4.753c-2.395,1.315-3.111,3.356-3.132,6.038c-0.021,2.728-0.605,5.451-0.943,8.176
		c-2.469,7.007-6.479,13.044-11.323,18.64c-3.558,4.108-7.581,7.633-11.911,10.854C226.835,166.136,226.113,166.991,224.935,166.566
		z"/>
	<path fill-rule="evenodd" clip-rule="evenodd" fill="#E2584B" d="M178.258,22.14c-0.019-5.127,0.005-10.255-0.083-15.381
		c-0.025-1.458,0.505-1.872,1.9-1.848c5.125,0.085,10.252,0.074,15.379,0.099c0.013,5.076-0.036,10.154,0.074,15.229
		c0.036,1.618-0.526,1.994-2.04,1.966C188.413,22.112,183.335,22.151,178.258,22.14z"/>
	<path fill-rule="evenodd" clip-rule="evenodd" fill="#E2584B" d="M65.391,26.317c-5.126,0.008-10.253-0.026-15.378,0.052
		c-1.42,0.022-1.895-0.417-1.868-1.854c0.094-5.124,0.075-10.25,0.099-15.375c5.134-0.013,10.27,0.02,15.403-0.07
		c1.438-0.025,1.873,0.415,1.846,1.848C65.394,16.049,65.415,21.183,65.391,26.317z"/>
	<path fill-rule="evenodd" clip-rule="evenodd" fill="#E2584B" d="M238.629,26.363c-5.065-0.007-10.132-0.067-15.196,0.01
		c-1.547,0.024-2.042-0.445-2.012-2.005c0.101-5.063,0.062-10.13,0.076-15.195c5.148-0.024,10.298-0.029,15.445-0.089
		c1.167-0.013,1.899,0.118,1.866,1.596C238.691,15.906,238.68,21.136,238.629,26.363z"/>
	<path fill-rule="evenodd" clip-rule="evenodd" fill="#E2584B" d="M91.921,22.205c-0.751-0.861-0.482-1.907-0.489-2.886
		c-0.034-4.765-0.034-9.53-0.046-14.294c5.314-0.427,10.637-0.067,15.954-0.196c1.144-0.028,1.429,0.53,1.423,1.551
		c-0.025,4.733-0.052,9.467,0.015,14.199c0.021,1.478-0.731,1.615-1.897,1.609C101.894,22.165,96.908,22.194,91.921,22.205z"/>
	<path fill-rule="evenodd" clip-rule="evenodd" fill="#E2584B" d="M135.063,22.164c-0.041-5.211-0.063-10.423-0.137-15.633
		c-0.018-1.202,0.467-1.626,1.639-1.606c5.208,0.091,10.416,0.134,15.624,0.193c0.005,4.903-0.08,9.81,0.059,14.71
		c0.056,1.963-0.628,2.43-2.474,2.385C144.873,22.095,139.968,22.167,135.063,22.164z"/>
	<path fill-rule="evenodd" clip-rule="evenodd" fill="#C2C4C6" d="M195.47,217.317c0.01,0.675,0.048,1.352,0.021,2.025
		c-0.049,1.237,0.481,1.654,1.705,1.426c5.954-1.108,11.826-2.488,17.424-4.872c2.432-1.034,2.705-0.839,2.705,1.863
		c-0.001,4.642-0.037,9.284-0.059,13.927c-6.11,2.953-12.438,5.219-19.211,6.071c-1.785,0.225-2.731,0.897-2.625,3.045
		c0.213,4.304-0.014,8.628,0.1,12.938c0.048,1.805-0.577,2.482-2.324,2.259c-0.499-0.064-1.014-0.016-1.521-0.009
		c-10.896,0.148-21.791,0.309-32.687,0.433c-0.889,0.01-1.878,0.334-2.648-0.453c0.972-0.915,2.199-0.754,3.369-0.764
		c3.554-0.028,7.108-0.044,10.661,0.003c1.841,0.023,2.587-0.741,2.549-2.577c-0.067-3.214,0.065-6.433-0.047-9.645
		c-0.143-4.093-2.993-7.191-6.827-7.572c-4.041-0.401-7.768,2.247-8.6,6.297c-0.721,3.509-0.198,7.089-0.338,10.635
		c-0.05,1.248,0.206,2.567-0.768,3.623c-5.729,0.01-11.459,0.019-17.188,0.028c-0.943-0.854-0.743-2.01-0.759-3.079
		c-0.047-3.037,0.049-6.076-0.038-9.112c-0.144-5.022-3.383-8.461-7.886-8.461c-4.502,0-7.741,3.438-7.885,8.461
		c-0.087,3.036,0.009,6.075-0.038,9.112c-0.016,1.069,0.185,2.225-0.759,3.079c-5.729-0.01-11.459-0.019-17.188-0.028
		c-0.853-0.892-0.748-2.023-0.764-3.115c-0.045-3.131,0.127-6.267-0.075-9.391c-0.295-4.561-3.454-7.851-7.598-8.074
		c-4.107-0.222-7.711,2.734-8.031,6.839c-0.282,3.626-0.072,7.273-0.082,10.911c-0.004,1.767,1.1,2.054,2.52,2.056
		c3.554,0.003,7.108-0.018,10.662,0.011c1.169,0.01,2.396-0.151,3.369,0.764c-0.682,0.739-1.579,0.444-2.39,0.46
		c-11.555,0.227-23.095-0.798-34.65-0.415c-1.703,0.057-2.167-0.577-2.134-2.195c0.087-4.305-0.15-8.622,0.102-12.913
		c0.136-2.311-0.877-2.922-2.772-3.182c-6.737-0.922-13.106-3.011-19.134-6.148c0-4.715,0.055-9.431-0.027-14.144
		c-0.038-2.161,0.719-2.456,2.574-1.644c5.166,2.261,10.561,3.78,16.141,4.596c3.111,0.455,3.117,0.414,3.169-3.068
		c0.976-0.88,2.192-0.804,3.366-0.804c41.084-0.017,82.168-0.017,123.253,0C193.278,216.514,194.495,216.438,195.47,217.317z"/>
	<path fill-rule="evenodd" clip-rule="evenodd" fill="#C2C4C6" d="M5.098,174.162c2.162,3.706,3.6,7.767,5.84,11.455
		c5.691,9.369,13.186,16.986,22.083,23.263c1.415,0.997,2.04,1.983,2.001,3.703c-0.104,4.643-0.052,9.288-0.062,13.933
		c-8.514-5.534-15.078-12.908-20.347-21.517c-5.426-8.864-8.277-18.577-9.545-28.813C4.988,175.522,5.084,174.837,5.098,174.162z"/>
	<path fill-rule="evenodd" clip-rule="evenodd" fill="#C2C4C6" d="M225.994,226.516c-0.01-4.729,0.024-9.458-0.055-14.186
		c-0.024-1.52,0.531-2.417,1.787-3.305c12.004-8.49,21.467-19.093,27.008-32.905c0.277-0.692,0.745-1.307,1.124-1.957
		c-0.285,8.108-2.299,15.833-5.572,23.192C244.955,209.342,237.003,219.222,225.994,226.516z"/>
	<path fill-rule="evenodd" clip-rule="evenodd" fill="#A4A5A7" d="M121.795,255.999c0.016-4.128,0.021-8.256,0.049-12.384
		c0.036-5.281,3.696-9.038,8.759-9.016c4.86,0.022,8.473,3.84,8.508,9.015c0.028,4.128,0.033,8.257,0.049,12.385
		c-3.454,0.831-6.96,0.272-10.437,0.32C126.421,256.351,124.068,256.807,121.795,255.999z"/>
	<path fill-rule="evenodd" clip-rule="evenodd" fill="#D0D3D5" d="M195.47,217.317c-43.328,0-86.656,0-129.984,0
		c-0.011-1.684-0.022-3.368-0.034-5.052c-0.51-0.603-0.788-1.319-0.742-2.088c0.221-3.715-0.848-7.517,0.745-11.139
		c0.008-2.532,0.015-5.064,0.022-7.598c1.416-1.025,3.056-0.837,4.65-0.836c21.462,0.012,42.925-0.073,64.386,0.094
		c19.362-0.212,38.726-0.06,58.089-0.084c1.041-0.002,2.011,0.229,2.878,0.826c0.007,2.533,0.015,5.065,0.021,7.598
		c0.528,0.596,0.788,1.32,0.743,2.085c-0.215,3.716,0.845,7.519-0.74,11.142C195.493,213.949,195.481,215.634,195.47,217.317z"/>
	<path fill-rule="evenodd" clip-rule="evenodd" fill="#C2C4C6" d="M134.541,191.424c-23.021,0.006-46.042,0.012-69.064,0.018
		c0.122-0.484,0.354-0.922-0.503-1.043c-6.782-0.954-13.223-2.973-19.403-5.961c-1.484-0.718-2.005-1.411-1.972-2.973
		c0.086-4.128,0.033-8.259,0.035-12.389c0.369,1.871,1.601,2.787,3.321,3.5c6.893,2.858,13.978,4.74,21.466,5.162
		c19.158,1.078,38.33,0.171,57.492,0.49c1.349,1.889,0.695,4.047,0.729,6.078c0.095,5.553,0.033,5.555,5.511,5.864
		c0.752,0.043,1.506,0.066,2.182,0.47C134.626,190.843,134.694,191.104,134.541,191.424z"/>
	<path fill-rule="evenodd" clip-rule="evenodd" fill="#C2C4C6" d="M65.454,199.039c0,4.409-0.001,8.817-0.002,13.227
		c-6.157-0.982-12.099-2.67-17.839-5.143c-3.936-1.695-3.987-1.578-3.987-5.845c0-2.023,0.036-4.048-0.01-6.07
		c-0.035-1.547,0.446-1.945,1.961-1.302c4.413,1.874,8.971,3.341,13.669,4.305C61.287,198.629,63.383,198.771,65.454,199.039z"/>
	<path fill-rule="evenodd" clip-rule="evenodd" fill="#C2C4C6" d="M10.108,136.062c2.362,3.584,3.857,7.646,6.313,11.196
		c5.32,7.688,11.682,14.276,19.599,19.308c-1.585,3.422-0.799,7.116-1.134,10.971c-5.311-3.521-9.326-8.014-12.951-12.827
		c-5.342-7.093-8.889-15.089-11.084-23.675C10.438,139.419,10.347,137.721,10.108,136.062z"/>
	<path fill-rule="evenodd" clip-rule="evenodd" fill="#C2C4C6" d="M12.401,166.464c2.603,4.105,5.857,7.653,9.167,11.071
		c3.438,3.552,7.138,6.93,11.423,9.502c1.494,0.896,2.108,1.954,2.032,3.69c-0.121,2.771-0.032,5.552-0.032,8.838
		C23.769,190.668,15.946,180.027,12.401,166.464z"/>
	<path fill-rule="evenodd" clip-rule="evenodd" fill="#C4C6C8" d="M5.018,121.842c0.008-1.517,0.011-3.034,0.029-4.551
		c0.002-0.157,0.095-0.313,0.261-0.824c0.271,2.014,0.497,3.697,0.723,5.38C5.694,121.846,5.356,121.844,5.018,121.842z"/>
	<path fill-rule="evenodd" clip-rule="evenodd" fill="#C2C4C6" d="M134.541,191.424c0-0.166,0-0.333,0-0.499
		c-0.551-3.781-0.266-7.575-0.144-11.365c0.017-0.506,0.224-0.987,0.646-1.331c17.495-0.002,34.992,0.16,52.483-0.075
		c8.947-0.12,17.731-1.699,25.996-5.409c1.69-0.758,3.64-1.302,3.801-3.668c0.002,4.13-0.052,8.262,0.034,12.389
		c0.033,1.562-0.488,2.256-1.972,2.973c-6.181,2.988-12.621,5.007-19.403,5.961c-0.857,0.121-0.625,0.559-0.503,1.043
		C175.166,191.436,154.854,191.43,134.541,191.424z"/>
	<path fill-rule="evenodd" clip-rule="evenodd" fill="#C2C4C6" d="M195.504,212.266c-0.001-4.409-0.002-8.817-0.003-13.227
		c6.793-0.378,13.175-2.438,19.408-4.948c2.024-0.814,2.533-0.443,2.445,1.624c-0.104,2.44-0.117,4.894,0.008,7.332
		c0.082,1.604-0.553,2.458-1.968,3.093c-5.763,2.583-11.585,4.942-17.94,5.637C196.795,211.849,196.153,212.099,195.504,212.266z"/>
	<path fill-rule="evenodd" clip-rule="evenodd" fill="#C2C4C6" d="M224.935,166.566c6.998-4.382,12.706-10.129,17.728-16.626
		c3.314-4.289,5.413-9.279,8.187-13.879c-0.854,7.933-3.83,15.122-7.565,22.083c-2.863,5.333-6.791,9.836-10.823,14.241
		c-1.742,1.903-3.976,3.355-6.301,5.272C225.653,173.77,226.554,169.995,224.935,166.566z"/>
	<path fill-rule="evenodd" clip-rule="evenodd" fill="#C2C4C6" d="M248.583,166.477c-3.594,13.481-11.356,24.14-22.585,33.095
		c0-3.746-0.009-7.063,0.01-10.38c0.003-0.642,0.415-1.15,0.923-1.446c4.487-2.603,8.362-6.04,11.953-9.668
		C242.4,174.524,245.826,170.781,248.583,166.477z"/>
	<path fill-rule="evenodd" clip-rule="evenodd" fill="#C4C6C8" d="M254.924,121.848c-0.082-1.688,0.784-3.247,1.014-4.961
		c0,1.652,0,3.303,0,4.955C255.6,121.844,255.262,121.846,254.924,121.848z"/>
	<path fill-rule="evenodd" clip-rule="evenodd" fill="#3180BC" d="M39.579,70.086c2.595-2.435,5.324-4.682,8.61-6.149
		c0.897,0.885,0.674,2.037,0.718,3.113c0.044,1.098,0.016,2.2,0.01,3.299c-0.038,7.404-0.144,5.442,5.368,3.112
		c1.348-0.569,1.791-1.69,1.804-3.071c0.025-2.454-0.011-4.908,0.022-7.362c0.015-1.088-0.117-2.224,0.722-3.128
		c2.553-1.173,5.236-1.862,8.026-2.159c1.597,0.238,1.265,1.561,1.323,2.543c0.133,2.264,0.069,4.537,0.043,6.805
		c-0.02,1.751,0.463,2.573,2.501,2.358c4.591-0.484,4.513-0.382,4.64-5.174c0.065-2.463-0.707-5.046,0.746-7.379
		c2.87-0.002,5.74-0.004,8.61-0.007c0.775,0.809,0.751,1.838,0.767,2.846c0.033,2.019-0.008,4.039,0.019,6.059
		c0.042,3.192,0.302,3.443,3.461,3.471c3.437,0.029,3.601-0.122,3.627-3.465c0.016-2.02-0.018-4.04,0.016-6.059
		c0.017-1.007-0.009-2.038,0.772-2.843c2.87-0.004,5.739-0.008,8.609-0.012c0.771,0.81,0.75,1.839,0.766,2.847
		c0.033,2.019-0.008,4.039,0.018,6.058c0.042,3.196,0.3,3.446,3.458,3.474c3.441,0.03,3.604-0.12,3.63-3.461
		c0.016-2.02-0.018-4.039,0.016-6.059c0.017-1.007-0.012-2.039,0.775-2.841c2.87-0.008,5.739-0.015,8.609-0.023
		c0.768,0.811,0.747,1.839,0.764,2.848c0.032,2.019-0.009,4.04,0.018,6.059c0.042,3.199,0.299,3.448,3.455,3.477
		c3.491,0.031,3.616-0.095,3.634-3.709c0.01-1.936-0.019-3.872,0.015-5.807c0.018-1.006-0.013-2.039,0.777-2.839
		c3.033,0,6.066,0,9.1,0c0.791,0.801,0.759,1.833,0.778,2.839c0.033,1.767,0.01,3.534,0.013,5.302
		c0.008,4.051,1.688,5.239,5.653,4.103c1.305-0.374,1.372-1.346,1.41-2.356c0.084-2.271,0.005-4.544,0.043-6.815
		c0.018-1.087-0.065-2.21,0.766-3.101c2.87,0.008,5.739,0.015,8.609,0.023c0.787,0.802,0.756,1.834,0.775,2.841
		c0.033,1.767,0.01,3.534,0.013,5.301c0.008,4.056,1.681,5.241,5.65,4.107c1.305-0.373,1.375-1.343,1.413-2.354
		c0.084-2.271,0.005-4.544,0.043-6.815c0.019-1.087-0.066-2.21,0.769-3.1c2.87,0.004,5.739,0.008,8.609,0.012
		c0.781,0.805,0.754,1.835,0.772,2.843c0.032,1.767,0.01,3.534,0.013,5.302c0.008,4.061,1.674,5.243,5.646,4.112
		c1.305-0.371,1.379-1.34,1.417-2.351c0.084-2.271,0.004-4.543,0.043-6.815c0.019-1.086-0.068-2.21,0.771-3.098
		c2.87,0.002,5.74,0.004,8.609,0.007c1.236,1.554,0.638,3.39,0.772,5.11c0.06,0.751,0.01,1.512,0.01,2.269
		c0.001,4.89,0.008,4.812,4.856,5.197c1.788,0.142,2.224-0.618,2.234-2.13c0.017-2.353-0.079-4.709,0.057-7.058
		c0.058-0.981-0.275-2.306,1.325-2.54c2.789,0.295,5.472,0.985,8.024,2.158c0.711,0.744,0.701,1.689,0.718,2.621
		c0.026,1.438,0.011,2.876,0.011,4.315c0.002,5.921,0.021,5.878,5.219,8.335c1.573,0.744,1.962,0.2,1.964-1.268
		c0.002-2.285-0.028-4.57,0.017-6.854c0.021-1.076-0.181-2.229,0.716-3.113c3.286,1.467,6.016,3.714,8.61,6.149
		c1.048,1.426,0.85,3.101,0.699,4.654c-0.582,6.016,1.069,10.909,4.752,16.026c8.059,11.199,10.259,24.027,7.129,37.603
		c-0.591,2.563-1.756,4.915-2.862,7.283c-3.651,7.012-9.211,12.26-15.666,16.589c-5.298,3.553-11.069,6.116-17.404,7.251
		c-0.14-0.223-0.162-0.459-0.089-0.708c0.317-0.542,0.849-0.797,1.397-1.023c8.917-3.684,15.201-10.04,19.104-18.816
		c0.171-0.386,0.416-0.73,0.691-1.054c6.247-10.062,7.471-20.757,4.059-32.039c-0.269-0.888-0.617-1.75-1.083-3.046
		c0,5.23,0.011,10.04-0.008,14.849c-0.005,1.17,0.162,2.373-0.42,3.478c-0.789,0.695-1.126-0.026-1.212-0.54
		c-1.099-6.598-4.462-12.126-8.173-17.497c-0.19-0.276,0.071,0.065-0.079-0.239c-0.347-3.271-0.313-6.567-0.104-9.826
		c0.208-3.254-0.911-5.506-3.698-7.077c-1.076-0.606-2.047-1.405-3.375-1.833c-0.637,3.989,0.433,7.892-0.654,11.66
		c-0.062,0.06-0.131,0.172-0.186,0.166c-3.425-0.424-6.593-1.474-9.231-3.813c-0.465-2.938-0.143-5.898-0.226-8.848
		c-0.085-3.004-3.646-5.057-6.246-3.586c-0.916,0.518-0.825,1.41-0.85,2.227c-0.065,2.195,0.008,4.391-0.039,6.586
		c-0.024,1.084,0.084,2.221-0.788,3.103c-2.854,0.838-5.706,0.854-8.556-0.006c-0.803-0.793-0.764-1.835-0.793-2.841
		c-0.05-1.688-0.018-3.378-0.021-5.068c-0.008-4.132-1.505-5.211-5.649-4.189c-1.198,0.295-1.372,1.102-1.401,2.071
		c-0.066,2.196,0.007,4.393-0.039,6.588c-0.025,1.168,0.117,2.387-0.73,3.389c-2.868,0.949-5.742,0.891-8.62,0.061
		c-0.816-0.786-0.778-1.829-0.809-2.835c-0.051-1.689-0.018-3.38-0.021-5.07c-0.008-4.149-1.484-5.218-5.643-4.204
		c-1.199,0.292-1.378,1.095-1.408,2.067c-0.066,2.196,0.008,4.395-0.039,6.591c-0.025,1.169,0.117,2.389-0.729,3.391
		c-2.869,0.949-5.743,0.892-8.622,0.061c-0.816-0.786-0.777-1.829-0.808-2.835c-0.051-1.69-0.018-3.381-0.021-5.071
		c-0.008-4.146-1.492-5.219-5.646-4.202c-1.198,0.294-1.375,1.099-1.405,2.07c-0.066,2.197,0.007,4.396-0.039,6.592
		c-0.025,1.169,0.118,2.39-0.734,3.39c-3.035,0.965-6.075,0.902-9.12,0.059c-0.82-0.783-0.783-1.827-0.813-2.833
		c-0.051-1.69-0.017-3.381-0.02-5.071c-0.008-4.153-1.479-5.22-5.641-4.208c-1.199,0.292-1.38,1.093-1.41,2.065
		c-0.067,2.197,0.007,4.396-0.04,6.592c-0.025,1.169,0.118,2.389-0.729,3.392c-2.869,0.95-5.743,0.892-8.621,0.061
		c-0.816-0.786-0.778-1.829-0.809-2.835c-0.051-1.689-0.017-3.38-0.02-5.07c-0.008-4.149-1.485-5.218-5.643-4.204
		c-1.198,0.292-1.378,1.095-1.408,2.067c-0.067,2.196,0.007,4.395-0.04,6.591c-0.025,1.169,0.118,2.389-0.729,3.391
		c-2.869,0.95-5.743,0.891-8.621,0.061c-0.816-0.785-0.779-1.827-0.809-2.833c-0.051-1.688-0.018-3.378-0.021-5.067
		c-0.007-4.16-1.456-5.212-5.632-4.212c-1.197,0.287-1.388,1.082-1.418,2.057c-0.067,2.195,0.006,4.392-0.039,6.587
		c-0.024,1.169,0.116,2.387-0.715,3.396c-2.838,0.98-5.691,0.854-8.551,0.122c-0.957-0.82-0.85-1.966-0.877-3.048
		c-0.058-2.279-0.034-4.561-0.022-6.841c0.009-1.754-0.845-2.351-2.515-2.344c-3.84,0.017-4.55,0.697-4.608,4.516
		c-0.041,2.698,0.214,5.405-0.186,8.095c-0.194,0.686-0.631,1.177-1.302,1.384c-2.139,0.66-4.121,1.716-6.235,2.434
		c-0.607,0.207-1.255,0.508-1.865-0.034c-1-2.528-0.316-5.17-0.511-7.755c-0.095-1.253,0.13-2.519-0.115-3.928
		c-2.439,0.784-4.28,2.353-6.083,3.952c-0.968,0.858-0.97,2.096-0.998,3.291c-0.088,3.794,0.176,7.593-0.148,11.385
		c-0.445,1.6-1.645,2.727-2.555,4.032c-2.693,3.862-4.431,8.123-5.458,12.702c-0.163,0.727,0.103,2.007-1.41,1.693
		c-0.633-0.996-0.482-2.119-0.486-3.204c-0.019-4.973-0.009-9.947-0.005-15.258c-4.623,12.408-3.869,24.019,2.954,35.105
		c1.074,1.331,1.511,3,2.353,4.46c3.908,6.784,9.313,11.903,16.528,15.053c0.835,0.364,1.791,0.563,2.333,1.424
		c0.077,0.25,0.047,0.487-0.089,0.711c-8.41-1.616-15.765-5.425-22.27-10.898c-4.354-3.663-8.224-7.774-10.802-12.941
		c-6.172-12.674-5.153-25.33,0.178-37.934c1.786-4.221,4.22-8.08,7.313-11.483c1.029-1.131,1.508-2.379,1.497-3.896
		c-0.024-3.039-0.011-6.077-0.004-9.116C38.848,72.122,38.853,71.021,39.579,70.086z"/>
	<path fill-rule="evenodd" clip-rule="evenodd" fill="#FC6D2F" d="M143.677,91.321c2.877,0,5.753,0,8.63,0
		c2.881-1.169,5.762-1.176,8.643,0c2.877,0,5.754,0,8.632,0c2.881-1.171,5.761-1.174,8.642,0c2.878,0.001,5.755,0.003,8.633,0.004
		c3.054-1.045,5.893-0.402,8.619,1.106c2.882,1.172,5.764,2.344,8.646,3.517c3.908,1.093,6.354,3.98,8.654,7.048
		c4.518,5.395,7.298,11.593,8.554,18.497c1.563,2.924,0.786,6.035,0.605,9.058c-0.171,2.862-1.27,5.516-2.602,8.051
		c-3.755,8.478-9.481,15.086-18.035,19.007c-1.072,0.491-2.174,0.919-3.262,1.376c-0.751,0.782-1.833,0.567-2.731,0.905
		c-2.736,0.658-5.538,0.76-8.325,0.988c-0.256-0.217-0.459-0.476-0.611-0.775c-0.458-1.313-0.314-2.678-0.315-4.024
		c-0.012-14.551-0.006-29.102-0.009-43.653c0-1.1,0.051-2.204-0.109-3.295c-0.343-2.333-1.491-3.437-3.808-3.677
		c-0.928-0.096-1.86-0.065-2.791-0.065c-32.57-0.001-65.141-0.001-97.711,0c-0.762,0-1.523-0.017-2.284,0.03
		c-2.882,0.178-4.101,1.349-4.369,4.215c-0.095,1.012-0.059,2.029-0.059,3.044c-0.001,14.466,0.004,28.933-0.008,43.399
		c-0.001,1.347,0.144,2.712-0.311,4.027c-0.154,0.299-0.36,0.557-0.617,0.773c-2.828-0.248-5.656-0.497-8.483-0.746
		c-0.679-0.783-1.915-0.318-2.573-1.147c-10.102-3.656-17.022-10.638-21.296-20.383c-2.566-4.543-3.075-9.483-2.801-14.571
		c0.049-0.909-0.021-1.869,0.804-2.537c1.257-6.903,4.034-13.103,8.554-18.497c2.298-3.07,4.747-5.955,8.654-7.049
		c2.881-1.172,5.763-2.344,8.645-3.517c2.727-1.509,5.565-2.151,8.62-1.106c2.877-0.001,5.754-0.003,8.632-0.004
		c2.881-1.173,5.761-1.171,8.642,0c2.877,0,5.755,0,8.632,0c2.881-1.175,5.762-1.169,8.643,0c2.877,0,5.753,0,8.63,0
		c2.881-1.177,5.762-1.167,8.643,0c3.037,0,6.075,0,9.112,0C137.915,90.153,140.796,90.145,143.677,91.321z"/>
	<path fill-rule="evenodd" clip-rule="evenodd" fill="#87B237" d="M178.127,160.9c-11.464,0.008-22.928,0.017-34.392,0.025
		c-0.193-0.275-0.22-0.565-0.083-0.871c0.443-0.94,1.234-1.597,1.924-2.336c10.125-10.849,6.402-27.93-7.321-33.63
		c-1.438-0.597-3.385-0.728-3.704-2.662c-0.424-2.577-0.655-5.233,0.204-7.767c0.421-1.242,1.769-1.157,2.853-1.179
		c3.888-0.076,7.776-0.03,11.664-0.03c8.622-0.001,17.243-0.033,25.864,0.017c3.234,0.019,3.813,0.546,3.823,3.617
		c0.046,14.03,0.031,28.062,0.011,42.093c-0.001,0.676-0.025,1.354-0.272,1.999C178.553,160.454,178.362,160.694,178.127,160.9z"/>
	<path fill-rule="evenodd" clip-rule="evenodd" fill="#87B237" d="M117.221,160.926c-11.464-0.009-22.928-0.018-34.392-0.025
		c-0.235-0.206-0.422-0.447-0.564-0.726c-0.358-0.979-0.284-2.001-0.285-3.011c-0.009-13.355-0.012-26.71,0-40.065
		c0.003-4.286,0.35-4.638,4.603-4.644c11.833-0.015,23.667-0.016,35.5,0.001c4.209,0.006,4.554,0.384,4.583,4.685
		c0.004,0.592,0.006,1.184-0.002,1.775c-0.052,3.46-0.221,3.701-3.487,4.994c-14.221,5.629-18.084,22.865-7.618,33.991
		c0.635,0.675,1.348,1.287,1.755,2.151C117.447,160.36,117.416,160.651,117.221,160.926z"/>
	<path fill-rule="evenodd" clip-rule="evenodd" fill="#4397D0" d="M39.579,70.086c-0.008,4.303-0.057,8.607,0.001,12.91
		c0.019,1.36-0.398,2.344-1.32,3.368c-6.616,7.353-10.162,16.028-11.474,25.823c-1.024,7.649,0.311,14.858,2.72,22.008
		c0.159,0.472,0.238,0.971,0.354,1.457c-3.837-5.323-5.88-11.417-6.88-17.766c-2.899-18.406,2.458-34.173,15.786-47.211
		C39.003,70.444,39.307,70.281,39.579,70.086z"/>
	<path fill-rule="evenodd" clip-rule="evenodd" fill="#4397D0" d="M231.095,135.653c1.148-4.542,2.638-8.956,3.187-13.693
		c0.766-6.607-0.207-12.909-2.132-19.089c-1.995-6.404-5.17-12.244-9.97-17.061c-0.831-0.834-0.78-1.803-0.781-2.813
		c-0.004-4.304-0.014-8.607-0.021-12.91c9.058,7.92,14.549,17.935,16.625,29.67c2.06,11.644,0.312,22.86-5.245,33.391
		C232.289,134.035,231.952,135.02,231.095,135.653z"/>
	<path fill-rule="evenodd" clip-rule="evenodd" fill="#B0B2B4" d="M135.043,178.229c0,3.444,0.017,6.889-0.011,10.332
		c-0.006,0.807,0.274,1.703-0.491,2.364c-2.259-0.001-4.52-0.061-6.776,0.017c-1.436,0.049-1.897-0.536-1.873-1.92
		c0.062-3.597,0.021-7.195,0.021-10.793c0.799-1.389,0.961-3.171,2.755-3.927C131.476,173.119,133.399,174.261,135.043,178.229z"/>
	<path fill-rule="evenodd" clip-rule="evenodd" fill="#4397D0" d="M212.767,63.938c-0.001,3.803-0.049,7.605,0.019,11.407
		c0.03,1.717-0.593,1.919-1.914,1.109c-0.719-0.44-1.389-1.14-2.161-1.28c-4.522-0.818-4.99-3.87-4.628-7.673
		c0.239-2.512,0.042-5.065,0.041-7.6C207.233,60.756,210.103,62.128,212.767,63.938z"/>
	<path fill-rule="evenodd" clip-rule="evenodd" fill="#4397D0" d="M56.833,59.901c-0.002,3.718-0.063,7.437,0.024,11.153
		c0.035,1.475-0.416,2.437-1.816,2.926c-1.756,0.615-3.39,1.474-4.959,2.47c-1.309,0.831-1.942,0.611-1.912-1.105
		c0.068-3.801,0.019-7.604,0.018-11.407C50.854,62.128,53.722,60.756,56.833,59.901z"/>
	<path fill-rule="evenodd" clip-rule="evenodd" fill="#4397D0" d="M74.112,56.896c-0.005,3.707-0.067,7.414,0.013,11.118
		c0.033,1.541-0.499,2.166-2.04,2.031c-0.919-0.081-1.856-0.062-2.777,0.008c-3.845,0.29-3.717,0.298-3.887-3.658
		c-0.124-2.883,0.775-5.847-0.562-8.652C67.901,57.005,70.986,56.723,74.112,56.896z"/>
	<path fill-rule="evenodd" clip-rule="evenodd" fill="#4397D0" d="M196.099,57.743c-1.053,0.96-0.551,2.219-0.582,3.342
		c-0.074,2.609-0.065,5.223-0.012,7.833c0.029,1.418-0.666,1.777-1.894,1.552c-0.657-0.12-1.302-0.359-1.963-0.416
		c-4.789-0.413-4.789-0.403-4.791-5.326c-0.001-2.612-0.009-5.223-0.014-7.834C189.971,56.724,193.056,57.004,196.099,57.743z"/>
	<path fill-rule="evenodd" clip-rule="evenodd" fill="#4397D0" d="M91.384,56.896c-0.004,3.637-0.068,7.275,0.013,10.91
		c0.036,1.577-0.355,2.289-2.104,2.25c-7.796-0.175-6.427,0.977-6.553-6.317c-0.039-2.283-0.014-4.567-0.018-6.851
		C85.609,56.891,88.496,56.894,91.384,56.896z"/>
	<path fill-rule="evenodd" clip-rule="evenodd" fill="#4397D0" d="M108.656,56.903c-0.004,3.637-0.069,7.274,0.013,10.909
		c0.037,1.585-0.37,2.283-2.111,2.244c-7.788-0.174-6.422,0.978-6.546-6.322c-0.04-2.283-0.015-4.566-0.019-6.85
		C102.881,56.891,105.769,56.897,108.656,56.903z"/>
	<path fill-rule="evenodd" clip-rule="evenodd" fill="#4397D0" d="M178.234,56.889c-0.005,3.552-0.078,7.106,0.015,10.656
		c0.05,1.881-0.673,2.493-2.526,2.517c-6.138,0.079-6.136,0.137-6.138-6.061c-0.001-2.368-0.009-4.736-0.013-7.104
		C172.46,56.894,175.347,56.891,178.234,56.889z"/>
	<path fill-rule="evenodd" clip-rule="evenodd" fill="#4397D0" d="M160.963,56.885c-0.005,3.552-0.079,7.105,0.014,10.654
		c0.05,1.875-0.661,2.499-2.521,2.523c-6.144,0.081-6.142,0.139-6.144-6.055c-0.001-2.368-0.009-4.736-0.013-7.104
		C155.187,56.897,158.075,56.891,160.963,56.885z"/>
	<path fill-rule="evenodd" clip-rule="evenodd" fill="#4297D0" d="M143.69,56.88c-0.004,3.636-0.051,7.273,0.005,10.908
		c0.025,1.628-0.631,2.204-2.251,2.268c-6.404,0.25-6.401,0.293-6.403-6.044c-0.001-2.368-0.009-4.736-0.013-7.104
		C137.915,56.899,140.803,56.89,143.69,56.88z"/>
	<path fill-rule="evenodd" clip-rule="evenodd" fill="#4297D0" d="M125.928,56.908c-0.004,3.637-0.07,7.274,0.014,10.909
		c0.037,1.59-0.382,2.278-2.117,2.24c-7.779-0.174-6.418,0.979-6.542-6.327c-0.039-2.283-0.014-4.566-0.019-6.85
		C120.153,56.89,123.041,56.899,125.928,56.908z"/>
	<path fill-rule="evenodd" clip-rule="evenodd" fill="#CACEB5" d="M117.221,160.926c0.046-0.156,0.06-0.315,0.042-0.478
		c0.869-0.88,2.005-0.805,3.089-0.81c6.751-0.033,13.502-0.033,20.253,0c1.084,0.005,2.22-0.07,3.089,0.81
		c-0.019,0.162-0.005,0.321,0.042,0.478C134.897,160.926,126.059,160.926,117.221,160.926z"/>
	<path fill-rule="evenodd" clip-rule="evenodd" fill="#D7C2BA" d="M73.977,160.878c0.038-0.166,0.104-0.321,0.195-0.465
		c1.384-0.972,2.831-0.811,4.301-0.239c0.286,0.2,0.35,0.458,0.193,0.771C77.104,160.922,75.54,160.9,73.977,160.878z"/>
	<path fill-rule="evenodd" clip-rule="evenodd" fill="#D7C2BA" d="M186.783,160.413c0.092,0.145,0.157,0.299,0.195,0.465
		c-1.563,0.022-3.126,0.044-4.689,0.066c-0.156-0.313-0.091-0.567,0.195-0.768C183.953,159.603,185.399,159.44,186.783,160.413z"/>
	<path fill-rule="evenodd" clip-rule="evenodd" fill="#CACEB5" d="M182.288,160.468c0,0.158,0.001,0.317,0.001,0.477
		c-1.388-0.015-2.774-0.029-4.162-0.044c0.037-0.162,0.085-0.319,0.144-0.475C179.619,159.5,180.959,159.432,182.288,160.468z"/>
	<path fill-rule="evenodd" clip-rule="evenodd" fill="#CACEB5" d="M78.667,160.944c0-0.159,0-0.318,0-0.477
		c1.329-1.036,2.669-0.968,4.018-0.042c0.058,0.155,0.105,0.313,0.143,0.475C81.442,160.914,80.055,160.93,78.667,160.944z"/>
	<path fill-rule="evenodd" clip-rule="evenodd" fill="#678BAC" d="M62.92,158.984c0.873,0.347,2.042,0.03,2.573,1.146
		c-0.812-0.377-1.85,0.146-2.561-0.638C62.928,159.324,62.924,159.153,62.92,158.984z"/>
	<path fill-rule="evenodd" clip-rule="evenodd" fill="#678BAC" d="M195.304,159.89c0.807-0.617,1.789-0.7,2.731-0.905
		c-0.004,0.169-0.007,0.339-0.011,0.509C197.207,160.239,196.233,159.912,195.304,159.89z"/>
	<path fill-rule="evenodd" clip-rule="evenodd" fill="#A4A5A7" d="M104.607,255.971c-5.061-0.013-10.122-0.081-15.181-0.005
		c-1.663,0.024-2.214-0.527-2.165-2.179c0.102-3.371,0.024-6.747,0.032-10.121c0.011-5.264,3.32-8.969,8.087-9.064
		c5.226-0.105,9.065,3.603,9.172,8.971C104.634,247.703,104.593,251.838,104.607,255.971
		C104.607,255.971,104.607,255.971,104.607,255.971z"/>
	<path fill-rule="evenodd" clip-rule="evenodd" fill="#A4A5A7" d="M156.349,255.971c0.015-4.217-0.051-8.437,0.063-12.651
		c0.122-4.475,3.513-8.236,7.645-8.703c4.384-0.495,8.638,2.097,9.337,6.3c0.761,4.569,0.225,9.251,0.225,13.883
		c0.001,1.439-1.229,1.117-2.088,1.123C166.47,255.958,161.409,255.958,156.349,255.971
		C156.349,255.971,156.349,255.971,156.349,255.971z"/>
	<path fill-rule="evenodd" clip-rule="evenodd" fill="#4397D0" d="M212.774,102.996c-2.667-2.617-5.526-4.997-8.654-7.048
		c0-4.259,0-8.518,0-12.987c3.264,1.01,5.536,2.996,7.878,4.865c0.835,0.666,0.771,1.614,0.77,2.546
		C212.763,94.58,212.771,98.788,212.774,102.996z"/>
	<path fill-rule="evenodd" clip-rule="evenodd" fill="#4397D0" d="M56.836,95.948c-3.128,2.051-5.988,4.431-8.654,7.049
		c0.003-4.208,0.011-8.416,0.006-12.625c-0.001-0.933-0.066-1.881,0.769-2.547c2.341-1.869,4.614-3.854,7.879-4.865
		C56.836,87.43,56.836,91.689,56.836,95.948z"/>
	<path fill-rule="evenodd" clip-rule="evenodd" fill="#4397D0" d="M74.101,91.325c-2.874,0.369-5.747,0.737-8.62,1.106
		c-0.006-3.465,0.046-6.931-0.042-10.394c-0.045-1.763,0.298-2.645,2.375-2.993c6.307-1.058,6.284-1.193,6.284,4.928
		C74.098,86.423,74.1,88.875,74.101,91.325z"/>
	<path fill-rule="evenodd" clip-rule="evenodd" fill="#4397D0" d="M219.332,138.602c1.835-5.567,2.457-11.275,1.996-17.109
		c0.024-3.459,0.057-6.919,0.069-10.379c0.012-3.37,0.002-6.741,0.002-10.552c1.454,1.532,1.833,3.144,2.313,4.645
		c3.69,11.53,2.483,22.509-3.848,32.875C219.739,138.286,219.512,138.429,219.332,138.602z"/>
	<path fill-rule="evenodd" clip-rule="evenodd" fill="#4397D0" d="M39.627,121.494c-0.46,5.833,0.162,11.541,1.997,17.107
		c-3.695-4.437-5.102-9.858-6.036-15.309c-1.275-7.444,0.02-14.691,2.991-21.628c0.119-0.277,0.321-0.519,1.048-0.71
		C39.627,107.801,39.627,114.647,39.627,121.494z"/>
	<path fill-rule="evenodd" clip-rule="evenodd" fill="#4397D0" d="M195.475,92.432c-2.873-0.369-5.746-0.737-8.619-1.106
		c0.001-3.55,0.062-7.1-0.024-10.648c-0.037-1.555,0.521-2.008,2.05-2.045c6.174-0.15,6.614,0.21,6.611,6.194
		C195.491,87.361,195.481,89.896,195.475,92.432z"/>
	<path fill-rule="evenodd" clip-rule="evenodd" fill="#4397D0" d="M91.375,91.321c-2.88,0-5.761,0-8.642,0
		c0.001-3.551,0.062-7.103-0.025-10.652c-0.039-1.566,0.544-1.998,2.062-2.04c6.602-0.181,6.601-0.226,6.601,6.351
		C91.37,87.094,91.373,89.208,91.375,91.321z"/>
	<path fill-rule="evenodd" clip-rule="evenodd" fill="#4397D0" d="M108.649,91.321c-2.881,0-5.761,0-8.643,0
		c0-3.551,0.061-7.103-0.026-10.651c-0.039-1.566,0.544-1.999,2.062-2.04c6.603-0.182,6.601-0.227,6.602,6.352
		C108.643,87.095,108.647,89.208,108.649,91.321z"/>
	<path fill-rule="evenodd" clip-rule="evenodd" fill="#4397D0" d="M125.922,91.321c-2.881,0-5.762,0-8.643,0
		c0-3.551,0.06-7.103-0.028-10.651c-0.038-1.565,0.544-1.999,2.062-2.04c6.603-0.183,6.601-0.228,6.602,6.352
		C125.915,87.095,125.919,89.208,125.922,91.321z"/>
	<path fill-rule="evenodd" clip-rule="evenodd" fill="#4397D0" d="M143.677,91.321c-2.881,0-5.762,0-8.643,0
		c0.003-3.551,0.065-7.102-0.02-10.651c-0.037-1.564,0.544-1.999,2.062-2.041c6.603-0.183,6.602-0.229,6.602,6.351
		C143.678,87.094,143.677,89.207,143.677,91.321z"/>
	<path fill-rule="evenodd" clip-rule="evenodd" fill="#4397D0" d="M160.949,91.321c-2.881,0-5.762,0-8.643,0
		c0.003-3.551,0.065-7.103-0.02-10.651c-0.038-1.564,0.543-1.999,2.061-2.041c6.604-0.183,6.602-0.228,6.602,6.351
		C160.949,87.094,160.949,89.207,160.949,91.321z"/>
	<path fill-rule="evenodd" clip-rule="evenodd" fill="#4397D0" d="M178.223,91.321c-2.88,0-5.761,0-8.642,0
		c0.002-3.551,0.063-7.103-0.022-10.652c-0.037-1.565,0.543-1.999,2.062-2.04c6.603-0.182,6.602-0.227,6.602,6.351
		C178.222,87.094,178.223,89.207,178.223,91.321z"/>
	<path fill-rule="evenodd" clip-rule="evenodd" fill="#DDE0E2" d="M82.686,160.426c-1.339,0.014-2.679,0.027-4.018,0.042
		c-1.499-0.018-2.997-0.036-4.495-0.055c-0.02-16.928-0.057-33.855-0.044-50.783c0.002-3.479,1.675-5.096,5.184-5.098
		c34.11-0.016,68.222-0.016,102.333,0c3.509,0.001,5.181,1.618,5.183,5.098c0.014,16.927-0.024,33.855-0.044,50.782
		c-1.498,0.019-2.997,0.036-4.495,0.055c-1.34-0.014-2.679-0.028-4.019-0.042c-0.025-14.728-0.104-29.455-0.022-44.182
		c0.013-2.339-0.405-3.164-2.982-3.133c-12.61,0.151-25.225,0.109-37.837,0.026c-1.964-0.013-2.405,0.53-2.619,2.509
		c-0.479,4.426,0.739,6.659,5.261,8.672c14.479,6.444,16.207,26.039,3.624,36.131c-8.811,0-17.621,0-26.431,0
		c-6.793-5.479-9.645-12.608-7.979-21.121c1.641-8.388,6.812-13.989,15.067-16.535c1.246-0.384,1.804-0.962,1.729-2.313
		c-0.104-1.856-0.088-3.726-0.007-5.584c0.059-1.346-0.486-1.737-1.781-1.734c-13.29,0.033-26.58,0.05-39.869-0.012
		c-1.957-0.01-1.656,1.173-1.656,2.333c-0.001,13.967,0,27.934-0.004,41.9C82.76,158.396,82.711,159.411,82.686,160.426z"/>
	<path fill-rule="evenodd" clip-rule="evenodd" fill="#88B237" d="M126.052,143.436c0,3.385-0.041,6.771,0.019,10.155
		c0.027,1.521-0.331,2.092-1.843,1.223c-4.427-2.544-6.771-6.45-6.716-11.451c0.054-4.993,2.447-8.878,6.925-11.334
		c1.156-0.634,1.652-0.406,1.631,0.998C126.017,136.495,126.052,139.966,126.052,143.436z"/>
	<path fill-rule="evenodd" clip-rule="evenodd" fill="#88B237" d="M134.903,143.471c0-3.384,0.048-6.769-0.021-10.15
		c-0.032-1.547,0.349-2.059,1.829-1.201c4.314,2.499,6.67,6.316,6.729,11.202c0.059,4.886-2.205,8.751-6.463,11.352
		c-1.666,1.017-2.154,0.553-2.102-1.306C134.972,150.07,134.903,146.77,134.903,143.471z"/>
</g>
</svg>
