{
    "name": "SR.WebRTC",
    "rootNamespace": "",
    "references": [],
    "includePlatforms": [
        "Editor",
        "LinuxStandalone64",
        "macOSStandalone",
        "WindowsStandalone64"
    ],
    "excludePlatforms": [],
    "allowUnsafeCode": false,
    "overrideReferences": false,
    "precompiledReferences": [],
    "autoReferenced": true,
    "defineConstraints": [],
    "versionDefines": [],
    "noEngineReferences": false
}