#VRML V2.0 utf8 
# 
# Generated by CCVisu, a tool for Co-Change Visualization 
#   and general force-directed graph layout. 
#   Jun 29, 2005 11:26:27 PM 
  
	PROTO TRANSFORM_Sphere [ 
		field SFVec3f translation 0 0 0 
		field SFVec3f scale 1 1 1 
		field SFColor diffuseColor 0.5 0.5 0.5 
		field SFString name "" 
		field SFVec3f textTranslate 0 0 1 
		field SFFloat textSize 14
	] { 
		Transform { 
			translation IS translation 
			children [ 
				Transform { 
					scale IS scale 
					children [ 
						DEF sensor0 TouchSensor {} 
						Shape { 
							geometry Sphere { radius 0.5 } 
							appearance Appearance { 
								material Material { 
									ambientIntensity 0.3 
									diffuseColor IS diffuseColor 
								} 
							} 
						} 
					] 
				} 
				Billboard { 
					axisOfRotation 0 0 0 
					children [ 
						Transform { 
							translation IS textTranslate 
							children [ 
								Shape { geometry DEF label0 Text { string [ "" ] fontStyle FontStyle { family "SANS" size IS textSize } } } 
							] 
						} 
					] 
				} 
				DEF script0 Script { 
					eventIn SFBool isOver 
					eventIn SFBool touchTime 
					eventOut MFString trans 
					field SFBool labelDisplayed FALSE 
					field SFString label IS name 
					url [ "javascript: 
						function isOver(value) { 
							if (value) { 
								trans[0] = label; 
							} else { 
								if (!labelDisplayed) trans[0] = ''; 
							} 
						} 
						function touchTime() { 
							if (labelDisplayed) { 
								trans[0] = ''; 
								labelDisplayed = false; 
							} else { 
								trans[0] = label; 
								labelDisplayed = true; 
							} 
						}" 
					] 
				} 
			] 
		} 
		ROUTE sensor0.isOver TO script0.isOver 
		ROUTE sensor0.touchTime TO script0.touchTime 
		ROUTE script0.trans_changed TO label0.set_string 
	} 

TRANSFORM_Sphere { translation 445 -585 45 scale 16 16 16 diffuseColor 0 0 255 name "src/Makefile" textTranslate 0 0 17 } 
TRANSFORM_Sphere { translation 746 -770 45 scale 4 4 4 diffuseColor 0 0 255 name "src/config.sh" textTranslate 0 0 5 } 
TRANSFORM_Sphere { translation 711 -671 45 scale 6 6 6 diffuseColor 0 0 255 name "src/config.txt" textTranslate 0 0 7 } 
TRANSFORM_Sphere { translation 280 -520 45 scale 12 12 12 diffuseColor 0 0 255 name "run-wcre.sh" textTranslate 0 0 13 } 
TRANSFORM_Sphere { translation 79 -657 45 scale 4 4 4 diffuseColor 128 128 128 name "RelExtractor/Query-new.sql" textTranslate 0 0 5 } 
TRANSFORM_Sphere { translation 51 -610 45 scale 4 4 4 diffuseColor 128 128 128 name "RelExtractor/Java-Version/DB.java" textTranslate 0 0 5 } 
TRANSFORM_Sphere { translation 45 -591 45 scale 4 4 4 diffuseColor 128 128 128 name "RelExtractor/Java-Version/RelDump.java" textTranslate 0 0 5 } 
TRANSFORM_Sphere { translation 82 -677 45 scale 4 4 4 diffuseColor 128 128 128 name "RelExtractor/Query-orig.sql" textTranslate 0 0 5 } 
TRANSFORM_Sphere { translation 67 -631 45 scale 4 4 4 diffuseColor 128 128 128 name "RelExtractor/Query.sql" textTranslate 0 0 5 } 
TRANSFORM_Sphere { translation 58 -654 45 scale 4 4 4 diffuseColor 128 128 128 name "RelExtractor/Refresh.sql" textTranslate 0 0 5 } 
TRANSFORM_Sphere { translation 45 -630 45 scale 4 4 4 diffuseColor 128 128 128 name "RelExtractor/RefreshFiles.sh" textTranslate 0 0 5 } 
TRANSFORM_Sphere { translation 245 -551 45 scale 12 12 12 diffuseColor 0 255 255 name "src/bddBdd.cpp" textTranslate 0 0 13 } 
TRANSFORM_Sphere { translation 209 -574 45 scale 12 12 12 diffuseColor 0 255 255 name "src/bddBdd.h" textTranslate 0 0 13 } 
TRANSFORM_Sphere { translation 270 -535 45 scale 12 12 12 diffuseColor 0 255 255 name "src/bddRelation.cpp" textTranslate 0 0 13 } 
TRANSFORM_Sphere { translation 280 -553 45 scale 16 16 16 diffuseColor 0 255 255 name "src/bddRelation.h" textTranslate 0 0 17 } 
TRANSFORM_Sphere { translation 234 -611 45 scale 10 10 10 diffuseColor 0 255 255 name "src/bddSymTab.cpp" textTranslate 0 0 11 } 
TRANSFORM_Sphere { translation 251 -563 45 scale 17 17 17 diffuseColor 0 255 255 name "src/bddSymTab.h" textTranslate 0 0 18 } 
TRANSFORM_Sphere { translation 264 -399 45 scale 27 27 27 diffuseColor 0 0 255 name "src/crocopat.cpp" textTranslate 0 0 28 } 
TRANSFORM_Sphere { translation 106 -568 45 scale 6 6 6 diffuseColor 0 0 255 name "src/FlexLexer.h" textTranslate 0 0 7 } 
TRANSFORM_Sphere { translation 170 -636 45 scale 7 7 7 diffuseColor 0 255 255 name "src/ctaObject.cpp" textTranslate 0 0 8 } 
TRANSFORM_Sphere { translation 168 -615 45 scale 7 7 7 diffuseColor 0 255 255 name "src/ctaObject.h" textTranslate 0 0 8 } 
TRANSFORM_Sphere { translation 341 -477 45 scale 12 12 12 diffuseColor 0 0 255 name "src/dependencies" textTranslate 0 0 13 } 
TRANSFORM_Sphere { translation 302 -527 45 scale 22 22 22 diffuseColor 255 0 255 name "src/relExpression.h" textTranslate 0 0 23 } 
TRANSFORM_Sphere { translation 311 -477 45 scale 21 21 21 diffuseColor 255 0 255 name "src/relLex.l" textTranslate 0 0 22 } 
TRANSFORM_Sphere { translation 290 -502 45 scale 22 22 22 diffuseColor 255 0 255 name "src/relStatement.h" textTranslate 0 0 23 } 
TRANSFORM_Sphere { translation 281 -491 45 scale 23 23 23 diffuseColor 255 0 255 name "src/relYacc.y" textTranslate 0 0 24 } 
TRANSFORM_Sphere { translation 175 -660 45 scale 6 6 6 diffuseColor 0 255 255 name "src/reprNUMBER.h" textTranslate 0 0 7 } 
TRANSFORM_Sphere { translation 201 -517 45 scale 13 13 13 diffuseColor 0 0 255 name "syntax.txt" textTranslate 0 0 14 } 
TRANSFORM_Sphere { translation 259 -657 45 scale 8 8 8 diffuseColor 255 0 255 name "src/relDataType.cpp" textTranslate 0 0 9 } 
TRANSFORM_Sphere { translation 329 -622 45 scale 9 9 9 diffuseColor 255 0 255 name "src/relDataType.h" textTranslate 0 0 10 } 
TRANSFORM_Sphere { translation 314 -662 45 scale 7 7 7 diffuseColor 255 0 255 name "src/relInteger.h" textTranslate 0 0 8 } 
TRANSFORM_Sphere { translation 391 -745 45 scale 4 4 4 diffuseColor 0 255 0 name "programs/bool.pat" textTranslate 0 0 5 } 
TRANSFORM_Sphere { translation 428 -674 45 scale 5 5 5 diffuseColor 0 255 0 name "programs/int.pat" textTranslate 0 0 6 } 
TRANSFORM_Sphere { translation 291 -701 45 scale 8 8 8 diffuseColor 0 0 255 name "readme-license.txt" textTranslate 0 0 9 } 
TRANSFORM_Sphere { translation 317 -691 45 scale 6 6 6 diffuseColor 0 255 0 name "programs/test.pat" textTranslate 0 0 7 } 
TRANSFORM_Sphere { translation 309 -546 45 scale 14 14 14 diffuseColor 255 0 255 name "src/relNumExpr.h" textTranslate 0 0 15 } 
TRANSFORM_Sphere { translation 282 -538 45 scale 13 13 13 diffuseColor 255 0 255 name "src/relStrExpr.h" textTranslate 0 0 14 } 
TRANSFORM_Sphere { translation 256 -698 45 scale 6 6 6 diffuseColor 255 0 255 name "src/relString.h" textTranslate 0 0 7 } 
TRANSFORM_Sphere { translation 327 -523 45 scale 13 13 13 diffuseColor 255 0 255 name "src/relNumExpr.cpp" textTranslate 0 0 14 } 
TRANSFORM_Sphere { translation 264 -552 45 scale 10 10 10 diffuseColor 255 0 255 name "src/relTerm.h" textTranslate 0 0 11 } 
TRANSFORM_Sphere { translation 307 -803 45 scale 3 3 3 diffuseColor 0 0 255 name "license_lgpl.txt" textTranslate 0 0 4 } 
TRANSFORM_Sphere { translation 228 -817 45 scale 4 4 4 diffuseColor 255 0 255 name "src/relYacc.output" textTranslate 0 0 5 } 
TRANSFORM_Sphere { translation 261 -736 45 scale 6 6 6 diffuseColor 255 0 255 name "src/relYacc.tab.cpp.output" textTranslate 0 0 7 } 
TRANSFORM_Sphere { translation 454 -483 45 scale 9 9 9 diffuseColor 0 255 0 name "programs/ClassesInCycles.pat" textTranslate 0 0 10 } 
TRANSFORM_Sphere { translation 469 -470 45 scale 9 9 9 diffuseColor 0 255 0 name "programs/Composite.pat" textTranslate 0 0 10 } 
TRANSFORM_Sphere { translation 472 -493 45 scale 10 10 10 diffuseColor 0 255 0 name "programs/Cycles.pat" textTranslate 0 0 11 } 
TRANSFORM_Sphere { translation 453 -505 45 scale 9 9 9 diffuseColor 0 255 0 name "programs/InhDegenerate.pat" textTranslate 0 0 10 } 
TRANSFORM_Sphere { translation 416 -406 45 scale 7 7 7 diffuseColor 0 255 0 name "programs/Logic.pat" textTranslate 0 0 8 } 
TRANSFORM_Sphere { translation 470 -434 45 scale 7 7 7 diffuseColor 0 255 0 name "programs/SimilarClassesEX.pat" textTranslate 0 0 8 } 
TRANSFORM_Sphere { translation 458 -417 45 scale 7 7 7 diffuseColor 0 255 0 name "programs/SimilarClassesFA.pat" textTranslate 0 0 8 } 
TRANSFORM_Sphere { translation 440 -475 45 scale 9 9 9 diffuseColor 0 255 0 name "programs/SimilarClassesSort.pat" textTranslate 0 0 10 } 
TRANSFORM_Sphere { translation 451 -494 45 scale 9 9 9 diffuseColor 0 255 0 name "programs/SubclassKnowledge.pat" textTranslate 0 0 10 } 
TRANSFORM_Sphere { translation 433 -445 45 scale 6 6 6 diffuseColor 0 255 0 name "programs/Closure.pat" textTranslate 0 0 7 } 
TRANSFORM_Sphere { translation 47 -912 45 scale 3 3 3 diffuseColor 255 0 0 name "projects/Eclipse202a/1Relations.rsf" textTranslate 0 0 4 } 
TRANSFORM_Sphere { translation 91 -932 45 scale 3 3 3 diffuseColor 255 0 0 name "projects/JDK140AWT/1Relations.rsf" textTranslate 0 0 4 } 
TRANSFORM_Sphere { translation 65 -935 45 scale 3 3 3 diffuseColor 255 0 0 name "projects/JHotDraw52/1Relations.rsf" textTranslate 0 0 4 } 
TRANSFORM_Sphere { translation 133 -954 45 scale 3 3 3 diffuseColor 255 0 0 name "projects/JWAM16FullAndreas/1Relations.rsf" textTranslate 0 0 4 } 
TRANSFORM_Sphere { translation 105 -955 45 scale 3 3 3 diffuseColor 255 0 0 name "projects/jdk14v2/1Relations.rsf" textTranslate 0 0 4 } 
TRANSFORM_Sphere { translation 460 -366 45 scale 7 7 7 diffuseColor 0 255 0 name "programs/FunctionTest.pat" textTranslate 0 0 8 } 
TRANSFORM_Sphere { translation 324 -189 45 scale 4 4 4 diffuseColor 255 0 255 name "src/relLex-old.l" textTranslate 0 0 5 } 
TRANSFORM_Sphere { translation 435 -752 45 scale 3 3 3 diffuseColor 255 0 255 name "src/relNumber.h" textTranslate 0 0 4 } 
TRANSFORM_Sphere { translation 490 -193 45 scale 3 3 3 diffuseColor 0 0 255 name "src/main.cpp" textTranslate 0 0 4 } 
TRANSFORM_Sphere { translation 69 -55 45 scale 4 4 4 diffuseColor 0 0 255 name "src/getopt.h" textTranslate 0 0 5 } 
TRANSFORM_Sphere { translation 566 -276 45 scale 4 4 4 diffuseColor 0 255 0 name "programs/Intro_Cyclic.pat" textTranslate 0 0 5 } 
TRANSFORM_Sphere { translation 596 -305 45 scale 4 4 4 diffuseColor 0 255 0 name "programs/Intro_IO.pat" textTranslate 0 0 5 } 
TRANSFORM_Sphere { translation 556 -254 45 scale 4 4 4 diffuseColor 0 255 0 name "programs/Intro_Logic.pat" textTranslate 0 0 5 } 
TRANSFORM_Sphere { translation 591 -284 45 scale 4 4 4 diffuseColor 0 255 0 name "programs/Intro_TC-Exp.pat" textTranslate 0 0 5 } 
TRANSFORM_Sphere { translation 581 -417 45 scale 6 6 6 diffuseColor 0 255 0 name "programs/Intro_ParentOf.rsf" textTranslate 0 0 7 } 
TRANSFORM_Sphere { translation 583 -262 45 scale 4 4 4 diffuseColor 0 255 0 name "programs/Intro_TC-Warshall.pat" textTranslate 0 0 5 } 
TRANSFORM_Sphere { translation 445 -298 45 scale 6 6 6 diffuseColor 255 0 255 name "src/relExprReach.h" textTranslate 0 0 7 } 
TRANSFORM_Sphere { translation 412 -246 45 scale 4 4 4 diffuseColor 255 0 255 name "src/relStmtRead.h" textTranslate 0 0 5 } 
TRANSFORM_Sphere { translation 642 -249 45 scale 3 3 3 diffuseColor 0 255 0 name "programs/ClassesInCycles.rml" textTranslate 0 0 4 } 
TRANSFORM_Sphere { translation 697 -362 45 scale 3 3 3 diffuseColor 0 255 0 name "programs/Closure.rml" textTranslate 0 0 4 } 
TRANSFORM_Sphere { translation 710 -409 45 scale 3 3 3 diffuseColor 0 255 0 name "programs/Composite.rml" textTranslate 0 0 4 } 
TRANSFORM_Sphere { translation 706 -320 45 scale 3 3 3 diffuseColor 0 255 0 name "programs/Cycles.rml" textTranslate 0 0 4 } 
TRANSFORM_Sphere { translation 713 -383 45 scale 3 3 3 diffuseColor 0 255 0 name "programs/FunctionTest.rml" textTranslate 0 0 4 } 
TRANSFORM_Sphere { translation 662 -289 45 scale 3 3 3 diffuseColor 0 255 0 name "programs/InhDegenerate.rml" textTranslate 0 0 4 } 
TRANSFORM_Sphere { translation 638 -414 45 scale 4 4 4 diffuseColor 0 255 0 name "programs/Intro_Cyclic.rml" textTranslate 0 0 5 } 
TRANSFORM_Sphere { translation 620 -356 45 scale 4 4 4 diffuseColor 0 255 0 name "programs/Intro_IO.rml" textTranslate 0 0 5 } 
TRANSFORM_Sphere { translation 646 -434 45 scale 4 4 4 diffuseColor 0 255 0 name "programs/Intro_Logic.rml" textTranslate 0 0 5 } 
TRANSFORM_Sphere { translation 629 -377 45 scale 4 4 4 diffuseColor 0 255 0 name "programs/Intro_TC-Exp.rml" textTranslate 0 0 5 } 
TRANSFORM_Sphere { translation 644 -394 45 scale 4 4 4 diffuseColor 0 255 0 name "programs/Intro_TC-Warshall.rml" textTranslate 0 0 5 } 
TRANSFORM_Sphere { translation 665 -264 45 scale 3 3 3 diffuseColor 0 255 0 name "programs/SimilarClassesEX.rml" textTranslate 0 0 4 } 
TRANSFORM_Sphere { translation 712 -345 45 scale 3 3 3 diffuseColor 0 255 0 name "programs/SimilarClassesFA.rml" textTranslate 0 0 4 } 
TRANSFORM_Sphere { translation 679 -318 45 scale 3 3 3 diffuseColor 0 255 0 name "programs/SimilarClassesSort.rml" textTranslate 0 0 4 } 
TRANSFORM_Sphere { translation 690 -291 45 scale 3 3 3 diffuseColor 0 255 0 name "programs/SubclassKnowledge.rml" textTranslate 0 0 4 } 
TRANSFORM_Sphere { translation 703 -522 45 scale 3 3 3 diffuseColor 0 255 0 name "programs/Intro_R.rsf" textTranslate 0 0 4 } 
