<?xml version="1.0" standalone="no"?>
 
<!DOCTYPE svg PUBLIC "-//W3C//DTD SVG 1.1//EN"
  "http://www.w3.org/Graphics/SVG/1.1/DTD/svg11.dtd">
 
<!-- Generated by CCVisu, a tool for visual graph clustering 
     and general force-directed graph layout. 
     Dec 12, 2007 1:23:13 AM -->
 
<svg xmlns="http://www.w3.org/2000/svg" version="1.1"
     xmlns:xlink="http://www.w3.org/1999/xlink"
     width="100%" height="100%"
     viewBox="0 0 1000 1000">
 
 <title>Visualization D:\home\db\sfu\ccvisu\dist\examples\crocopat-2.1_annot.svg</title>
 
 <script><![CDATA[ 
     
  /* 
   * Returns the innermost SVG object that triggered the event 
   * and that has a non-null id attribute. This can be either the event's 
   * target itself, or its parent node, or the first ancestor of the target 
   * with a non-null id. 
   * 
   * Input Parameters: 
   *   evt - The JavaScript object describing the triggering event. 
   * Return Value: 
   *   The target node or first target's ancestor with a non-null id. 
   */ 
  function get_target(evt) { 
    var target = evt.target; 
    while (target && !target.getAttribute('id')) { 
      target = target.parentNode; 
    } 
    return target; 
  }  
     
  /* 
   * Adds or removes a duplicate of the text object that  
   * corresponds to the circle that was clicked on / pointed to: 
   * The circle node is the evt.target. 
   * If the text node is already there, the node gets removed. 
   * Otherwise the text node is cloned. The cloned node's id is changed. 
   * The cloned node is appended to the 'contents' group. 
   * 
   * Input Parameters: 
   *   evt -     JavaScript object describing the triggering event. 
   *   postfix - String to distinguish between click and move. 
   */ 
  function annot_toggle(evt, postfix) { 
    // Retrieve node of object that was clicked on. 
    var target = get_target(evt); 
    var svgdoc = target.ownerDocument; 
      
    // Retrieve annotation node. 
    var annotNode = svgdoc.getElementById(target.getAttribute('id') 
                                          + '__text' + postfix); 
    // Check whether annotation is already set. 
    if (annotNode) { 
      // Remove object's node from its group node. 
      var groupnode = annotNode.parentNode; 
      groupnode.removeChild (annotNode); 
    } else { 
      // Clone the text object and set its attributes. 
      var text = svgdoc.getElementById(target.getAttribute('id') + '__text'); 
      annotNode = text.cloneNode(true); 
      annotNode.setAttribute('id', target.getAttribute('id') + '__text' + postfix); 
      // Retrieve the node for 'contents' group. 
      var contents = svgdoc.getElementById('contents'); 
      // Insert the cloned object into the contents group node. 
      contents.parentNode.appendChild(annotNode); 
      window.status = target.getAttribute('id'); 
    } 
  } 
    
 ]]></script> 

 <defs>  <text id="src/config.sh__text" x="950" y="545" style="font-size:12pt;fill:#000000"> src/config.sh </text> </defs> 
 <g id="contents"> 
  <circle id="src/config.sh" cx="945" cy="542" r="2" fill="#0000ff" stroke="black" onmouseover="annot_toggle(evt, '_move')" onmouseout="annot_toggle(evt, '_move')" onclick="annot_toggle(evt, '_click')" /> 
 </g> 
 <defs>  <text id="RelExtractor/Query-new.sql__text" x="719" y="949" style="font-size:12pt;fill:#000000"> RelExtractor/Query-new.sql </text> </defs> 
 <g id="contents"> 
  <circle id="RelExtractor/Query-new.sql" cx="714" cy="946" r="2" fill="#808080" stroke="black" onmouseover="annot_toggle(evt, '_move')" onmouseout="annot_toggle(evt, '_move')" onclick="annot_toggle(evt, '_click')" /> 
 </g> 
 <defs>  <text id="RelExtractor/Java-Version/DB.java__text" x="717" y="957" style="font-size:12pt;fill:#000000"> RelExtractor/Java-Version/DB.java </text> </defs> 
 <g id="contents"> 
  <circle id="RelExtractor/Java-Version/DB.java" cx="712" cy="954" r="2" fill="#808080" stroke="black" onmouseover="annot_toggle(evt, '_move')" onmouseout="annot_toggle(evt, '_move')" onclick="annot_toggle(evt, '_click')" /> 
 </g> 
 <defs>  <text id="RelExtractor/Java-Version/RelDump.java__text" x="720" y="953" style="font-size:12pt;fill:#000000"> RelExtractor/Java-Version/RelDump.java </text> </defs> 
 <g id="contents"> 
  <circle id="RelExtractor/Java-Version/RelDump.java" cx="715" cy="950" r="2" fill="#808080" stroke="black" onmouseover="annot_toggle(evt, '_move')" onmouseout="annot_toggle(evt, '_move')" onclick="annot_toggle(evt, '_click')" /> 
 </g> 
 <defs>  <text id="RelExtractor/Query-orig.sql__text" x="723" y="948" style="font-size:12pt;fill:#000000"> RelExtractor/Query-orig.sql </text> </defs> 
 <g id="contents"> 
  <circle id="RelExtractor/Query-orig.sql" cx="718" cy="945" r="2" fill="#808080" stroke="black" onmouseover="annot_toggle(evt, '_move')" onmouseout="annot_toggle(evt, '_move')" onclick="annot_toggle(evt, '_click')" /> 
 </g> 
 <defs>  <text id="RelExtractor/Query.sql__text" x="726" y="951" style="font-size:12pt;fill:#000000"> RelExtractor/Query.sql </text> </defs> 
 <g id="contents"> 
  <circle id="RelExtractor/Query.sql" cx="721" cy="948" r="2" fill="#808080" stroke="black" onmouseover="annot_toggle(evt, '_move')" onmouseout="annot_toggle(evt, '_move')" onclick="annot_toggle(evt, '_click')" /> 
 </g> 
 <defs>  <text id="RelExtractor/RefreshFiles.sh__text" x="727" y="955" style="font-size:12pt;fill:#000000"> RelExtractor/RefreshFiles.sh </text> </defs> 
 <g id="contents"> 
  <circle id="RelExtractor/RefreshFiles.sh" cx="722" cy="952" r="2" fill="#808080" stroke="black" onmouseover="annot_toggle(evt, '_move')" onmouseout="annot_toggle(evt, '_move')" onclick="annot_toggle(evt, '_click')" /> 
 </g> 
 <defs>  <text id="src/FlexLexer.h__text" x="706" y="932" style="font-size:12pt;fill:#000000"> src/FlexLexer.h </text> </defs> 
 <g id="contents"> 
  <circle id="src/FlexLexer.h" cx="699" cy="929" r="4" fill="#0000ff" stroke="black" onmouseover="annot_toggle(evt, '_move')" onmouseout="annot_toggle(evt, '_move')" onclick="annot_toggle(evt, '_click')" /> 
 </g> 
 <defs>  <text id="src/ctaObject.cpp__text" x="803" y="878" style="font-size:12pt;fill:#000000"> src/ctaObject.cpp </text> </defs> 
 <g id="contents"> 
  <circle id="src/ctaObject.cpp" cx="796" cy="875" r="4" fill="#00ffff" stroke="black" onmouseover="annot_toggle(evt, '_move')" onmouseout="annot_toggle(evt, '_move')" onclick="annot_toggle(evt, '_click')" /> 
 </g> 
 <defs>  <text id="src/ctaObject.h__text" x="778" y="901" style="font-size:12pt;fill:#000000"> src/ctaObject.h </text> </defs> 
 <g id="contents"> 
  <circle id="src/ctaObject.h" cx="770" cy="898" r="5" fill="#00ffff" stroke="black" onmouseover="annot_toggle(evt, '_move')" onmouseout="annot_toggle(evt, '_move')" onclick="annot_toggle(evt, '_click')" /> 
 </g> 
 <defs>  <text id="src/relLex.l__text" x="601" y="425" style="font-size:12pt;fill:#000000"> src/relLex.l </text> </defs> 
 <g id="contents"> 
  <circle id="src/relLex.l" cx="584" cy="422" r="14" fill="#ff00ff" stroke="black" onmouseover="annot_toggle(evt, '_move')" onmouseout="annot_toggle(evt, '_move')" onclick="annot_toggle(evt, '_click')" /> 
 </g> 
 <defs>  <text id="src/relDataType.cpp__text" x="832" y="656" style="font-size:12pt;fill:#000000"> src/relDataType.cpp </text> </defs> 
 <g id="contents"> 
  <circle id="src/relDataType.cpp" cx="824" cy="653" r="5" fill="#ff00ff" stroke="black" onmouseover="annot_toggle(evt, '_move')" onmouseout="annot_toggle(evt, '_move')" onclick="annot_toggle(evt, '_click')" /> 
 </g> 
 <defs>  <text id="programs/bool.pat__text" x="638" y="406" style="font-size:12pt;fill:#000000"> programs/bool.pat </text> </defs> 
 <g id="contents"> 
  <circle id="programs/bool.pat" cx="633" cy="403" r="2" fill="#00ff00" stroke="black" onmouseover="annot_toggle(evt, '_move')" onmouseout="annot_toggle(evt, '_move')" onclick="annot_toggle(evt, '_click')" /> 
 </g> 
 <defs>  <text id="programs/int.pat__text" x="635" y="399" style="font-size:12pt;fill:#000000"> programs/int.pat </text> </defs> 
 <g id="contents"> 
  <circle id="programs/int.pat" cx="629" cy="396" r="3" fill="#00ff00" stroke="black" onmouseover="annot_toggle(evt, '_move')" onmouseout="annot_toggle(evt, '_move')" onclick="annot_toggle(evt, '_click')" /> 
 </g> 
 <defs>  <text id="readme-license.txt__text" x="840" y="713" style="font-size:12pt;fill:#000000"> readme-license.txt </text> </defs> 
 <g id="contents"> 
  <circle id="readme-license.txt" cx="832" cy="710" r="5" fill="#0000ff" stroke="black" onmouseover="annot_toggle(evt, '_move')" onmouseout="annot_toggle(evt, '_move')" onclick="annot_toggle(evt, '_click')" /> 
 </g> 
 <defs>  <text id="programs/test.pat__text" x="759" y="659" style="font-size:12pt;fill:#000000"> programs/test.pat </text> </defs> 
 <g id="contents"> 
  <circle id="programs/test.pat" cx="752" cy="656" r="4" fill="#00ff00" stroke="black" onmouseover="annot_toggle(evt, '_move')" onmouseout="annot_toggle(evt, '_move')" onclick="annot_toggle(evt, '_click')" /> 
 </g> 
 <defs>  <text id="src/relString.h__text" x="835" y="749" style="font-size:12pt;fill:#000000"> src/relString.h </text> </defs> 
 <g id="contents"> 
  <circle id="src/relString.h" cx="828" cy="746" r="4" fill="#ff00ff" stroke="black" onmouseover="annot_toggle(evt, '_move')" onmouseout="annot_toggle(evt, '_move')" onclick="annot_toggle(evt, '_click')" /> 
 </g> 
 <defs>  <text id="src/relNumExpr.cpp__text" x="658" y="697" style="font-size:12pt;fill:#000000"> src/relNumExpr.cpp </text> </defs> 
 <g id="contents"> 
  <circle id="src/relNumExpr.cpp" cx="647" cy="694" r="8" fill="#ff00ff" stroke="black" onmouseover="annot_toggle(evt, '_move')" onmouseout="annot_toggle(evt, '_move')" onclick="annot_toggle(evt, '_click')" /> 
 </g> 
 <defs>  <text id="license_lgpl.txt__text" x="617" y="701" style="font-size:12pt;fill:#000000"> license_lgpl.txt </text> </defs> 
 <g id="contents"> 
  <circle id="license_lgpl.txt" cx="612" cy="698" r="2" fill="#0000ff" stroke="black" onmouseover="annot_toggle(evt, '_move')" onmouseout="annot_toggle(evt, '_move')" onclick="annot_toggle(evt, '_click')" /> 
 </g> 
 <defs>  <text id="src/relYacc.output__text" x="848" y="502" style="font-size:12pt;fill:#000000"> src/relYacc.output </text> </defs> 
 <g id="contents"> 
  <circle id="src/relYacc.output" cx="843" cy="499" r="2" fill="#ff00ff" stroke="black" onmouseover="annot_toggle(evt, '_move')" onmouseout="annot_toggle(evt, '_move')" onclick="annot_toggle(evt, '_click')" /> 
 </g> 
 <defs>  <text id="src/relYacc.tab.cpp.output__text" x="849" y="508" style="font-size:12pt;fill:#000000"> src/relYacc.tab.cpp.output </text> </defs> 
 <g id="contents"> 
  <circle id="src/relYacc.tab.cpp.output" cx="842" cy="505" r="4" fill="#ff00ff" stroke="black" onmouseover="annot_toggle(evt, '_move')" onmouseout="annot_toggle(evt, '_move')" onclick="annot_toggle(evt, '_click')" /> 
 </g> 
 <defs>  <text id="programs/ClassesInCycles.pat__text" x="103" y="673" style="font-size:12pt;fill:#000000"> programs/ClassesInCycles.pat </text> </defs> 
 <g id="contents"> 
  <circle id="programs/ClassesInCycles.pat" cx="94" cy="670" r="6" fill="#00ff00" stroke="black" onmouseover="annot_toggle(evt, '_move')" onmouseout="annot_toggle(evt, '_move')" onclick="annot_toggle(evt, '_click')" /> 
 </g> 
 <defs>  <text id="programs/Composite.pat__text" x="66" y="657" style="font-size:12pt;fill:#000000"> programs/Composite.pat </text> </defs> 
 <g id="contents"> 
  <circle id="programs/Composite.pat" cx="57" cy="654" r="6" fill="#00ff00" stroke="black" onmouseover="annot_toggle(evt, '_move')" onmouseout="annot_toggle(evt, '_move')" onclick="annot_toggle(evt, '_click')" /> 
 </g> 
 <defs>  <text id="programs/InhDegenerate.pat__text" x="70" y="678" style="font-size:12pt;fill:#000000"> programs/InhDegenerate.pat </text> </defs> 
 <g id="contents"> 
  <circle id="programs/InhDegenerate.pat" cx="61" cy="675" r="6" fill="#00ff00" stroke="black" onmouseover="annot_toggle(evt, '_move')" onmouseout="annot_toggle(evt, '_move')" onclick="annot_toggle(evt, '_click')" /> 
 </g> 
 <defs>  <text id="programs/Logic.pat__text" x="77" y="625" style="font-size:12pt;fill:#000000"> programs/Logic.pat </text> </defs> 
 <g id="contents"> 
  <circle id="programs/Logic.pat" cx="69" cy="622" r="5" fill="#00ff00" stroke="black" onmouseover="annot_toggle(evt, '_move')" onmouseout="annot_toggle(evt, '_move')" onclick="annot_toggle(evt, '_click')" /> 
 </g> 
 <defs>  <text id="programs/SimilarClassesEX.pat__text" x="52" y="641" style="font-size:12pt;fill:#000000"> programs/SimilarClassesEX.pat </text> </defs> 
 <g id="contents"> 
  <circle id="programs/SimilarClassesEX.pat" cx="45" cy="638" r="4" fill="#00ff00" stroke="black" onmouseover="annot_toggle(evt, '_move')" onmouseout="annot_toggle(evt, '_move')" onclick="annot_toggle(evt, '_click')" /> 
 </g> 
 <defs>  <text id="programs/SimilarClassesFA.pat__text" x="56" y="627" style="font-size:12pt;fill:#000000"> programs/SimilarClassesFA.pat </text> </defs> 
 <g id="contents"> 
  <circle id="programs/SimilarClassesFA.pat" cx="49" cy="624" r="4" fill="#00ff00" stroke="black" onmouseover="annot_toggle(evt, '_move')" onmouseout="annot_toggle(evt, '_move')" onclick="annot_toggle(evt, '_click')" /> 
 </g> 
 <defs>  <text id="projects/JDK140AWT/1Relations.rsf__text" x="667" y="261" style="font-size:12pt;fill:#000000"> projects/JDK140AWT/1Relations.rsf </text> </defs> 
 <g id="contents"> 
  <circle id="projects/JDK140AWT/1Relations.rsf" cx="662" cy="258" r="2" fill="#ff0000" stroke="black" onmouseover="annot_toggle(evt, '_move')" onmouseout="annot_toggle(evt, '_move')" onclick="annot_toggle(evt, '_click')" /> 
 </g> 
 <defs>  <text id="projects/JHotDraw52/1Relations.rsf__text" x="668" y="262" style="font-size:12pt;fill:#000000"> projects/JHotDraw52/1Relations.rsf </text> </defs> 
 <g id="contents"> 
  <circle id="projects/JHotDraw52/1Relations.rsf" cx="663" cy="259" r="2" fill="#ff0000" stroke="black" onmouseover="annot_toggle(evt, '_move')" onmouseout="annot_toggle(evt, '_move')" onclick="annot_toggle(evt, '_click')" /> 
 </g> 
 <defs>  <text id="projects/JWAM16FullAndreas/1Relations.rsf__text" x="667" y="260" style="font-size:12pt;fill:#000000"> projects/JWAM16FullAndreas/1Relations.rsf </text> </defs> 
 <g id="contents"> 
  <circle id="projects/JWAM16FullAndreas/1Relations.rsf" cx="662" cy="257" r="2" fill="#ff0000" stroke="black" onmouseover="annot_toggle(evt, '_move')" onmouseout="annot_toggle(evt, '_move')" onclick="annot_toggle(evt, '_click')" /> 
 </g> 
 <defs>  <text id="projects/jdk14v2/1Relations.rsf__text" x="668" y="259" style="font-size:12pt;fill:#000000"> projects/jdk14v2/1Relations.rsf </text> </defs> 
 <g id="contents"> 
  <circle id="projects/jdk14v2/1Relations.rsf" cx="663" cy="256" r="2" fill="#ff0000" stroke="black" onmouseover="annot_toggle(evt, '_move')" onmouseout="annot_toggle(evt, '_move')" onclick="annot_toggle(evt, '_click')" /> 
 </g> 
 <defs>  <text id="src/relLex-old.l__text" x="490" y="315" style="font-size:12pt;fill:#000000"> src/relLex-old.l </text> </defs> 
 <g id="contents"> 
  <circle id="src/relLex-old.l" cx="485" cy="312" r="2" fill="#ff00ff" stroke="black" onmouseover="annot_toggle(evt, '_move')" onmouseout="annot_toggle(evt, '_move')" onclick="annot_toggle(evt, '_click')" /> 
 </g> 
 <defs>  <text id="src/relNumber.h__text" x="724" y="488" style="font-size:12pt;fill:#000000"> src/relNumber.h </text> </defs> 
 <g id="contents"> 
  <circle id="src/relNumber.h" cx="719" cy="485" r="2" fill="#ff00ff" stroke="black" onmouseover="annot_toggle(evt, '_move')" onmouseout="annot_toggle(evt, '_move')" onclick="annot_toggle(evt, '_click')" /> 
 </g> 
 <defs>  <text id="src/getopt.h__text" x="363" y="554" style="font-size:12pt;fill:#000000"> src/getopt.h </text> </defs> 
 <g id="contents"> 
  <circle id="src/getopt.h" cx="358" cy="551" r="2" fill="#0000ff" stroke="black" onmouseover="annot_toggle(evt, '_move')" onmouseout="annot_toggle(evt, '_move')" onclick="annot_toggle(evt, '_click')" /> 
 </g> 
 <defs>  <text id="programs/Intro_Cyclic.pat__text" x="139" y="374" style="font-size:12pt;fill:#000000"> programs/Intro_Cyclic.pat </text> </defs> 
 <g id="contents"> 
  <circle id="programs/Intro_Cyclic.pat" cx="134" cy="371" r="2" fill="#00ff00" stroke="black" onmouseover="annot_toggle(evt, '_move')" onmouseout="annot_toggle(evt, '_move')" onclick="annot_toggle(evt, '_click')" /> 
 </g> 
 <defs>  <text id="programs/Intro_IO.pat__text" x="137" y="376" style="font-size:12pt;fill:#000000"> programs/Intro_IO.pat </text> </defs> 
 <g id="contents"> 
  <circle id="programs/Intro_IO.pat" cx="132" cy="373" r="2" fill="#00ff00" stroke="black" onmouseover="annot_toggle(evt, '_move')" onmouseout="annot_toggle(evt, '_move')" onclick="annot_toggle(evt, '_click')" /> 
 </g> 
 <defs>  <text id="programs/Intro_Logic.pat__text" x="134" y="376" style="font-size:12pt;fill:#000000"> programs/Intro_Logic.pat </text> </defs> 
 <g id="contents"> 
  <circle id="programs/Intro_Logic.pat" cx="129" cy="373" r="2" fill="#00ff00" stroke="black" onmouseover="annot_toggle(evt, '_move')" onmouseout="annot_toggle(evt, '_move')" onclick="annot_toggle(evt, '_click')" /> 
 </g> 
 <defs>  <text id="programs/Intro_TC-Exp.pat__text" x="140" y="379" style="font-size:12pt;fill:#000000"> programs/Intro_TC-Exp.pat </text> </defs> 
 <g id="contents"> 
  <circle id="programs/Intro_TC-Exp.pat" cx="135" cy="376" r="2" fill="#00ff00" stroke="black" onmouseover="annot_toggle(evt, '_move')" onmouseout="annot_toggle(evt, '_move')" onclick="annot_toggle(evt, '_click')" /> 
 </g> 
 <defs>  <text id="programs/Intro_ParentOf.rsf__text" x="217" y="316" style="font-size:12pt;fill:#000000"> programs/Intro_ParentOf.rsf </text> </defs> 
 <g id="contents"> 
  <circle id="programs/Intro_ParentOf.rsf" cx="210" cy="313" r="4" fill="#00ff00" stroke="black" onmouseover="annot_toggle(evt, '_move')" onmouseout="annot_toggle(evt, '_move')" onclick="annot_toggle(evt, '_click')" /> 
 </g> 
 <defs>  <text id="programs/Intro_TC-Warshall.pat__text" x="136" y="381" style="font-size:12pt;fill:#000000"> programs/Intro_TC-Warshall.pat </text> </defs> 
 <g id="contents"> 
  <circle id="programs/Intro_TC-Warshall.pat" cx="131" cy="378" r="2" fill="#00ff00" stroke="black" onmouseover="annot_toggle(evt, '_move')" onmouseout="annot_toggle(evt, '_move')" onclick="annot_toggle(evt, '_click')" /> 
 </g> 
 <defs>  <text id="src/relExprReach.h__text" x="516" y="257" style="font-size:12pt;fill:#000000"> src/relExprReach.h </text> </defs> 
 <g id="contents"> 
  <circle id="src/relExprReach.h" cx="509" cy="254" r="4" fill="#ff00ff" stroke="black" onmouseover="annot_toggle(evt, '_move')" onmouseout="annot_toggle(evt, '_move')" onclick="annot_toggle(evt, '_click')" /> 
 </g> 
 <defs>  <text id="src/relStmtRead.h__text" x="540" y="262" style="font-size:12pt;fill:#000000"> src/relStmtRead.h </text> </defs> 
 <g id="contents"> 
  <circle id="src/relStmtRead.h" cx="535" cy="259" r="2" fill="#ff00ff" stroke="black" onmouseover="annot_toggle(evt, '_move')" onmouseout="annot_toggle(evt, '_move')" onclick="annot_toggle(evt, '_click')" /> 
 </g> 
 <defs>  <text id="programs/ClassesInCycles.rml__text" x="156" y="405" style="font-size:12pt;fill:#000000"> programs/ClassesInCycles.rml </text> </defs> 
 <g id="contents"> 
  <circle id="programs/ClassesInCycles.rml" cx="151" cy="402" r="2" fill="#00ff00" stroke="black" onmouseover="annot_toggle(evt, '_move')" onmouseout="annot_toggle(evt, '_move')" onclick="annot_toggle(evt, '_click')" /> 
 </g> 
 <defs>  <text id="programs/Closure.rml__text" x="153" y="409" style="font-size:12pt;fill:#000000"> programs/Closure.rml </text> </defs> 
 <g id="contents"> 
  <circle id="programs/Closure.rml" cx="148" cy="406" r="2" fill="#00ff00" stroke="black" onmouseover="annot_toggle(evt, '_move')" onmouseout="annot_toggle(evt, '_move')" onclick="annot_toggle(evt, '_click')" /> 
 </g> 
 <defs>  <text id="programs/Composite.rml__text" x="153" y="403" style="font-size:12pt;fill:#000000"> programs/Composite.rml </text> </defs> 
 <g id="contents"> 
  <circle id="programs/Composite.rml" cx="148" cy="400" r="2" fill="#00ff00" stroke="black" onmouseover="annot_toggle(evt, '_move')" onmouseout="annot_toggle(evt, '_move')" onclick="annot_toggle(evt, '_click')" /> 
 </g> 
 <defs>  <text id="programs/Cycles.rml__text" x="152" y="405" style="font-size:12pt;fill:#000000"> programs/Cycles.rml </text> </defs> 
 <g id="contents"> 
  <circle id="programs/Cycles.rml" cx="147" cy="402" r="2" fill="#00ff00" stroke="black" onmouseover="annot_toggle(evt, '_move')" onmouseout="annot_toggle(evt, '_move')" onclick="annot_toggle(evt, '_click')" /> 
 </g> 
 <defs>  <text id="programs/FunctionTest.rml__text" x="151" y="408" style="font-size:12pt;fill:#000000"> programs/FunctionTest.rml </text> </defs> 
 <g id="contents"> 
  <circle id="programs/FunctionTest.rml" cx="146" cy="405" r="2" fill="#00ff00" stroke="black" onmouseover="annot_toggle(evt, '_move')" onmouseout="annot_toggle(evt, '_move')" onclick="annot_toggle(evt, '_click')" /> 
 </g> 
 <defs>  <text id="programs/Intro_Cyclic.rml__text" x="187" y="346" style="font-size:12pt;fill:#000000"> programs/Intro_Cyclic.rml </text> </defs> 
 <g id="contents"> 
  <circle id="programs/Intro_Cyclic.rml" cx="182" cy="343" r="2" fill="#00ff00" stroke="black" onmouseover="annot_toggle(evt, '_move')" onmouseout="annot_toggle(evt, '_move')" onclick="annot_toggle(evt, '_click')" /> 
 </g> 
 <defs>  <text id="programs/Intro_IO.rml__text" x="189" y="349" style="font-size:12pt;fill:#000000"> programs/Intro_IO.rml </text> </defs> 
 <g id="contents"> 
  <circle id="programs/Intro_IO.rml" cx="184" cy="346" r="2" fill="#00ff00" stroke="black" onmouseover="annot_toggle(evt, '_move')" onmouseout="annot_toggle(evt, '_move')" onclick="annot_toggle(evt, '_click')" /> 
 </g> 
 <defs>  <text id="programs/Intro_Logic.rml__text" x="183" y="349" style="font-size:12pt;fill:#000000"> programs/Intro_Logic.rml </text> </defs> 
 <g id="contents"> 
  <circle id="programs/Intro_Logic.rml" cx="178" cy="346" r="2" fill="#00ff00" stroke="black" onmouseover="annot_toggle(evt, '_move')" onmouseout="annot_toggle(evt, '_move')" onclick="annot_toggle(evt, '_click')" /> 
 </g> 
 <defs>  <text id="programs/Intro_TC-Exp.rml__text" x="185" y="354" style="font-size:12pt;fill:#000000"> programs/Intro_TC-Exp.rml </text> </defs> 
 <g id="contents"> 
  <circle id="programs/Intro_TC-Exp.rml" cx="180" cy="351" r="2" fill="#00ff00" stroke="black" onmouseover="annot_toggle(evt, '_move')" onmouseout="annot_toggle(evt, '_move')" onclick="annot_toggle(evt, '_click')" /> 
 </g> 
 <defs>  <text id="programs/SimilarClassesEX.rml__text" x="149" y="410" style="font-size:12pt;fill:#000000"> programs/SimilarClassesEX.rml </text> </defs> 
 <g id="contents"> 
  <circle id="programs/SimilarClassesEX.rml" cx="144" cy="407" r="2" fill="#00ff00" stroke="black" onmouseover="annot_toggle(evt, '_move')" onmouseout="annot_toggle(evt, '_move')" onclick="annot_toggle(evt, '_click')" /> 
 </g> 
 <defs>  <text id="programs/SimilarClassesFA.rml__text" x="154" y="406" style="font-size:12pt;fill:#000000"> programs/SimilarClassesFA.rml </text> </defs> 
 <g id="contents"> 
  <circle id="programs/SimilarClassesFA.rml" cx="149" cy="403" r="2" fill="#00ff00" stroke="black" onmouseover="annot_toggle(evt, '_move')" onmouseout="annot_toggle(evt, '_move')" onclick="annot_toggle(evt, '_click')" /> 
 </g> 
 <defs>  <text id="programs/SimilarClassesSort.rml__text" x="152" y="411" style="font-size:12pt;fill:#000000"> programs/SimilarClassesSort.rml </text> </defs> 
 <g id="contents"> 
  <circle id="programs/SimilarClassesSort.rml" cx="147" cy="408" r="2" fill="#00ff00" stroke="black" onmouseover="annot_toggle(evt, '_move')" onmouseout="annot_toggle(evt, '_move')" onclick="annot_toggle(evt, '_click')" /> 
 </g> 
 <defs>  <text id="programs/SubclassKnowledge.rml__text" x="155" y="411" style="font-size:12pt;fill:#000000"> programs/SubclassKnowledge.rml </text> </defs> 
 <g id="contents"> 
  <circle id="programs/SubclassKnowledge.rml" cx="150" cy="408" r="2" fill="#00ff00" stroke="black" onmouseover="annot_toggle(evt, '_move')" onmouseout="annot_toggle(evt, '_move')" onclick="annot_toggle(evt, '_click')" /> 
 </g> 
 <defs>  <text id="programs/Intro_R.rsf__text" x="225" y="315" style="font-size:12pt;fill:#000000"> programs/Intro_R.rsf </text> </defs> 
 <g id="contents"> 
  <circle id="programs/Intro_R.rsf" cx="220" cy="312" r="2" fill="#00ff00" stroke="black" onmouseover="annot_toggle(evt, '_move')" onmouseout="annot_toggle(evt, '_move')" onclick="annot_toggle(evt, '_click')" /> 
 </g> 
 <defs>  <text id="src/Makefile__text" x="780" y="357" style="font-size:12pt;fill:#000000"> src/Makefile </text> </defs> 
 <g id="contents"> 
  <circle id="src/Makefile" cx="766" cy="354" r="11" fill="#0000ff" stroke="black" onmouseover="annot_toggle(evt, '_move')" onmouseout="annot_toggle(evt, '_move')" onclick="annot_toggle(evt, '_click')" /> 
  <text id="src/Makefile__text_click" x="780" y="357" style="font-size:12pt;fill:#000000"> src/Makefile </text> 
 </g> 
 <defs>  <text id="src/config.txt__text" x="948" y="548" style="font-size:12pt;fill:#000000"> src/config.txt </text> </defs> 
 <g id="contents"> 
  <circle id="src/config.txt" cx="941" cy="545" r="4" fill="#0000ff" stroke="black" onmouseover="annot_toggle(evt, '_move')" onmouseout="annot_toggle(evt, '_move')" onclick="annot_toggle(evt, '_click')" /> 
  <text id="src/config.txt__text_click" x="948" y="548" style="font-size:12pt;fill:#000000"> src/config.txt </text> 
 </g> 
 <defs>  <text id="run-wcre.sh__text" x="283" y="774" style="font-size:12pt;fill:#000000"> run-wcre.sh </text> </defs> 
 <g id="contents"> 
  <circle id="run-wcre.sh" cx="272" cy="771" r="8" fill="#0000ff" stroke="black" onmouseover="annot_toggle(evt, '_move')" onmouseout="annot_toggle(evt, '_move')" onclick="annot_toggle(evt, '_click')" /> 
  <text id="run-wcre.sh__text_click" x="283" y="774" style="font-size:12pt;fill:#000000"> run-wcre.sh </text> 
 </g> 
 <defs>  <text id="RelExtractor/Refresh.sql__text" x="722" y="958" style="font-size:12pt;fill:#000000"> RelExtractor/Refresh.sql </text> </defs> 
 <g id="contents"> 
  <circle id="RelExtractor/Refresh.sql" cx="717" cy="955" r="2" fill="#808080" stroke="black" onmouseover="annot_toggle(evt, '_move')" onmouseout="annot_toggle(evt, '_move')" onclick="annot_toggle(evt, '_click')" /> 
  <text id="RelExtractor/Refresh.sql__text_click" x="722" y="958" style="font-size:12pt;fill:#000000"> RelExtractor/Refresh.sql </text> 
 </g> 
 <defs>  <text id="src/bddBdd.cpp__text" x="724" y="826" style="font-size:12pt;fill:#000000"> src/bddBdd.cpp </text> </defs> 
 <g id="contents"> 
  <circle id="src/bddBdd.cpp" cx="713" cy="823" r="8" fill="#00ffff" stroke="black" onmouseover="annot_toggle(evt, '_move')" onmouseout="annot_toggle(evt, '_move')" onclick="annot_toggle(evt, '_click')" /> 
  <text id="src/bddBdd.cpp__text_click" x="724" y="826" style="font-size:12pt;fill:#000000"> src/bddBdd.cpp </text> 
 </g> 
 <defs>  <text id="src/bddBdd.h__text" x="742" y="847" style="font-size:12pt;fill:#000000"> src/bddBdd.h </text> </defs> 
 <g id="contents"> 
  <circle id="src/bddBdd.h" cx="731" cy="844" r="8" fill="#00ffff" stroke="black" onmouseover="annot_toggle(evt, '_move')" onmouseout="annot_toggle(evt, '_move')" onclick="annot_toggle(evt, '_click')" /> 
  <text id="src/bddBdd.h__text_click" x="742" y="847" style="font-size:12pt;fill:#000000"> src/bddBdd.h </text> 
 </g> 
 <defs>  <text id="src/bddRelation.cpp__text" x="620" y="861" style="font-size:12pt;fill:#000000"> src/bddRelation.cpp </text> </defs> 
 <g id="contents"> 
  <circle id="src/bddRelation.cpp" cx="609" cy="858" r="8" fill="#00ffff" stroke="black" onmouseover="annot_toggle(evt, '_move')" onmouseout="annot_toggle(evt, '_move')" onclick="annot_toggle(evt, '_click')" /> 
  <text id="src/bddRelation.cpp__text_click" x="620" y="861" style="font-size:12pt;fill:#000000"> src/bddRelation.cpp </text> 
 </g> 
 <defs>  <text id="src/bddRelation.h__text" x="650" y="798" style="font-size:12pt;fill:#000000"> src/bddRelation.h </text> </defs> 
 <g id="contents"> 
  <circle id="src/bddRelation.h" cx="636" cy="795" r="11" fill="#00ffff" stroke="black" onmouseover="annot_toggle(evt, '_move')" onmouseout="annot_toggle(evt, '_move')" onclick="annot_toggle(evt, '_click')" /> 
  <text id="src/bddRelation.h__text_click" x="650" y="798" style="font-size:12pt;fill:#000000"> src/bddRelation.h </text> 
 </g> 
 <defs>  <text id="src/bddSymTab.cpp__text" x="748" y="883" style="font-size:12pt;fill:#000000"> src/bddSymTab.cpp </text> </defs> 
 <g id="contents"> 
  <circle id="src/bddSymTab.cpp" cx="739" cy="880" r="6" fill="#00ffff" stroke="black" onmouseover="annot_toggle(evt, '_move')" onmouseout="annot_toggle(evt, '_move')" onclick="annot_toggle(evt, '_click')" /> 
  <text id="src/bddSymTab.cpp__text_click" x="748" y="883" style="font-size:12pt;fill:#000000"> src/bddSymTab.cpp </text> 
 </g> 
 <defs>  <text id="src/bddSymTab.h__text" x="536" y="819" style="font-size:12pt;fill:#000000"> src/bddSymTab.h </text> </defs> 
 <g id="contents"> 
  <circle id="src/bddSymTab.h" cx="522" cy="816" r="11" fill="#00ffff" stroke="black" onmouseover="annot_toggle(evt, '_move')" onmouseout="annot_toggle(evt, '_move')" onclick="annot_toggle(evt, '_click')" /> 
  <text id="src/bddSymTab.h__text_click" x="536" y="819" style="font-size:12pt;fill:#000000"> src/bddSymTab.h </text> 
 </g> 
 <defs>  <text id="src/crocopat.cpp__text" x="487" y="375" style="font-size:12pt;fill:#000000"> src/crocopat.cpp </text> </defs> 
 <g id="contents"> 
  <circle id="src/crocopat.cpp" cx="466" cy="372" r="18" fill="#0000ff" stroke="black" onmouseover="annot_toggle(evt, '_move')" onmouseout="annot_toggle(evt, '_move')" onclick="annot_toggle(evt, '_click')" /> 
  <text id="src/crocopat.cpp__text_click" x="487" y="375" style="font-size:12pt;fill:#000000"> src/crocopat.cpp </text> 
 </g> 
 <defs>  <text id="src/dependencies__text" x="782" y="452" style="font-size:12pt;fill:#000000"> src/dependencies </text> </defs> 
 <g id="contents"> 
  <circle id="src/dependencies" cx="771" cy="449" r="8" fill="#0000ff" stroke="black" onmouseover="annot_toggle(evt, '_move')" onmouseout="annot_toggle(evt, '_move')" onclick="annot_toggle(evt, '_click')" /> 
  <text id="src/dependencies__text_click" x="782" y="452" style="font-size:12pt;fill:#000000"> src/dependencies </text> 
 </g> 
 <defs>  <text id="src/relExpression.h__text" x="546" y="605" style="font-size:12pt;fill:#000000"> src/relExpression.h </text> </defs> 
 <g id="contents"> 
  <circle id="src/relExpression.h" cx="528" cy="602" r="15" fill="#ff00ff" stroke="black" onmouseover="annot_toggle(evt, '_move')" onmouseout="annot_toggle(evt, '_move')" onclick="annot_toggle(evt, '_click')" /> 
  <text id="src/relExpression.h__text_click" x="546" y="605" style="font-size:12pt;fill:#000000"> src/relExpression.h </text> 
 </g> 
 <defs>  <text id="src/relStatement.h__text" x="523" y="690" style="font-size:12pt;fill:#000000"> src/relStatement.h </text> </defs> 
 <g id="contents"> 
  <circle id="src/relStatement.h" cx="506" cy="687" r="14" fill="#ff00ff" stroke="black" onmouseover="annot_toggle(evt, '_move')" onmouseout="annot_toggle(evt, '_move')" onclick="annot_toggle(evt, '_click')" /> 
  <text id="src/relStatement.h__text_click" x="523" y="690" style="font-size:12pt;fill:#000000"> src/relStatement.h </text> 
 </g> 
 <defs>  <text id="src/relYacc.y__text" x="466" y="524" style="font-size:12pt;fill:#000000"> src/relYacc.y </text> </defs> 
 <g id="contents"> 
  <circle id="src/relYacc.y" cx="448" cy="521" r="15" fill="#ff00ff" stroke="black" onmouseover="annot_toggle(evt, '_move')" onmouseout="annot_toggle(evt, '_move')" onclick="annot_toggle(evt, '_click')" /> 
  <text id="src/relYacc.y__text_click" x="466" y="524" style="font-size:12pt;fill:#000000"> src/relYacc.y </text> 
 </g> 
 <defs>  <text id="src/reprNUMBER.h__text" x="822" y="837" style="font-size:12pt;fill:#000000"> src/reprNUMBER.h </text> </defs> 
 <g id="contents"> 
  <circle id="src/reprNUMBER.h" cx="815" cy="834" r="4" fill="#00ffff" stroke="black" onmouseover="annot_toggle(evt, '_move')" onmouseout="annot_toggle(evt, '_move')" onclick="annot_toggle(evt, '_click')" /> 
  <text id="src/reprNUMBER.h__text_click" x="822" y="837" style="font-size:12pt;fill:#000000"> src/reprNUMBER.h </text> 
 </g> 
 <defs>  <text id="syntax.txt__text" x="343" y="790" style="font-size:12pt;fill:#000000"> syntax.txt </text> </defs> 
 <g id="contents"> 
  <circle id="syntax.txt" cx="332" cy="787" r="8" fill="#0000ff" stroke="black" onmouseover="annot_toggle(evt, '_move')" onmouseout="annot_toggle(evt, '_move')" onclick="annot_toggle(evt, '_click')" /> 
  <text id="syntax.txt__text_click" x="343" y="790" style="font-size:12pt;fill:#000000"> syntax.txt </text> 
 </g> 
 <defs>  <text id="src/relDataType.h__text" x="811" y="586" style="font-size:12pt;fill:#000000"> src/relDataType.h </text> </defs> 
 <g id="contents"> 
  <circle id="src/relDataType.h" cx="802" cy="583" r="6" fill="#ff00ff" stroke="black" onmouseover="annot_toggle(evt, '_move')" onmouseout="annot_toggle(evt, '_move')" onclick="annot_toggle(evt, '_click')" /> 
  <text id="src/relDataType.h__text_click" x="811" y="586" style="font-size:12pt;fill:#000000"> src/relDataType.h </text> 
 </g> 
 <defs>  <text id="src/relInteger.h__text" x="855" y="670" style="font-size:12pt;fill:#000000"> src/relInteger.h </text> </defs> 
 <g id="contents"> 
  <circle id="src/relInteger.h" cx="848" cy="667" r="4" fill="#ff00ff" stroke="black" onmouseover="annot_toggle(evt, '_move')" onmouseout="annot_toggle(evt, '_move')" onclick="annot_toggle(evt, '_click')" /> 
  <text id="src/relInteger.h__text_click" x="855" y="670" style="font-size:12pt;fill:#000000"> src/relInteger.h </text> 
 </g> 
 <defs>  <text id="src/relNumExpr.h__text" x="671" y="621" style="font-size:12pt;fill:#000000"> src/relNumExpr.h </text> </defs> 
 <g id="contents"> 
  <circle id="src/relNumExpr.h" cx="659" cy="618" r="9" fill="#ff00ff" stroke="black" onmouseover="annot_toggle(evt, '_move')" onmouseout="annot_toggle(evt, '_move')" onclick="annot_toggle(evt, '_click')" /> 
  <text id="src/relNumExpr.h__text_click" x="671" y="621" style="font-size:12pt;fill:#000000"> src/relNumExpr.h </text> 
 </g> 
 <defs>  <text id="src/relStrExpr.h__text" x="732" y="606" style="font-size:12pt;fill:#000000"> src/relStrExpr.h </text> </defs> 
 <g id="contents"> 
  <circle id="src/relStrExpr.h" cx="721" cy="603" r="8" fill="#ff00ff" stroke="black" onmouseover="annot_toggle(evt, '_move')" onmouseout="annot_toggle(evt, '_move')" onclick="annot_toggle(evt, '_click')" /> 
  <text id="src/relStrExpr.h__text_click" x="732" y="606" style="font-size:12pt;fill:#000000"> src/relStrExpr.h </text> 
 </g> 
 <defs>  <text id="src/relTerm.h__text" x="720" y="703" style="font-size:12pt;fill:#000000"> src/relTerm.h </text> </defs> 
 <g id="contents"> 
  <circle id="src/relTerm.h" cx="710" cy="700" r="7" fill="#ff00ff" stroke="black" onmouseover="annot_toggle(evt, '_move')" onmouseout="annot_toggle(evt, '_move')" onclick="annot_toggle(evt, '_click')" /> 
  <text id="src/relTerm.h__text_click" x="720" y="703" style="font-size:12pt;fill:#000000"> src/relTerm.h </text> 
 </g> 
 <defs>  <text id="programs/Cycles.pat__text" x="123" y="658" style="font-size:12pt;fill:#000000"> programs/Cycles.pat </text> </defs> 
 <g id="contents"> 
  <circle id="programs/Cycles.pat" cx="114" cy="655" r="6" fill="#00ff00" stroke="black" onmouseover="annot_toggle(evt, '_move')" onmouseout="annot_toggle(evt, '_move')" onclick="annot_toggle(evt, '_click')" /> 
  <text id="programs/Cycles.pat__text_click" x="123" y="658" style="font-size:12pt;fill:#000000"> programs/Cycles.pat </text> 
 </g> 
 <defs>  <text id="programs/SimilarClassesSort.pat__text" x="96" y="644" style="font-size:12pt;fill:#000000"> programs/SimilarClassesSort.pat </text> </defs> 
 <g id="contents"> 
  <circle id="programs/SimilarClassesSort.pat" cx="87" cy="641" r="6" fill="#00ff00" stroke="black" onmouseover="annot_toggle(evt, '_move')" onmouseout="annot_toggle(evt, '_move')" onclick="annot_toggle(evt, '_click')" /> 
  <text id="programs/SimilarClassesSort.pat__text_click" x="96" y="644" style="font-size:12pt;fill:#000000"> programs/SimilarClassesSort.pat </text> 
 </g> 
 <defs>  <text id="programs/SubclassKnowledge.pat__text" x="90" y="682" style="font-size:12pt;fill:#000000"> programs/SubclassKnowledge.pat </text> </defs> 
 <g id="contents"> 
  <circle id="programs/SubclassKnowledge.pat" cx="81" cy="679" r="6" fill="#00ff00" stroke="black" onmouseover="annot_toggle(evt, '_move')" onmouseout="annot_toggle(evt, '_move')" onclick="annot_toggle(evt, '_click')" /> 
  <text id="programs/SubclassKnowledge.pat__text_click" x="90" y="682" style="font-size:12pt;fill:#000000"> programs/SubclassKnowledge.pat </text> 
 </g> 
 <defs>  <text id="programs/Closure.pat__text" x="215" y="668" style="font-size:12pt;fill:#000000"> programs/Closure.pat </text> </defs> 
 <g id="contents"> 
  <circle id="programs/Closure.pat" cx="208" cy="665" r="4" fill="#00ff00" stroke="black" onmouseover="annot_toggle(evt, '_move')" onmouseout="annot_toggle(evt, '_move')" onclick="annot_toggle(evt, '_click')" /> 
  <text id="programs/Closure.pat__text_click" x="215" y="668" style="font-size:12pt;fill:#000000"> programs/Closure.pat </text> 
 </g> 
 <defs>  <text id="projects/Eclipse202a/1Relations.rsf__text" x="669" y="262" style="font-size:12pt;fill:#000000"> projects/Eclipse202a/1Relations.rsf </text> </defs> 
 <g id="contents"> 
  <circle id="projects/Eclipse202a/1Relations.rsf" cx="664" cy="259" r="2" fill="#ff0000" stroke="black" onmouseover="annot_toggle(evt, '_move')" onmouseout="annot_toggle(evt, '_move')" onclick="annot_toggle(evt, '_click')" /> 
  <text id="projects/Eclipse202a/1Relations.rsf__text_click" x="669" y="262" style="font-size:12pt;fill:#000000"> projects/Eclipse202a/1Relations.rsf </text> 
 </g> 
 <defs>  <text id="programs/FunctionTest.pat__text" x="82" y="591" style="font-size:12pt;fill:#000000"> programs/FunctionTest.pat </text> </defs> 
 <g id="contents"> 
  <circle id="programs/FunctionTest.pat" cx="75" cy="588" r="4" fill="#00ff00" stroke="black" onmouseover="annot_toggle(evt, '_move')" onmouseout="annot_toggle(evt, '_move')" onclick="annot_toggle(evt, '_click')" /> 
  <text id="programs/FunctionTest.pat__text_click" x="82" y="591" style="font-size:12pt;fill:#000000"> programs/FunctionTest.pat </text> 
 </g> 
 <defs>  <text id="src/main.cpp__text" x="772" y="320" style="font-size:12pt;fill:#000000"> src/main.cpp </text> </defs> 
 <g id="contents"> 
  <circle id="src/main.cpp" cx="767" cy="317" r="2" fill="#0000ff" stroke="black" onmouseover="annot_toggle(evt, '_move')" onmouseout="annot_toggle(evt, '_move')" onclick="annot_toggle(evt, '_click')" /> 
  <text id="src/main.cpp__text_click" x="772" y="320" style="font-size:12pt;fill:#000000"> src/main.cpp </text> 
 </g> 
 <defs>  <text id="programs/InhDegenerate.rml__text" x="157" y="408" style="font-size:12pt;fill:#000000"> programs/InhDegenerate.rml </text> </defs> 
 <g id="contents"> 
  <circle id="programs/InhDegenerate.rml" cx="152" cy="405" r="2" fill="#00ff00" stroke="black" onmouseover="annot_toggle(evt, '_move')" onmouseout="annot_toggle(evt, '_move')" onclick="annot_toggle(evt, '_click')" /> 
  <text id="programs/InhDegenerate.rml__text_click" x="157" y="408" style="font-size:12pt;fill:#000000"> programs/InhDegenerate.rml </text> 
 </g> 
 <defs>  <text id="programs/Intro_TC-Warshall.rml__text" x="181" y="357" style="font-size:12pt;fill:#000000"> programs/Intro_TC-Warshall.rml </text> </defs> 
 <g id="contents"> 
  <circle id="programs/Intro_TC-Warshall.rml" cx="176" cy="354" r="2" fill="#00ff00" stroke="black" onmouseover="annot_toggle(evt, '_move')" onmouseout="annot_toggle(evt, '_move')" onclick="annot_toggle(evt, '_click')" /> 
  <text id="programs/Intro_TC-Warshall.rml__text_click" x="181" y="357" style="font-size:12pt;fill:#000000"> programs/Intro_TC-Warshall.rml </text> 
 </g> 
</svg> 
