animation{
  name = "walking",
  src_image = "enemies/alttp/fireball_triple.png",
  directions = {
    { x = 16, y = 0, frame_width = 16, frame_height = 16, origin_x = 8, origin_y = 8 },
    { x = 16, y = 0, frame_width = 16, frame_height = 16, origin_x = 8, origin_y = 8 },
    { x = 16, y = 0, frame_width = 16, frame_height = 16, origin_x = 8, origin_y = 8 },
    { x = 16, y = 0, frame_width = 16, frame_height = 16, origin_x = 8, origin_y = 8 },
  },
}

