[
  {
    "httpRequest": {
      "method": "GET",
      "path": "/USD/to/COP"
    },
    "httpResponseTemplate": {
      "templateType": "MUSTACHE",
      "template": "{'statusCode': 200, 'body': '{\"rate\": 4{{ rand_int_10 }}{{ rand_int_100 }}.{{ rand_int_100 }}}'}"
    }
  },
  {
    "httpRequest": {
      "method": "GET",
      "path": "/USD/to/USD"
    },
    "httpResponse": {
      "body": "{\"rate\": 1}"
    }
  },
  {
    "httpRequest": {
      "method": "GET",
      "path": "/USD/to/CLP"
    },
    "httpResponseTemplate": {
      "templateType": "MUSTACHE",
      "template": "{'statusCode': 200, 'body': '{\"rate\": {{ rand_int_10 }}{{ rand_int_100 }}.{{ rand_int_100 }}}'}"
    }
  },
  {
    "httpRequest": {
      "method": "GET",
      "path": "/USD/to/BRL"
    },
    "httpResponseTemplate": {
      "templateType": "MUSTACHE",
      "template": "{'statusCode': 200, 'body': '{\"rate\": {{ rand_int_10 }}.{{ rand_int_100 }}}'}"
    }
  }
]
