<?xml version="1.0" encoding="utf-8" standalone="no"?>
<!DOCTYPE svg PUBLIC "-//W3C//DTD SVG 1.1//EN"
  "http://www.w3.org/Graphics/SVG/1.1/DTD/svg11.dtd">
<svg height="576pt" version="1.1" viewBox="0 0 1008 576" width="1008pt" xmlns="http://www.w3.org/2000/svg" xmlns:xlink="http://www.w3.org/1999/xlink">
 <metadata>
  <rdf:RDF xmlns:cc="http://creativecommons.org/ns#" xmlns:dc="http://purl.org/dc/elements/1.1/" xmlns:rdf="http://www.w3.org/1999/02/22-rdf-syntax-ns#">
   <cc:Work>
    <dc:type rdf:resource="http://purl.org/dc/dcmitype/StillImage"/>
    <dc:date>2021-11-29T15:12:08.590137</dc:date>
    <dc:format>image/svg+xml</dc:format>
    <dc:creator>
     <cc:Agent>
      <dc:title>Matplotlib v3.4.1, https://matplotlib.org/</dc:title>
     </cc:Agent>
    </dc:creator>
   </cc:Work>
  </rdf:RDF>
 </metadata>
 <defs>
  <style type="text/css">*{stroke-linecap:butt;stroke-linejoin:round;}</style>
 </defs>
 <g id="figure_1">
  <g id="patch_1">
   <path d="M 0 576 
L 1008 576 
L 1008 0 
L 0 0 
z
" style="fill:#ffffff;"/>
  </g>
  <g id="axes_1">
   <g id="patch_2">
    <path d="M 160.65 456.66 
L 740.477071 456.66 
L 740.477071 67.08 
L 160.65 67.08 
z
" style="fill:#ffffff;"/>
   </g>
   <g id="matplotlib.axis_1">
    <g id="xtick_1">
     <g id="line2d_1">
      <defs>
       <path d="M 0 0 
L 0 6 
" id="m9b229b603b" style="stroke:#262626;stroke-width:1.25;"/>
      </defs>
      <g>
       <use style="fill:#262626;stroke:#262626;stroke-width:1.25;" x="175.151716" xlink:href="#m9b229b603b" y="456.66"/>
      </g>
     </g>
     <g id="text_1">
      <!-- 0.75 -->
      <g style="fill:#262626;" transform="translate(138.413435 491.234844)scale(0.33 -0.33)">
       <defs>
        <path d="M 2034 4250 
Q 1547 4250 1301 3770 
Q 1056 3291 1056 2328 
Q 1056 1369 1301 889 
Q 1547 409 2034 409 
Q 2525 409 2770 889 
Q 3016 1369 3016 2328 
Q 3016 3291 2770 3770 
Q 2525 4250 2034 4250 
z
M 2034 4750 
Q 2819 4750 3233 4129 
Q 3647 3509 3647 2328 
Q 3647 1150 3233 529 
Q 2819 -91 2034 -91 
Q 1250 -91 836 529 
Q 422 1150 422 2328 
Q 422 3509 836 4129 
Q 1250 4750 2034 4750 
z
" id="DejaVuSans-30" transform="scale(0.015625)"/>
        <path d="M 684 794 
L 1344 794 
L 1344 0 
L 684 0 
L 684 794 
z
" id="DejaVuSans-2e" transform="scale(0.015625)"/>
        <path d="M 525 4666 
L 3525 4666 
L 3525 4397 
L 1831 0 
L 1172 0 
L 2766 4134 
L 525 4134 
L 525 4666 
z
" id="DejaVuSans-37" transform="scale(0.015625)"/>
        <path d="M 691 4666 
L 3169 4666 
L 3169 4134 
L 1269 4134 
L 1269 2991 
Q 1406 3038 1543 3061 
Q 1681 3084 1819 3084 
Q 2600 3084 3056 2656 
Q 3513 2228 3513 1497 
Q 3513 744 3044 326 
Q 2575 -91 1722 -91 
Q 1428 -91 1123 -41 
Q 819 9 494 109 
L 494 744 
Q 775 591 1075 516 
Q 1375 441 1709 441 
Q 2250 441 2565 725 
Q 2881 1009 2881 1497 
Q 2881 1984 2565 2268 
Q 2250 2553 1709 2553 
Q 1456 2553 1204 2497 
Q 953 2441 691 2322 
L 691 4666 
z
" id="DejaVuSans-35" transform="scale(0.015625)"/>
       </defs>
       <use xlink:href="#DejaVuSans-30"/>
       <use x="63.623047" xlink:href="#DejaVuSans-2e"/>
       <use x="95.410156" xlink:href="#DejaVuSans-37"/>
       <use x="159.033203" xlink:href="#DejaVuSans-35"/>
      </g>
     </g>
    </g>
    <g id="xtick_2">
     <g id="line2d_2">
      <g>
       <use style="fill:#262626;stroke:#262626;stroke-width:1.25;" x="319.393814" xlink:href="#m9b229b603b" y="456.66"/>
      </g>
     </g>
     <g id="text_2">
      <!-- 1.00 -->
      <g style="fill:#262626;" transform="translate(282.655533 491.234844)scale(0.33 -0.33)">
       <defs>
        <path d="M 794 531 
L 1825 531 
L 1825 4091 
L 703 3866 
L 703 4441 
L 1819 4666 
L 2450 4666 
L 2450 531 
L 3481 531 
L 3481 0 
L 794 0 
L 794 531 
z
" id="DejaVuSans-31" transform="scale(0.015625)"/>
       </defs>
       <use xlink:href="#DejaVuSans-31"/>
       <use x="63.623047" xlink:href="#DejaVuSans-2e"/>
       <use x="95.410156" xlink:href="#DejaVuSans-30"/>
       <use x="159.033203" xlink:href="#DejaVuSans-30"/>
      </g>
     </g>
    </g>
    <g id="xtick_3">
     <g id="line2d_3">
      <g>
       <use style="fill:#262626;stroke:#262626;stroke-width:1.25;" x="463.635912" xlink:href="#m9b229b603b" y="456.66"/>
      </g>
     </g>
     <g id="text_3">
      <!-- 1.25 -->
      <g style="fill:#262626;" transform="translate(426.897631 491.234844)scale(0.33 -0.33)">
       <defs>
        <path d="M 1228 531 
L 3431 531 
L 3431 0 
L 469 0 
L 469 531 
Q 828 903 1448 1529 
Q 2069 2156 2228 2338 
Q 2531 2678 2651 2914 
Q 2772 3150 2772 3378 
Q 2772 3750 2511 3984 
Q 2250 4219 1831 4219 
Q 1534 4219 1204 4116 
Q 875 4013 500 3803 
L 500 4441 
Q 881 4594 1212 4672 
Q 1544 4750 1819 4750 
Q 2544 4750 2975 4387 
Q 3406 4025 3406 3419 
Q 3406 3131 3298 2873 
Q 3191 2616 2906 2266 
Q 2828 2175 2409 1742 
Q 1991 1309 1228 531 
z
" id="DejaVuSans-32" transform="scale(0.015625)"/>
       </defs>
       <use xlink:href="#DejaVuSans-31"/>
       <use x="63.623047" xlink:href="#DejaVuSans-2e"/>
       <use x="95.410156" xlink:href="#DejaVuSans-32"/>
       <use x="159.033203" xlink:href="#DejaVuSans-35"/>
      </g>
     </g>
    </g>
    <g id="xtick_4">
     <g id="line2d_4">
      <g>
       <use style="fill:#262626;stroke:#262626;stroke-width:1.25;" x="607.87801" xlink:href="#m9b229b603b" y="456.66"/>
      </g>
     </g>
     <g id="text_4">
      <!-- 1.50 -->
      <g style="fill:#262626;" transform="translate(571.139728 491.234844)scale(0.33 -0.33)">
       <use xlink:href="#DejaVuSans-31"/>
       <use x="63.623047" xlink:href="#DejaVuSans-2e"/>
       <use x="95.410156" xlink:href="#DejaVuSans-35"/>
       <use x="159.033203" xlink:href="#DejaVuSans-30"/>
      </g>
     </g>
    </g>
    <g id="text_5">
     <!-- Maximal distance [μm] -->
     <g style="fill:#262626;" transform="translate(244.038848 529.452187)scale(0.36 -0.36)">
      <defs>
       <path d="M 628 4666 
L 1569 4666 
L 2759 1491 
L 3956 4666 
L 4897 4666 
L 4897 0 
L 4281 0 
L 4281 4097 
L 3078 897 
L 2444 897 
L 1241 4097 
L 1241 0 
L 628 0 
L 628 4666 
z
" id="DejaVuSans-4d" transform="scale(0.015625)"/>
       <path d="M 2194 1759 
Q 1497 1759 1228 1600 
Q 959 1441 959 1056 
Q 959 750 1161 570 
Q 1363 391 1709 391 
Q 2188 391 2477 730 
Q 2766 1069 2766 1631 
L 2766 1759 
L 2194 1759 
z
M 3341 1997 
L 3341 0 
L 2766 0 
L 2766 531 
Q 2569 213 2275 61 
Q 1981 -91 1556 -91 
Q 1019 -91 701 211 
Q 384 513 384 1019 
Q 384 1609 779 1909 
Q 1175 2209 1959 2209 
L 2766 2209 
L 2766 2266 
Q 2766 2663 2505 2880 
Q 2244 3097 1772 3097 
Q 1472 3097 1187 3025 
Q 903 2953 641 2809 
L 641 3341 
Q 956 3463 1253 3523 
Q 1550 3584 1831 3584 
Q 2591 3584 2966 3190 
Q 3341 2797 3341 1997 
z
" id="DejaVuSans-61" transform="scale(0.015625)"/>
       <path d="M 3513 3500 
L 2247 1797 
L 3578 0 
L 2900 0 
L 1881 1375 
L 863 0 
L 184 0 
L 1544 1831 
L 300 3500 
L 978 3500 
L 1906 2253 
L 2834 3500 
L 3513 3500 
z
" id="DejaVuSans-78" transform="scale(0.015625)"/>
       <path d="M 603 3500 
L 1178 3500 
L 1178 0 
L 603 0 
L 603 3500 
z
M 603 4863 
L 1178 4863 
L 1178 4134 
L 603 4134 
L 603 4863 
z
" id="DejaVuSans-69" transform="scale(0.015625)"/>
       <path d="M 3328 2828 
Q 3544 3216 3844 3400 
Q 4144 3584 4550 3584 
Q 5097 3584 5394 3201 
Q 5691 2819 5691 2113 
L 5691 0 
L 5113 0 
L 5113 2094 
Q 5113 2597 4934 2840 
Q 4756 3084 4391 3084 
Q 3944 3084 3684 2787 
Q 3425 2491 3425 1978 
L 3425 0 
L 2847 0 
L 2847 2094 
Q 2847 2600 2669 2842 
Q 2491 3084 2119 3084 
Q 1678 3084 1418 2786 
Q 1159 2488 1159 1978 
L 1159 0 
L 581 0 
L 581 3500 
L 1159 3500 
L 1159 2956 
Q 1356 3278 1631 3431 
Q 1906 3584 2284 3584 
Q 2666 3584 2933 3390 
Q 3200 3197 3328 2828 
z
" id="DejaVuSans-6d" transform="scale(0.015625)"/>
       <path d="M 603 4863 
L 1178 4863 
L 1178 0 
L 603 0 
L 603 4863 
z
" id="DejaVuSans-6c" transform="scale(0.015625)"/>
       <path id="DejaVuSans-20" transform="scale(0.015625)"/>
       <path d="M 2906 2969 
L 2906 4863 
L 3481 4863 
L 3481 0 
L 2906 0 
L 2906 525 
Q 2725 213 2448 61 
Q 2172 -91 1784 -91 
Q 1150 -91 751 415 
Q 353 922 353 1747 
Q 353 2572 751 3078 
Q 1150 3584 1784 3584 
Q 2172 3584 2448 3432 
Q 2725 3281 2906 2969 
z
M 947 1747 
Q 947 1113 1208 752 
Q 1469 391 1925 391 
Q 2381 391 2643 752 
Q 2906 1113 2906 1747 
Q 2906 2381 2643 2742 
Q 2381 3103 1925 3103 
Q 1469 3103 1208 2742 
Q 947 2381 947 1747 
z
" id="DejaVuSans-64" transform="scale(0.015625)"/>
       <path d="M 2834 3397 
L 2834 2853 
Q 2591 2978 2328 3040 
Q 2066 3103 1784 3103 
Q 1356 3103 1142 2972 
Q 928 2841 928 2578 
Q 928 2378 1081 2264 
Q 1234 2150 1697 2047 
L 1894 2003 
Q 2506 1872 2764 1633 
Q 3022 1394 3022 966 
Q 3022 478 2636 193 
Q 2250 -91 1575 -91 
Q 1294 -91 989 -36 
Q 684 19 347 128 
L 347 722 
Q 666 556 975 473 
Q 1284 391 1588 391 
Q 1994 391 2212 530 
Q 2431 669 2431 922 
Q 2431 1156 2273 1281 
Q 2116 1406 1581 1522 
L 1381 1569 
Q 847 1681 609 1914 
Q 372 2147 372 2553 
Q 372 3047 722 3315 
Q 1072 3584 1716 3584 
Q 2034 3584 2315 3537 
Q 2597 3491 2834 3397 
z
" id="DejaVuSans-73" transform="scale(0.015625)"/>
       <path d="M 1172 4494 
L 1172 3500 
L 2356 3500 
L 2356 3053 
L 1172 3053 
L 1172 1153 
Q 1172 725 1289 603 
Q 1406 481 1766 481 
L 2356 481 
L 2356 0 
L 1766 0 
Q 1100 0 847 248 
Q 594 497 594 1153 
L 594 3053 
L 172 3053 
L 172 3500 
L 594 3500 
L 594 4494 
L 1172 4494 
z
" id="DejaVuSans-74" transform="scale(0.015625)"/>
       <path d="M 3513 2113 
L 3513 0 
L 2938 0 
L 2938 2094 
Q 2938 2591 2744 2837 
Q 2550 3084 2163 3084 
Q 1697 3084 1428 2787 
Q 1159 2491 1159 1978 
L 1159 0 
L 581 0 
L 581 3500 
L 1159 3500 
L 1159 2956 
Q 1366 3272 1645 3428 
Q 1925 3584 2291 3584 
Q 2894 3584 3203 3211 
Q 3513 2838 3513 2113 
z
" id="DejaVuSans-6e" transform="scale(0.015625)"/>
       <path d="M 3122 3366 
L 3122 2828 
Q 2878 2963 2633 3030 
Q 2388 3097 2138 3097 
Q 1578 3097 1268 2742 
Q 959 2388 959 1747 
Q 959 1106 1268 751 
Q 1578 397 2138 397 
Q 2388 397 2633 464 
Q 2878 531 3122 666 
L 3122 134 
Q 2881 22 2623 -34 
Q 2366 -91 2075 -91 
Q 1284 -91 818 406 
Q 353 903 353 1747 
Q 353 2603 823 3093 
Q 1294 3584 2113 3584 
Q 2378 3584 2631 3529 
Q 2884 3475 3122 3366 
z
" id="DejaVuSans-63" transform="scale(0.015625)"/>
       <path d="M 3597 1894 
L 3597 1613 
L 953 1613 
Q 991 1019 1311 708 
Q 1631 397 2203 397 
Q 2534 397 2845 478 
Q 3156 559 3463 722 
L 3463 178 
Q 3153 47 2828 -22 
Q 2503 -91 2169 -91 
Q 1331 -91 842 396 
Q 353 884 353 1716 
Q 353 2575 817 3079 
Q 1281 3584 2069 3584 
Q 2775 3584 3186 3129 
Q 3597 2675 3597 1894 
z
M 3022 2063 
Q 3016 2534 2758 2815 
Q 2500 3097 2075 3097 
Q 1594 3097 1305 2825 
Q 1016 2553 972 2059 
L 3022 2063 
z
" id="DejaVuSans-65" transform="scale(0.015625)"/>
       <path d="M 550 4863 
L 1875 4863 
L 1875 4416 
L 1125 4416 
L 1125 -397 
L 1875 -397 
L 1875 -844 
L 550 -844 
L 550 4863 
z
" id="DejaVuSans-5b" transform="scale(0.015625)"/>
       <path d="M 544 -1331 
L 544 3500 
L 1119 3500 
L 1119 1325 
Q 1119 872 1334 640 
Q 1550 409 1972 409 
Q 2434 409 2667 671 
Q 2900 934 2900 1459 
L 2900 3500 
L 3475 3500 
L 3475 806 
Q 3475 619 3529 530 
Q 3584 441 3700 441 
Q 3728 441 3778 458 
Q 3828 475 3916 513 
L 3916 50 
Q 3788 -22 3673 -56 
Q 3559 -91 3450 -91 
Q 3234 -91 3106 31 
Q 2978 153 2931 403 
Q 2775 156 2548 32 
Q 2322 -91 2016 -91 
Q 1697 -91 1473 31 
Q 1250 153 1119 397 
L 1119 -1331 
L 544 -1331 
z
" id="DejaVuSans-3bc" transform="scale(0.015625)"/>
       <path d="M 1947 4863 
L 1947 -844 
L 622 -844 
L 622 -397 
L 1369 -397 
L 1369 4416 
L 622 4416 
L 622 4863 
L 1947 4863 
z
" id="DejaVuSans-5d" transform="scale(0.015625)"/>
      </defs>
      <use xlink:href="#DejaVuSans-4d"/>
      <use x="86.279297" xlink:href="#DejaVuSans-61"/>
      <use x="147.558594" xlink:href="#DejaVuSans-78"/>
      <use x="206.738281" xlink:href="#DejaVuSans-69"/>
      <use x="234.521484" xlink:href="#DejaVuSans-6d"/>
      <use x="331.933594" xlink:href="#DejaVuSans-61"/>
      <use x="393.212891" xlink:href="#DejaVuSans-6c"/>
      <use x="420.996094" xlink:href="#DejaVuSans-20"/>
      <use x="452.783203" xlink:href="#DejaVuSans-64"/>
      <use x="516.259766" xlink:href="#DejaVuSans-69"/>
      <use x="544.042969" xlink:href="#DejaVuSans-73"/>
      <use x="596.142578" xlink:href="#DejaVuSans-74"/>
      <use x="635.351562" xlink:href="#DejaVuSans-61"/>
      <use x="696.630859" xlink:href="#DejaVuSans-6e"/>
      <use x="760.009766" xlink:href="#DejaVuSans-63"/>
      <use x="814.990234" xlink:href="#DejaVuSans-65"/>
      <use x="876.513672" xlink:href="#DejaVuSans-20"/>
      <use x="908.300781" xlink:href="#DejaVuSans-5b"/>
      <use x="947.314453" xlink:href="#DejaVuSans-3bc"/>
      <use x="1010.9375" xlink:href="#DejaVuSans-6d"/>
      <use x="1108.349609" xlink:href="#DejaVuSans-5d"/>
     </g>
    </g>
    <g id="text_6">
     <!-- 1e2 -->
     <g style="fill:#262626;" transform="translate(678.179259 526.172656)scale(0.33 -0.33)">
      <use xlink:href="#DejaVuSans-31"/>
      <use x="63.623047" xlink:href="#DejaVuSans-65"/>
      <use x="125.146484" xlink:href="#DejaVuSans-32"/>
     </g>
    </g>
   </g>
   <g id="matplotlib.axis_2">
    <g id="ytick_1">
     <g id="line2d_5">
      <defs>
       <path d="M 0 0 
L -6 0 
" id="m7435a225d4" style="stroke:#262626;stroke-width:1.25;"/>
      </defs>
      <g>
       <use style="fill:#262626;stroke:#262626;stroke-width:1.25;" x="160.65" xlink:href="#m7435a225d4" y="317.15254"/>
      </g>
     </g>
     <g id="text_7">
      <!-- 2.0 -->
      <g style="fill:#262626;" transform="translate(98.669688 329.689961)scale(0.33 -0.33)">
       <use xlink:href="#DejaVuSans-32"/>
       <use x="63.623047" xlink:href="#DejaVuSans-2e"/>
       <use x="95.410156" xlink:href="#DejaVuSans-30"/>
      </g>
     </g>
    </g>
    <g id="ytick_2">
     <g id="line2d_6">
      <g>
       <use style="fill:#262626;stroke:#262626;stroke-width:1.25;" x="160.65" xlink:href="#m7435a225d4" y="162.844956"/>
      </g>
     </g>
     <g id="text_8">
      <!-- 2.5 -->
      <g style="fill:#262626;" transform="translate(98.669688 175.382378)scale(0.33 -0.33)">
       <use xlink:href="#DejaVuSans-32"/>
       <use x="63.623047" xlink:href="#DejaVuSans-2e"/>
       <use x="95.410156" xlink:href="#DejaVuSans-35"/>
      </g>
     </g>
    </g>
    <g id="text_9">
     <!-- Median curvature -->
     <g style="fill:#262626;" transform="translate(87.182813 419.985937)rotate(-90)scale(0.36 -0.36)">
      <defs>
       <path d="M 544 1381 
L 544 3500 
L 1119 3500 
L 1119 1403 
Q 1119 906 1312 657 
Q 1506 409 1894 409 
Q 2359 409 2629 706 
Q 2900 1003 2900 1516 
L 2900 3500 
L 3475 3500 
L 3475 0 
L 2900 0 
L 2900 538 
Q 2691 219 2414 64 
Q 2138 -91 1772 -91 
Q 1169 -91 856 284 
Q 544 659 544 1381 
z
M 1991 3584 
L 1991 3584 
z
" id="DejaVuSans-75" transform="scale(0.015625)"/>
       <path d="M 2631 2963 
Q 2534 3019 2420 3045 
Q 2306 3072 2169 3072 
Q 1681 3072 1420 2755 
Q 1159 2438 1159 1844 
L 1159 0 
L 581 0 
L 581 3500 
L 1159 3500 
L 1159 2956 
Q 1341 3275 1631 3429 
Q 1922 3584 2338 3584 
Q 2397 3584 2469 3576 
Q 2541 3569 2628 3553 
L 2631 2963 
z
" id="DejaVuSans-72" transform="scale(0.015625)"/>
       <path d="M 191 3500 
L 800 3500 
L 1894 563 
L 2988 3500 
L 3597 3500 
L 2284 0 
L 1503 0 
L 191 3500 
z
" id="DejaVuSans-76" transform="scale(0.015625)"/>
      </defs>
      <use xlink:href="#DejaVuSans-4d"/>
      <use x="86.279297" xlink:href="#DejaVuSans-65"/>
      <use x="147.802734" xlink:href="#DejaVuSans-64"/>
      <use x="211.279297" xlink:href="#DejaVuSans-69"/>
      <use x="239.0625" xlink:href="#DejaVuSans-61"/>
      <use x="300.341797" xlink:href="#DejaVuSans-6e"/>
      <use x="363.720703" xlink:href="#DejaVuSans-20"/>
      <use x="395.507812" xlink:href="#DejaVuSans-63"/>
      <use x="450.488281" xlink:href="#DejaVuSans-75"/>
      <use x="513.867188" xlink:href="#DejaVuSans-72"/>
      <use x="554.980469" xlink:href="#DejaVuSans-76"/>
      <use x="614.160156" xlink:href="#DejaVuSans-61"/>
      <use x="675.439453" xlink:href="#DejaVuSans-74"/>
      <use x="714.648438" xlink:href="#DejaVuSans-75"/>
      <use x="778.027344" xlink:href="#DejaVuSans-72"/>
      <use x="816.890625" xlink:href="#DejaVuSans-65"/>
     </g>
    </g>
    <g id="text_10">
     <!-- 1e−2 -->
     <g style="fill:#262626;" transform="translate(160.65 64.08)scale(0.33 -0.33)">
      <defs>
       <path d="M 678 2272 
L 4684 2272 
L 4684 1741 
L 678 1741 
L 678 2272 
z
" id="DejaVuSans-2212" transform="scale(0.015625)"/>
      </defs>
      <use xlink:href="#DejaVuSans-31"/>
      <use x="63.623047" xlink:href="#DejaVuSans-65"/>
      <use x="125.146484" xlink:href="#DejaVuSans-2212"/>
      <use x="208.935547" xlink:href="#DejaVuSans-32"/>
     </g>
    </g>
   </g>
   <g id="LineCollection_1">
    <path clip-path="url(#pca78129131)" d="M 256.792987 387.652914 
L 274.609907 387.652914 
" style="fill:none;stroke:#1f77b4;stroke-width:4;"/>
    <path clip-path="url(#pca78129131)" d="M 274.461624 276.02398 
L 290.207211 276.02398 
" style="fill:none;stroke:#1f77b4;stroke-width:4;"/>
    <path clip-path="url(#pca78129131)" d="M 325.97051 188.706003 
L 343.579249 188.706003 
" style="fill:none;stroke:#1f77b4;stroke-width:4;"/>
    <path clip-path="url(#pca78129131)" d="M 423.251372 171.592642 
L 446.085954 171.592642 
" style="fill:none;stroke:#1f77b4;stroke-width:4;"/>
    <path clip-path="url(#pca78129131)" d="M 454.595805 233.421663 
L 472.132766 233.421663 
" style="fill:none;stroke:#1f77b4;stroke-width:4;"/>
    <path clip-path="url(#pca78129131)" d="M 585.035722 308.287255 
L 608.221453 308.287255 
" style="fill:none;stroke:#1f77b4;stroke-width:4;"/>
    <path clip-path="url(#pca78129131)" d="M 659.108328 354.663218 
L 688.935776 354.663218 
" style="fill:none;stroke:#1f77b4;stroke-width:4;"/>
    <path clip-path="url(#pca78129131)" d="M 679.685011 417.8625 
L 714.121295 417.8625 
" style="fill:none;stroke:#1f77b4;stroke-width:4;"/>
   </g>
   <g id="LineCollection_2">
    <path clip-path="url(#pca78129131)" d="M 265.701447 408.952771 
L 265.701447 366.353056 
" style="fill:none;stroke:#1f77b4;stroke-width:4;"/>
    <path clip-path="url(#pca78129131)" d="M 282.334418 301.044314 
L 282.334418 251.003646 
" style="fill:none;stroke:#1f77b4;stroke-width:4;"/>
    <path clip-path="url(#pca78129131)" d="M 334.774879 211.852206 
L 334.774879 165.5598 
" style="fill:none;stroke:#1f77b4;stroke-width:4;"/>
    <path clip-path="url(#pca78129131)" d="M 434.668663 187.324101 
L 434.668663 155.861183 
" style="fill:none;stroke:#1f77b4;stroke-width:4;"/>
    <path clip-path="url(#pca78129131)" d="M 463.364286 251.307378 
L 463.364286 215.535947 
" style="fill:none;stroke:#1f77b4;stroke-width:4;"/>
    <path clip-path="url(#pca78129131)" d="M 596.628588 319.840791 
L 596.628588 296.733719 
" style="fill:none;stroke:#1f77b4;stroke-width:4;"/>
    <path clip-path="url(#pca78129131)" d="M 674.022052 368.930979 
L 674.022052 340.395456 
" style="fill:none;stroke:#1f77b4;stroke-width:4;"/>
    <path clip-path="url(#pca78129131)" d="M 696.903153 438.951818 
L 696.903153 396.773182 
" style="fill:none;stroke:#1f77b4;stroke-width:4;"/>
   </g>
   <g id="LineCollection_3">
    <path clip-path="url(#pca78129131)" d="M 242.488423 247.332929 
L 283.615982 247.332929 
" style="fill:none;stroke:#ff7f0e;stroke-width:4;"/>
    <path clip-path="url(#pca78129131)" d="M 232.871962 168.351112 
L 302.199564 168.351112 
" style="fill:none;stroke:#ff7f0e;stroke-width:4;"/>
    <path clip-path="url(#pca78129131)" d="M 332.575286 132.484389 
L 370.454154 132.484389 
" style="fill:none;stroke:#ff7f0e;stroke-width:4;"/>
    <path clip-path="url(#pca78129131)" d="M 411.317806 156.211829 
L 455.583243 156.211829 
" style="fill:none;stroke:#ff7f0e;stroke-width:4;"/>
    <path clip-path="url(#pca78129131)" d="M 457.940673 225.816937 
L 488.991698 225.816937 
" style="fill:none;stroke:#ff7f0e;stroke-width:4;"/>
    <path clip-path="url(#pca78129131)" d="M 594.066835 327.753173 
L 623.889527 327.753173 
" style="fill:none;stroke:#ff7f0e;stroke-width:4;"/>
   </g>
   <g id="LineCollection_4">
    <path clip-path="url(#pca78129131)" d="M 263.052202 262.487912 
L 263.052202 232.177945 
" style="fill:none;stroke:#ff7f0e;stroke-width:4;"/>
    <path clip-path="url(#pca78129131)" d="M 267.535763 190.563972 
L 267.535763 146.138252 
" style="fill:none;stroke:#ff7f0e;stroke-width:4;"/>
    <path clip-path="url(#pca78129131)" d="M 351.51472 180.180597 
L 351.51472 84.788182 
" style="fill:none;stroke:#ff7f0e;stroke-width:4;"/>
    <path clip-path="url(#pca78129131)" d="M 433.450524 197.564482 
L 433.450524 114.859175 
" style="fill:none;stroke:#ff7f0e;stroke-width:4;"/>
    <path clip-path="url(#pca78129131)" d="M 473.466185 269.091212 
L 473.466185 182.542663 
" style="fill:none;stroke:#ff7f0e;stroke-width:4;"/>
    <path clip-path="url(#pca78129131)" d="M 608.978181 352.794087 
L 608.978181 302.712259 
" style="fill:none;stroke:#ff7f0e;stroke-width:4;"/>
   </g>
   <g id="LineCollection_5">
    <path clip-path="url(#pca78129131)" d="M 227.0671 322.369255 
L 280.18429 322.369255 
" style="fill:none;stroke:#2ca02c;stroke-width:4;"/>
    <path clip-path="url(#pca78129131)" d="M 229.127223 179.122429 
L 251.32591 179.122429 
" style="fill:none;stroke:#2ca02c;stroke-width:4;"/>
    <path clip-path="url(#pca78129131)" d="M 318.854785 207.514387 
L 346.978283 207.514387 
" style="fill:none;stroke:#2ca02c;stroke-width:4;"/>
    <path clip-path="url(#pca78129131)" d="M 373.756081 196.971829 
L 415.417334 196.971829 
" style="fill:none;stroke:#2ca02c;stroke-width:4;"/>
    <path clip-path="url(#pca78129131)" d="M 438.687719 257.734471 
L 484.713274 257.734471 
" style="fill:none;stroke:#2ca02c;stroke-width:4;"/>
    <path clip-path="url(#pca78129131)" d="M 564.676174 342.311147 
L 634.106195 342.311147 
" style="fill:none;stroke:#2ca02c;stroke-width:4;"/>
    <path clip-path="url(#pca78129131)" d="M 598.524166 336.04177 
L 650.345797 336.04177 
" style="fill:none;stroke:#2ca02c;stroke-width:4;"/>
   </g>
   <g id="LineCollection_6">
    <path clip-path="url(#pca78129131)" d="M 253.625695 353.474239 
L 253.625695 291.26427 
" style="fill:none;stroke:#2ca02c;stroke-width:4;"/>
    <path clip-path="url(#pca78129131)" d="M 240.226566 218.898735 
L 240.226566 139.346122 
" style="fill:none;stroke:#2ca02c;stroke-width:4;"/>
    <path clip-path="url(#pca78129131)" d="M 332.916534 245.043178 
L 332.916534 169.985597 
" style="fill:none;stroke:#2ca02c;stroke-width:4;"/>
    <path clip-path="url(#pca78129131)" d="M 394.586708 219.355799 
L 394.586708 174.587858 
" style="fill:none;stroke:#2ca02c;stroke-width:4;"/>
    <path clip-path="url(#pca78129131)" d="M 461.700497 284.639182 
L 461.700497 230.82976 
" style="fill:none;stroke:#2ca02c;stroke-width:4;"/>
    <path clip-path="url(#pca78129131)" d="M 599.391185 370.975993 
L 599.391185 313.646301 
" style="fill:none;stroke:#2ca02c;stroke-width:4;"/>
    <path clip-path="url(#pca78129131)" d="M 624.434981 401.804679 
L 624.434981 270.278861 
" style="fill:none;stroke:#2ca02c;stroke-width:4;"/>
   </g>
   <g id="LineCollection_7">
    <path clip-path="url(#pca78129131)" d="M 187.005776 187.97576 
L 208.103758 187.97576 
" style="fill:none;stroke:#d62728;stroke-width:4;"/>
    <path clip-path="url(#pca78129131)" d="M 214.878946 127.861437 
L 247.313562 127.861437 
" style="fill:none;stroke:#d62728;stroke-width:4;"/>
    <path clip-path="url(#pca78129131)" d="M 274.102249 158.831974 
L 327.412513 158.831974 
" style="fill:none;stroke:#d62728;stroke-width:4;"/>
    <path clip-path="url(#pca78129131)" d="M 407.04581 180.221489 
L 462.24432 180.221489 
" style="fill:none;stroke:#d62728;stroke-width:4;"/>
    <path clip-path="url(#pca78129131)" d="M 477.870523 306.046482 
L 508.896825 306.046482 
" style="fill:none;stroke:#d62728;stroke-width:4;"/>
    <path clip-path="url(#pca78129131)" d="M 588.390148 378.594076 
L 623.198469 378.594076 
" style="fill:none;stroke:#d62728;stroke-width:4;"/>
   </g>
   <g id="LineCollection_8">
    <path clip-path="url(#pca78129131)" d="M 197.554767 206.519938 
L 197.554767 169.431582 
" style="fill:none;stroke:#d62728;stroke-width:4;"/>
    <path clip-path="url(#pca78129131)" d="M 231.096254 150.092174 
L 231.096254 105.6307 
" style="fill:none;stroke:#d62728;stroke-width:4;"/>
    <path clip-path="url(#pca78129131)" d="M 300.757381 173.314161 
L 300.757381 144.349788 
" style="fill:none;stroke:#d62728;stroke-width:4;"/>
    <path clip-path="url(#pca78129131)" d="M 434.645065 201.71722 
L 434.645065 158.725759 
" style="fill:none;stroke:#d62728;stroke-width:4;"/>
    <path clip-path="url(#pca78129131)" d="M 493.383674 323.989595 
L 493.383674 288.103369 
" style="fill:none;stroke:#d62728;stroke-width:4;"/>
    <path clip-path="url(#pca78129131)" d="M 605.794309 430.739189 
L 605.794309 326.448963 
" style="fill:none;stroke:#d62728;stroke-width:4;"/>
   </g>
   <g id="line2d_7">
    <path clip-path="url(#pca78129131)" d="M 265.701447 387.652914 
L 282.334418 276.02398 
L 334.774879 188.706003 
L 434.668663 171.592642 
L 463.364286 233.421663 
L 596.628588 308.287255 
L 674.022052 354.663218 
L 696.903153 417.8625 
" style="fill:none;stroke:#1f77b4;stroke-linecap:round;stroke-width:4;"/>
   </g>
   <g id="line2d_8">
    <defs>
     <path d="M 0 4 
L 0 -4 
" id="m0d01a55562" style="stroke:#1f77b4;stroke-width:3;"/>
    </defs>
    <g clip-path="url(#pca78129131)">
     <use style="fill:#1f77b4;stroke:#1f77b4;stroke-width:3;" x="256.792987" xlink:href="#m0d01a55562" y="387.652914"/>
     <use style="fill:#1f77b4;stroke:#1f77b4;stroke-width:3;" x="274.461624" xlink:href="#m0d01a55562" y="276.02398"/>
     <use style="fill:#1f77b4;stroke:#1f77b4;stroke-width:3;" x="325.97051" xlink:href="#m0d01a55562" y="188.706003"/>
     <use style="fill:#1f77b4;stroke:#1f77b4;stroke-width:3;" x="423.251372" xlink:href="#m0d01a55562" y="171.592642"/>
     <use style="fill:#1f77b4;stroke:#1f77b4;stroke-width:3;" x="454.595805" xlink:href="#m0d01a55562" y="233.421663"/>
     <use style="fill:#1f77b4;stroke:#1f77b4;stroke-width:3;" x="585.035722" xlink:href="#m0d01a55562" y="308.287255"/>
     <use style="fill:#1f77b4;stroke:#1f77b4;stroke-width:3;" x="659.108328" xlink:href="#m0d01a55562" y="354.663218"/>
     <use style="fill:#1f77b4;stroke:#1f77b4;stroke-width:3;" x="679.685011" xlink:href="#m0d01a55562" y="417.8625"/>
    </g>
   </g>
   <g id="line2d_9">
    <g clip-path="url(#pca78129131)">
     <use style="fill:#1f77b4;stroke:#1f77b4;stroke-width:3;" x="274.609907" xlink:href="#m0d01a55562" y="387.652914"/>
     <use style="fill:#1f77b4;stroke:#1f77b4;stroke-width:3;" x="290.207211" xlink:href="#m0d01a55562" y="276.02398"/>
     <use style="fill:#1f77b4;stroke:#1f77b4;stroke-width:3;" x="343.579249" xlink:href="#m0d01a55562" y="188.706003"/>
     <use style="fill:#1f77b4;stroke:#1f77b4;stroke-width:3;" x="446.085954" xlink:href="#m0d01a55562" y="171.592642"/>
     <use style="fill:#1f77b4;stroke:#1f77b4;stroke-width:3;" x="472.132766" xlink:href="#m0d01a55562" y="233.421663"/>
     <use style="fill:#1f77b4;stroke:#1f77b4;stroke-width:3;" x="608.221453" xlink:href="#m0d01a55562" y="308.287255"/>
     <use style="fill:#1f77b4;stroke:#1f77b4;stroke-width:3;" x="688.935776" xlink:href="#m0d01a55562" y="354.663218"/>
     <use style="fill:#1f77b4;stroke:#1f77b4;stroke-width:3;" x="714.121295" xlink:href="#m0d01a55562" y="417.8625"/>
    </g>
   </g>
   <g id="line2d_10">
    <defs>
     <path d="M 4 0 
L -4 -0 
" id="mdce96a25a4" style="stroke:#1f77b4;stroke-width:3;"/>
    </defs>
    <g clip-path="url(#pca78129131)">
     <use style="fill:#1f77b4;stroke:#1f77b4;stroke-width:3;" x="265.701447" xlink:href="#mdce96a25a4" y="408.952771"/>
     <use style="fill:#1f77b4;stroke:#1f77b4;stroke-width:3;" x="282.334418" xlink:href="#mdce96a25a4" y="301.044314"/>
     <use style="fill:#1f77b4;stroke:#1f77b4;stroke-width:3;" x="334.774879" xlink:href="#mdce96a25a4" y="211.852206"/>
     <use style="fill:#1f77b4;stroke:#1f77b4;stroke-width:3;" x="434.668663" xlink:href="#mdce96a25a4" y="187.324101"/>
     <use style="fill:#1f77b4;stroke:#1f77b4;stroke-width:3;" x="463.364286" xlink:href="#mdce96a25a4" y="251.307378"/>
     <use style="fill:#1f77b4;stroke:#1f77b4;stroke-width:3;" x="596.628588" xlink:href="#mdce96a25a4" y="319.840791"/>
     <use style="fill:#1f77b4;stroke:#1f77b4;stroke-width:3;" x="674.022052" xlink:href="#mdce96a25a4" y="368.930979"/>
     <use style="fill:#1f77b4;stroke:#1f77b4;stroke-width:3;" x="696.903153" xlink:href="#mdce96a25a4" y="438.951818"/>
    </g>
   </g>
   <g id="line2d_11">
    <g clip-path="url(#pca78129131)">
     <use style="fill:#1f77b4;stroke:#1f77b4;stroke-width:3;" x="265.701447" xlink:href="#mdce96a25a4" y="366.353056"/>
     <use style="fill:#1f77b4;stroke:#1f77b4;stroke-width:3;" x="282.334418" xlink:href="#mdce96a25a4" y="251.003646"/>
     <use style="fill:#1f77b4;stroke:#1f77b4;stroke-width:3;" x="334.774879" xlink:href="#mdce96a25a4" y="165.5598"/>
     <use style="fill:#1f77b4;stroke:#1f77b4;stroke-width:3;" x="434.668663" xlink:href="#mdce96a25a4" y="155.861183"/>
     <use style="fill:#1f77b4;stroke:#1f77b4;stroke-width:3;" x="463.364286" xlink:href="#mdce96a25a4" y="215.535947"/>
     <use style="fill:#1f77b4;stroke:#1f77b4;stroke-width:3;" x="596.628588" xlink:href="#mdce96a25a4" y="296.733719"/>
     <use style="fill:#1f77b4;stroke:#1f77b4;stroke-width:3;" x="674.022052" xlink:href="#mdce96a25a4" y="340.395456"/>
     <use style="fill:#1f77b4;stroke:#1f77b4;stroke-width:3;" x="696.903153" xlink:href="#mdce96a25a4" y="396.773182"/>
    </g>
   </g>
   <g id="line2d_12">
    <path clip-path="url(#pca78129131)" d="M 263.052202 247.332929 
L 267.535763 168.351112 
L 351.51472 132.484389 
L 433.450524 156.211829 
L 473.466185 225.816937 
L 608.978181 327.753173 
" style="fill:none;stroke:#ff7f0e;stroke-linecap:round;stroke-width:4;"/>
   </g>
   <g id="line2d_13">
    <defs>
     <path d="M 0 4 
L 0 -4 
" id="m860bc405fb" style="stroke:#ff7f0e;stroke-width:3;"/>
    </defs>
    <g clip-path="url(#pca78129131)">
     <use style="fill:#ff7f0e;stroke:#ff7f0e;stroke-width:3;" x="242.488423" xlink:href="#m860bc405fb" y="247.332929"/>
     <use style="fill:#ff7f0e;stroke:#ff7f0e;stroke-width:3;" x="232.871962" xlink:href="#m860bc405fb" y="168.351112"/>
     <use style="fill:#ff7f0e;stroke:#ff7f0e;stroke-width:3;" x="332.575286" xlink:href="#m860bc405fb" y="132.484389"/>
     <use style="fill:#ff7f0e;stroke:#ff7f0e;stroke-width:3;" x="411.317806" xlink:href="#m860bc405fb" y="156.211829"/>
     <use style="fill:#ff7f0e;stroke:#ff7f0e;stroke-width:3;" x="457.940673" xlink:href="#m860bc405fb" y="225.816937"/>
     <use style="fill:#ff7f0e;stroke:#ff7f0e;stroke-width:3;" x="594.066835" xlink:href="#m860bc405fb" y="327.753173"/>
    </g>
   </g>
   <g id="line2d_14">
    <g clip-path="url(#pca78129131)">
     <use style="fill:#ff7f0e;stroke:#ff7f0e;stroke-width:3;" x="283.615982" xlink:href="#m860bc405fb" y="247.332929"/>
     <use style="fill:#ff7f0e;stroke:#ff7f0e;stroke-width:3;" x="302.199564" xlink:href="#m860bc405fb" y="168.351112"/>
     <use style="fill:#ff7f0e;stroke:#ff7f0e;stroke-width:3;" x="370.454154" xlink:href="#m860bc405fb" y="132.484389"/>
     <use style="fill:#ff7f0e;stroke:#ff7f0e;stroke-width:3;" x="455.583243" xlink:href="#m860bc405fb" y="156.211829"/>
     <use style="fill:#ff7f0e;stroke:#ff7f0e;stroke-width:3;" x="488.991698" xlink:href="#m860bc405fb" y="225.816937"/>
     <use style="fill:#ff7f0e;stroke:#ff7f0e;stroke-width:3;" x="623.889527" xlink:href="#m860bc405fb" y="327.753173"/>
    </g>
   </g>
   <g id="line2d_15">
    <defs>
     <path d="M 4 0 
L -4 -0 
" id="m3c28ad4e07" style="stroke:#ff7f0e;stroke-width:3;"/>
    </defs>
    <g clip-path="url(#pca78129131)">
     <use style="fill:#ff7f0e;stroke:#ff7f0e;stroke-width:3;" x="263.052202" xlink:href="#m3c28ad4e07" y="262.487912"/>
     <use style="fill:#ff7f0e;stroke:#ff7f0e;stroke-width:3;" x="267.535763" xlink:href="#m3c28ad4e07" y="190.563972"/>
     <use style="fill:#ff7f0e;stroke:#ff7f0e;stroke-width:3;" x="351.51472" xlink:href="#m3c28ad4e07" y="180.180597"/>
     <use style="fill:#ff7f0e;stroke:#ff7f0e;stroke-width:3;" x="433.450524" xlink:href="#m3c28ad4e07" y="197.564482"/>
     <use style="fill:#ff7f0e;stroke:#ff7f0e;stroke-width:3;" x="473.466185" xlink:href="#m3c28ad4e07" y="269.091212"/>
     <use style="fill:#ff7f0e;stroke:#ff7f0e;stroke-width:3;" x="608.978181" xlink:href="#m3c28ad4e07" y="352.794087"/>
    </g>
   </g>
   <g id="line2d_16">
    <g clip-path="url(#pca78129131)">
     <use style="fill:#ff7f0e;stroke:#ff7f0e;stroke-width:3;" x="263.052202" xlink:href="#m3c28ad4e07" y="232.177945"/>
     <use style="fill:#ff7f0e;stroke:#ff7f0e;stroke-width:3;" x="267.535763" xlink:href="#m3c28ad4e07" y="146.138252"/>
     <use style="fill:#ff7f0e;stroke:#ff7f0e;stroke-width:3;" x="351.51472" xlink:href="#m3c28ad4e07" y="84.788182"/>
     <use style="fill:#ff7f0e;stroke:#ff7f0e;stroke-width:3;" x="433.450524" xlink:href="#m3c28ad4e07" y="114.859175"/>
     <use style="fill:#ff7f0e;stroke:#ff7f0e;stroke-width:3;" x="473.466185" xlink:href="#m3c28ad4e07" y="182.542663"/>
     <use style="fill:#ff7f0e;stroke:#ff7f0e;stroke-width:3;" x="608.978181" xlink:href="#m3c28ad4e07" y="302.712259"/>
    </g>
   </g>
   <g id="line2d_17">
    <path clip-path="url(#pca78129131)" d="M 253.625695 322.369255 
L 240.226566 179.122429 
L 332.916534 207.514387 
L 394.586708 196.971829 
L 461.700497 257.734471 
L 599.391185 342.311147 
L 624.434981 336.04177 
" style="fill:none;stroke:#2ca02c;stroke-linecap:round;stroke-width:4;"/>
   </g>
   <g id="line2d_18">
    <defs>
     <path d="M 0 4 
L 0 -4 
" id="m6df57f8141" style="stroke:#2ca02c;stroke-width:3;"/>
    </defs>
    <g clip-path="url(#pca78129131)">
     <use style="fill:#2ca02c;stroke:#2ca02c;stroke-width:3;" x="227.0671" xlink:href="#m6df57f8141" y="322.369255"/>
     <use style="fill:#2ca02c;stroke:#2ca02c;stroke-width:3;" x="229.127223" xlink:href="#m6df57f8141" y="179.122429"/>
     <use style="fill:#2ca02c;stroke:#2ca02c;stroke-width:3;" x="318.854785" xlink:href="#m6df57f8141" y="207.514387"/>
     <use style="fill:#2ca02c;stroke:#2ca02c;stroke-width:3;" x="373.756081" xlink:href="#m6df57f8141" y="196.971829"/>
     <use style="fill:#2ca02c;stroke:#2ca02c;stroke-width:3;" x="438.687719" xlink:href="#m6df57f8141" y="257.734471"/>
     <use style="fill:#2ca02c;stroke:#2ca02c;stroke-width:3;" x="564.676174" xlink:href="#m6df57f8141" y="342.311147"/>
     <use style="fill:#2ca02c;stroke:#2ca02c;stroke-width:3;" x="598.524166" xlink:href="#m6df57f8141" y="336.04177"/>
    </g>
   </g>
   <g id="line2d_19">
    <g clip-path="url(#pca78129131)">
     <use style="fill:#2ca02c;stroke:#2ca02c;stroke-width:3;" x="280.18429" xlink:href="#m6df57f8141" y="322.369255"/>
     <use style="fill:#2ca02c;stroke:#2ca02c;stroke-width:3;" x="251.32591" xlink:href="#m6df57f8141" y="179.122429"/>
     <use style="fill:#2ca02c;stroke:#2ca02c;stroke-width:3;" x="346.978283" xlink:href="#m6df57f8141" y="207.514387"/>
     <use style="fill:#2ca02c;stroke:#2ca02c;stroke-width:3;" x="415.417334" xlink:href="#m6df57f8141" y="196.971829"/>
     <use style="fill:#2ca02c;stroke:#2ca02c;stroke-width:3;" x="484.713274" xlink:href="#m6df57f8141" y="257.734471"/>
     <use style="fill:#2ca02c;stroke:#2ca02c;stroke-width:3;" x="634.106195" xlink:href="#m6df57f8141" y="342.311147"/>
     <use style="fill:#2ca02c;stroke:#2ca02c;stroke-width:3;" x="650.345797" xlink:href="#m6df57f8141" y="336.04177"/>
    </g>
   </g>
   <g id="line2d_20">
    <defs>
     <path d="M 4 0 
L -4 -0 
" id="m944a0f6df9" style="stroke:#2ca02c;stroke-width:3;"/>
    </defs>
    <g clip-path="url(#pca78129131)">
     <use style="fill:#2ca02c;stroke:#2ca02c;stroke-width:3;" x="253.625695" xlink:href="#m944a0f6df9" y="353.474239"/>
     <use style="fill:#2ca02c;stroke:#2ca02c;stroke-width:3;" x="240.226566" xlink:href="#m944a0f6df9" y="218.898735"/>
     <use style="fill:#2ca02c;stroke:#2ca02c;stroke-width:3;" x="332.916534" xlink:href="#m944a0f6df9" y="245.043178"/>
     <use style="fill:#2ca02c;stroke:#2ca02c;stroke-width:3;" x="394.586708" xlink:href="#m944a0f6df9" y="219.355799"/>
     <use style="fill:#2ca02c;stroke:#2ca02c;stroke-width:3;" x="461.700497" xlink:href="#m944a0f6df9" y="284.639182"/>
     <use style="fill:#2ca02c;stroke:#2ca02c;stroke-width:3;" x="599.391185" xlink:href="#m944a0f6df9" y="370.975993"/>
     <use style="fill:#2ca02c;stroke:#2ca02c;stroke-width:3;" x="624.434981" xlink:href="#m944a0f6df9" y="401.804679"/>
    </g>
   </g>
   <g id="line2d_21">
    <g clip-path="url(#pca78129131)">
     <use style="fill:#2ca02c;stroke:#2ca02c;stroke-width:3;" x="253.625695" xlink:href="#m944a0f6df9" y="291.26427"/>
     <use style="fill:#2ca02c;stroke:#2ca02c;stroke-width:3;" x="240.226566" xlink:href="#m944a0f6df9" y="139.346122"/>
     <use style="fill:#2ca02c;stroke:#2ca02c;stroke-width:3;" x="332.916534" xlink:href="#m944a0f6df9" y="169.985597"/>
     <use style="fill:#2ca02c;stroke:#2ca02c;stroke-width:3;" x="394.586708" xlink:href="#m944a0f6df9" y="174.587858"/>
     <use style="fill:#2ca02c;stroke:#2ca02c;stroke-width:3;" x="461.700497" xlink:href="#m944a0f6df9" y="230.82976"/>
     <use style="fill:#2ca02c;stroke:#2ca02c;stroke-width:3;" x="599.391185" xlink:href="#m944a0f6df9" y="313.646301"/>
     <use style="fill:#2ca02c;stroke:#2ca02c;stroke-width:3;" x="624.434981" xlink:href="#m944a0f6df9" y="270.278861"/>
    </g>
   </g>
   <g id="line2d_22">
    <path clip-path="url(#pca78129131)" d="M 197.554767 187.97576 
L 231.096254 127.861437 
L 300.757381 158.831974 
L 434.645065 180.221489 
L 493.383674 306.046482 
L 605.794309 378.594076 
" style="fill:none;stroke:#d62728;stroke-linecap:round;stroke-width:4;"/>
   </g>
   <g id="line2d_23">
    <defs>
     <path d="M 0 4 
L 0 -4 
" id="mfc8382b18f" style="stroke:#d62728;stroke-width:3;"/>
    </defs>
    <g clip-path="url(#pca78129131)">
     <use style="fill:#d62728;stroke:#d62728;stroke-width:3;" x="187.005776" xlink:href="#mfc8382b18f" y="187.97576"/>
     <use style="fill:#d62728;stroke:#d62728;stroke-width:3;" x="214.878946" xlink:href="#mfc8382b18f" y="127.861437"/>
     <use style="fill:#d62728;stroke:#d62728;stroke-width:3;" x="274.102249" xlink:href="#mfc8382b18f" y="158.831974"/>
     <use style="fill:#d62728;stroke:#d62728;stroke-width:3;" x="407.04581" xlink:href="#mfc8382b18f" y="180.221489"/>
     <use style="fill:#d62728;stroke:#d62728;stroke-width:3;" x="477.870523" xlink:href="#mfc8382b18f" y="306.046482"/>
     <use style="fill:#d62728;stroke:#d62728;stroke-width:3;" x="588.390148" xlink:href="#mfc8382b18f" y="378.594076"/>
    </g>
   </g>
   <g id="line2d_24">
    <g clip-path="url(#pca78129131)">
     <use style="fill:#d62728;stroke:#d62728;stroke-width:3;" x="208.103758" xlink:href="#mfc8382b18f" y="187.97576"/>
     <use style="fill:#d62728;stroke:#d62728;stroke-width:3;" x="247.313562" xlink:href="#mfc8382b18f" y="127.861437"/>
     <use style="fill:#d62728;stroke:#d62728;stroke-width:3;" x="327.412513" xlink:href="#mfc8382b18f" y="158.831974"/>
     <use style="fill:#d62728;stroke:#d62728;stroke-width:3;" x="462.24432" xlink:href="#mfc8382b18f" y="180.221489"/>
     <use style="fill:#d62728;stroke:#d62728;stroke-width:3;" x="508.896825" xlink:href="#mfc8382b18f" y="306.046482"/>
     <use style="fill:#d62728;stroke:#d62728;stroke-width:3;" x="623.198469" xlink:href="#mfc8382b18f" y="378.594076"/>
    </g>
   </g>
   <g id="line2d_25">
    <defs>
     <path d="M 4 0 
L -4 -0 
" id="mf050a31d0c" style="stroke:#d62728;stroke-width:3;"/>
    </defs>
    <g clip-path="url(#pca78129131)">
     <use style="fill:#d62728;stroke:#d62728;stroke-width:3;" x="197.554767" xlink:href="#mf050a31d0c" y="206.519938"/>
     <use style="fill:#d62728;stroke:#d62728;stroke-width:3;" x="231.096254" xlink:href="#mf050a31d0c" y="150.092174"/>
     <use style="fill:#d62728;stroke:#d62728;stroke-width:3;" x="300.757381" xlink:href="#mf050a31d0c" y="173.314161"/>
     <use style="fill:#d62728;stroke:#d62728;stroke-width:3;" x="434.645065" xlink:href="#mf050a31d0c" y="201.71722"/>
     <use style="fill:#d62728;stroke:#d62728;stroke-width:3;" x="493.383674" xlink:href="#mf050a31d0c" y="323.989595"/>
     <use style="fill:#d62728;stroke:#d62728;stroke-width:3;" x="605.794309" xlink:href="#mf050a31d0c" y="430.739189"/>
    </g>
   </g>
   <g id="line2d_26">
    <g clip-path="url(#pca78129131)">
     <use style="fill:#d62728;stroke:#d62728;stroke-width:3;" x="197.554767" xlink:href="#mf050a31d0c" y="169.431582"/>
     <use style="fill:#d62728;stroke:#d62728;stroke-width:3;" x="231.096254" xlink:href="#mf050a31d0c" y="105.6307"/>
     <use style="fill:#d62728;stroke:#d62728;stroke-width:3;" x="300.757381" xlink:href="#mf050a31d0c" y="144.349788"/>
     <use style="fill:#d62728;stroke:#d62728;stroke-width:3;" x="434.645065" xlink:href="#mf050a31d0c" y="158.725759"/>
     <use style="fill:#d62728;stroke:#d62728;stroke-width:3;" x="493.383674" xlink:href="#mf050a31d0c" y="288.103369"/>
     <use style="fill:#d62728;stroke:#d62728;stroke-width:3;" x="605.794309" xlink:href="#mf050a31d0c" y="326.448963"/>
    </g>
   </g>
   <g id="line2d_27">
    <defs>
     <path d="M 0 3 
C 0.795609 3 1.55874 2.683901 2.12132 2.12132 
C 2.683901 1.55874 3 0.795609 3 0 
C 3 -0.795609 2.683901 -1.55874 2.12132 -2.12132 
C 1.55874 -2.683901 0.795609 -3 0 -3 
C -0.795609 -3 -1.55874 -2.683901 -2.12132 -2.12132 
C -2.683901 -1.55874 -3 -0.795609 -3 0 
C -3 0.795609 -2.683901 1.55874 -2.12132 2.12132 
C -1.55874 2.683901 -0.795609 3 0 3 
z
" id="m832a509641" style="stroke:#1f77b4;"/>
    </defs>
    <g clip-path="url(#pca78129131)">
     <use style="fill:#1f77b4;stroke:#1f77b4;" x="265.701447" xlink:href="#m832a509641" y="387.652914"/>
     <use style="fill:#1f77b4;stroke:#1f77b4;" x="282.334418" xlink:href="#m832a509641" y="276.02398"/>
     <use style="fill:#1f77b4;stroke:#1f77b4;" x="334.774879" xlink:href="#m832a509641" y="188.706003"/>
     <use style="fill:#1f77b4;stroke:#1f77b4;" x="434.668663" xlink:href="#m832a509641" y="171.592642"/>
     <use style="fill:#1f77b4;stroke:#1f77b4;" x="463.364286" xlink:href="#m832a509641" y="233.421663"/>
     <use style="fill:#1f77b4;stroke:#1f77b4;" x="596.628588" xlink:href="#m832a509641" y="308.287255"/>
     <use style="fill:#1f77b4;stroke:#1f77b4;" x="674.022052" xlink:href="#m832a509641" y="354.663218"/>
     <use style="fill:#1f77b4;stroke:#1f77b4;" x="696.903153" xlink:href="#m832a509641" y="417.8625"/>
    </g>
   </g>
   <g id="line2d_28">
    <defs>
     <path d="M 0 3 
C 0.795609 3 1.55874 2.683901 2.12132 2.12132 
C 2.683901 1.55874 3 0.795609 3 0 
C 3 -0.795609 2.683901 -1.55874 2.12132 -2.12132 
C 1.55874 -2.683901 0.795609 -3 0 -3 
C -0.795609 -3 -1.55874 -2.683901 -2.12132 -2.12132 
C -2.683901 -1.55874 -3 -0.795609 -3 0 
C -3 0.795609 -2.683901 1.55874 -2.12132 2.12132 
C -1.55874 2.683901 -0.795609 3 0 3 
z
" id="md11e2453da" style="stroke:#ff7f0e;"/>
    </defs>
    <g clip-path="url(#pca78129131)">
     <use style="fill:#ff7f0e;stroke:#ff7f0e;" x="263.052202" xlink:href="#md11e2453da" y="247.332929"/>
     <use style="fill:#ff7f0e;stroke:#ff7f0e;" x="267.535763" xlink:href="#md11e2453da" y="168.351112"/>
     <use style="fill:#ff7f0e;stroke:#ff7f0e;" x="351.51472" xlink:href="#md11e2453da" y="132.484389"/>
     <use style="fill:#ff7f0e;stroke:#ff7f0e;" x="433.450524" xlink:href="#md11e2453da" y="156.211829"/>
     <use style="fill:#ff7f0e;stroke:#ff7f0e;" x="473.466185" xlink:href="#md11e2453da" y="225.816937"/>
     <use style="fill:#ff7f0e;stroke:#ff7f0e;" x="608.978181" xlink:href="#md11e2453da" y="327.753173"/>
    </g>
   </g>
   <g id="line2d_29">
    <defs>
     <path d="M 0 3 
C 0.795609 3 1.55874 2.683901 2.12132 2.12132 
C 2.683901 1.55874 3 0.795609 3 0 
C 3 -0.795609 2.683901 -1.55874 2.12132 -2.12132 
C 1.55874 -2.683901 0.795609 -3 0 -3 
C -0.795609 -3 -1.55874 -2.683901 -2.12132 -2.12132 
C -2.683901 -1.55874 -3 -0.795609 -3 0 
C -3 0.795609 -2.683901 1.55874 -2.12132 2.12132 
C -1.55874 2.683901 -0.795609 3 0 3 
z
" id="mf1d228522d" style="stroke:#2ca02c;"/>
    </defs>
    <g clip-path="url(#pca78129131)">
     <use style="fill:#2ca02c;stroke:#2ca02c;" x="253.625695" xlink:href="#mf1d228522d" y="322.369255"/>
     <use style="fill:#2ca02c;stroke:#2ca02c;" x="240.226566" xlink:href="#mf1d228522d" y="179.122429"/>
     <use style="fill:#2ca02c;stroke:#2ca02c;" x="332.916534" xlink:href="#mf1d228522d" y="207.514387"/>
     <use style="fill:#2ca02c;stroke:#2ca02c;" x="394.586708" xlink:href="#mf1d228522d" y="196.971829"/>
     <use style="fill:#2ca02c;stroke:#2ca02c;" x="461.700497" xlink:href="#mf1d228522d" y="257.734471"/>
     <use style="fill:#2ca02c;stroke:#2ca02c;" x="599.391185" xlink:href="#mf1d228522d" y="342.311147"/>
     <use style="fill:#2ca02c;stroke:#2ca02c;" x="624.434981" xlink:href="#mf1d228522d" y="336.04177"/>
    </g>
   </g>
   <g id="line2d_30">
    <defs>
     <path d="M 0 3 
C 0.795609 3 1.55874 2.683901 2.12132 2.12132 
C 2.683901 1.55874 3 0.795609 3 0 
C 3 -0.795609 2.683901 -1.55874 2.12132 -2.12132 
C 1.55874 -2.683901 0.795609 -3 0 -3 
C -0.795609 -3 -1.55874 -2.683901 -2.12132 -2.12132 
C -2.683901 -1.55874 -3 -0.795609 -3 0 
C -3 0.795609 -2.683901 1.55874 -2.12132 2.12132 
C -1.55874 2.683901 -0.795609 3 0 3 
z
" id="m870a26a8a8" style="stroke:#d62728;"/>
    </defs>
    <g clip-path="url(#pca78129131)">
     <use style="fill:#d62728;stroke:#d62728;" x="197.554767" xlink:href="#m870a26a8a8" y="187.97576"/>
     <use style="fill:#d62728;stroke:#d62728;" x="231.096254" xlink:href="#m870a26a8a8" y="127.861437"/>
     <use style="fill:#d62728;stroke:#d62728;" x="300.757381" xlink:href="#m870a26a8a8" y="158.831974"/>
     <use style="fill:#d62728;stroke:#d62728;" x="434.645065" xlink:href="#m870a26a8a8" y="180.221489"/>
     <use style="fill:#d62728;stroke:#d62728;" x="493.383674" xlink:href="#m870a26a8a8" y="306.046482"/>
     <use style="fill:#d62728;stroke:#d62728;" x="605.794309" xlink:href="#m870a26a8a8" y="378.594076"/>
    </g>
   </g>
   <g id="patch_3">
    <path d="M 160.65 456.66 
L 160.65 67.08 
" style="fill:none;stroke:#262626;stroke-linecap:square;stroke-linejoin:miter;stroke-width:1.25;"/>
   </g>
   <g id="patch_4">
    <path d="M 160.65 456.66 
L 740.477071 456.66 
" style="fill:none;stroke:#262626;stroke-linecap:square;stroke-linejoin:miter;stroke-width:1.25;"/>
   </g>
   <g id="legend_1">
    <g id="text_11">
     <!-- Genotype -->
     <g style="fill:#262626;" transform="translate(750.927177 174.928125)scale(0.36 -0.36)">
      <defs>
       <path d="M 3809 666 
L 3809 1919 
L 2778 1919 
L 2778 2438 
L 4434 2438 
L 4434 434 
Q 4069 175 3628 42 
Q 3188 -91 2688 -91 
Q 1594 -91 976 548 
Q 359 1188 359 2328 
Q 359 3472 976 4111 
Q 1594 4750 2688 4750 
Q 3144 4750 3555 4637 
Q 3966 4525 4313 4306 
L 4313 3634 
Q 3963 3931 3569 4081 
Q 3175 4231 2741 4231 
Q 1884 4231 1454 3753 
Q 1025 3275 1025 2328 
Q 1025 1384 1454 906 
Q 1884 428 2741 428 
Q 3075 428 3337 486 
Q 3600 544 3809 666 
z
" id="DejaVuSans-47" transform="scale(0.015625)"/>
       <path d="M 1959 3097 
Q 1497 3097 1228 2736 
Q 959 2375 959 1747 
Q 959 1119 1226 758 
Q 1494 397 1959 397 
Q 2419 397 2687 759 
Q 2956 1122 2956 1747 
Q 2956 2369 2687 2733 
Q 2419 3097 1959 3097 
z
M 1959 3584 
Q 2709 3584 3137 3096 
Q 3566 2609 3566 1747 
Q 3566 888 3137 398 
Q 2709 -91 1959 -91 
Q 1206 -91 779 398 
Q 353 888 353 1747 
Q 353 2609 779 3096 
Q 1206 3584 1959 3584 
z
" id="DejaVuSans-6f" transform="scale(0.015625)"/>
       <path d="M 2059 -325 
Q 1816 -950 1584 -1140 
Q 1353 -1331 966 -1331 
L 506 -1331 
L 506 -850 
L 844 -850 
Q 1081 -850 1212 -737 
Q 1344 -625 1503 -206 
L 1606 56 
L 191 3500 
L 800 3500 
L 1894 763 
L 2988 3500 
L 3597 3500 
L 2059 -325 
z
" id="DejaVuSans-79" transform="scale(0.015625)"/>
       <path d="M 1159 525 
L 1159 -1331 
L 581 -1331 
L 581 3500 
L 1159 3500 
L 1159 2969 
Q 1341 3281 1617 3432 
Q 1894 3584 2278 3584 
Q 2916 3584 3314 3078 
Q 3713 2572 3713 1747 
Q 3713 922 3314 415 
Q 2916 -91 2278 -91 
Q 1894 -91 1617 61 
Q 1341 213 1159 525 
z
M 3116 1747 
Q 3116 2381 2855 2742 
Q 2594 3103 2138 3103 
Q 1681 3103 1420 2742 
Q 1159 2381 1159 1747 
Q 1159 1113 1420 752 
Q 1681 391 2138 391 
Q 2594 391 2855 752 
Q 3116 1113 3116 1747 
z
" id="DejaVuSans-70" transform="scale(0.015625)"/>
      </defs>
      <use xlink:href="#DejaVuSans-47"/>
      <use x="77.490234" xlink:href="#DejaVuSans-65"/>
      <use x="139.013672" xlink:href="#DejaVuSans-6e"/>
      <use x="202.392578" xlink:href="#DejaVuSans-6f"/>
      <use x="263.574219" xlink:href="#DejaVuSans-74"/>
      <use x="302.783203" xlink:href="#DejaVuSans-79"/>
      <use x="361.962891" xlink:href="#DejaVuSans-70"/>
      <use x="425.439453" xlink:href="#DejaVuSans-65"/>
     </g>
    </g>
    <g id="line2d_31">
     <path d="M 712.194364 212.439844 
L 778.194364 212.439844 
" style="fill:none;stroke:#ffffff;stroke-linecap:round;stroke-width:1.5;"/>
    </g>
    <g id="line2d_32">
     <defs>
      <path d="M 0 7.5 
C 1.989023 7.5 3.896849 6.709753 5.303301 5.303301 
C 6.709753 3.896849 7.5 1.989023 7.5 0 
C 7.5 -1.989023 6.709753 -3.896849 5.303301 -5.303301 
C 3.896849 -6.709753 1.989023 -7.5 0 -7.5 
C -1.989023 -7.5 -3.896849 -6.709753 -5.303301 -5.303301 
C -6.709753 -3.896849 -7.5 -1.989023 -7.5 0 
C -7.5 1.989023 -6.709753 3.896849 -5.303301 5.303301 
C -3.896849 6.709753 -1.989023 7.5 0 7.5 
z
" id="m3dc9b0450c" style="stroke:#ffffff;"/>
     </defs>
     <g>
      <use style="fill:#1f77b4;stroke:#ffffff;" x="745.194364" xlink:href="#m3dc9b0450c" y="212.439844"/>
     </g>
    </g>
    <g id="text_12">
     <!-- Col-0 -->
     <g style="fill:#262626;" transform="translate(804.594364 223.989844)scale(0.33 -0.33)">
      <defs>
       <path d="M 4122 4306 
L 4122 3641 
Q 3803 3938 3442 4084 
Q 3081 4231 2675 4231 
Q 1875 4231 1450 3742 
Q 1025 3253 1025 2328 
Q 1025 1406 1450 917 
Q 1875 428 2675 428 
Q 3081 428 3442 575 
Q 3803 722 4122 1019 
L 4122 359 
Q 3791 134 3420 21 
Q 3050 -91 2638 -91 
Q 1578 -91 968 557 
Q 359 1206 359 2328 
Q 359 3453 968 4101 
Q 1578 4750 2638 4750 
Q 3056 4750 3426 4639 
Q 3797 4528 4122 4306 
z
" id="DejaVuSans-43" transform="scale(0.015625)"/>
       <path d="M 313 2009 
L 1997 2009 
L 1997 1497 
L 313 1497 
L 313 2009 
z
" id="DejaVuSans-2d" transform="scale(0.015625)"/>
      </defs>
      <use xlink:href="#DejaVuSans-43"/>
      <use x="69.824219" xlink:href="#DejaVuSans-6f"/>
      <use x="131.005859" xlink:href="#DejaVuSans-6c"/>
      <use x="158.789062" xlink:href="#DejaVuSans-2d"/>
      <use x="194.873047" xlink:href="#DejaVuSans-30"/>
     </g>
    </g>
    <g id="line2d_33">
     <path d="M 712.194364 260.877656 
L 778.194364 260.877656 
" style="fill:none;stroke:#ffffff;stroke-linecap:round;stroke-width:1.5;"/>
    </g>
    <g id="line2d_34">
     <defs>
      <path d="M 0 7.5 
C 1.989023 7.5 3.896849 6.709753 5.303301 5.303301 
C 6.709753 3.896849 7.5 1.989023 7.5 0 
C 7.5 -1.989023 6.709753 -3.896849 5.303301 -5.303301 
C 3.896849 -6.709753 1.989023 -7.5 0 -7.5 
C -1.989023 -7.5 -3.896849 -6.709753 -5.303301 -5.303301 
C -6.709753 -3.896849 -7.5 -1.989023 -7.5 0 
C -7.5 1.989023 -6.709753 3.896849 -5.303301 5.303301 
C -3.896849 6.709753 -1.989023 7.5 0 7.5 
z
" id="m28725f1976" style="stroke:#ffffff;"/>
     </defs>
     <g>
      <use style="fill:#ff7f0e;stroke:#ffffff;" x="745.194364" xlink:href="#m28725f1976" y="260.877656"/>
     </g>
    </g>
    <g id="text_13">
     <!-- $abcb1$ -->
     <g style="fill:#262626;" transform="translate(804.594364 272.427656)scale(0.33 -0.33)">
      <defs>
       <path d="M 3438 1997 
L 3047 0 
L 2472 0 
L 2578 531 
Q 2325 219 2001 64 
Q 1678 -91 1281 -91 
Q 834 -91 548 182 
Q 263 456 263 884 
Q 263 1497 752 1853 
Q 1241 2209 2100 2209 
L 2900 2209 
L 2931 2363 
Q 2938 2388 2941 2417 
Q 2944 2447 2944 2509 
Q 2944 2788 2717 2942 
Q 2491 3097 2081 3097 
Q 1800 3097 1504 3025 
Q 1209 2953 897 2809 
L 997 3341 
Q 1322 3463 1633 3523 
Q 1944 3584 2234 3584 
Q 2853 3584 3176 3315 
Q 3500 3047 3500 2534 
Q 3500 2431 3484 2292 
Q 3469 2153 3438 1997 
z
M 2816 1759 
L 2241 1759 
Q 1534 1759 1195 1570 
Q 856 1381 856 984 
Q 856 709 1029 553 
Q 1203 397 1509 397 
Q 1978 397 2328 733 
Q 2678 1069 2791 1631 
L 2816 1759 
z
" id="DejaVuSans-Oblique-61" transform="scale(0.015625)"/>
       <path d="M 3169 2138 
Q 3169 2591 2961 2847 
Q 2753 3103 2388 3103 
Q 2122 3103 1889 2973 
Q 1656 2844 1484 2597 
Q 1303 2338 1198 1995 
Q 1094 1653 1094 1313 
Q 1094 881 1298 636 
Q 1503 391 1863 391 
Q 2134 391 2365 517 
Q 2597 644 2772 891 
Q 2950 1147 3059 1487 
Q 3169 1828 3169 2138 
z
M 1381 2969 
Q 1594 3256 1914 3420 
Q 2234 3584 2584 3584 
Q 3122 3584 3439 3221 
Q 3756 2859 3756 2241 
Q 3756 1734 3570 1259 
Q 3384 784 3041 416 
Q 2816 172 2522 40 
Q 2228 -91 1906 -91 
Q 1566 -91 1316 65 
Q 1066 222 909 531 
L 806 0 
L 231 0 
L 1178 4863 
L 1753 4863 
L 1381 2969 
z
" id="DejaVuSans-Oblique-62" transform="scale(0.015625)"/>
       <path d="M 3431 3366 
L 3316 2797 
Q 3109 2947 2876 3022 
Q 2644 3097 2394 3097 
Q 2119 3097 1870 3000 
Q 1622 2903 1453 2725 
Q 1184 2453 1037 2087 
Q 891 1722 891 1331 
Q 891 859 1127 628 
Q 1363 397 1844 397 
Q 2081 397 2348 469 
Q 2616 541 2906 684 
L 2797 116 
Q 2547 13 2283 -39 
Q 2019 -91 1741 -91 
Q 1044 -91 669 257 
Q 294 606 294 1253 
Q 294 1797 489 2255 
Q 684 2713 1069 3078 
Q 1331 3328 1684 3456 
Q 2038 3584 2456 3584 
Q 2700 3584 2940 3529 
Q 3181 3475 3431 3366 
z
" id="DejaVuSans-Oblique-63" transform="scale(0.015625)"/>
      </defs>
      <use transform="translate(0 0.015625)" xlink:href="#DejaVuSans-Oblique-61"/>
      <use transform="translate(61.279297 0.015625)" xlink:href="#DejaVuSans-Oblique-62"/>
      <use transform="translate(124.755859 0.015625)" xlink:href="#DejaVuSans-Oblique-63"/>
      <use transform="translate(179.736328 0.015625)" xlink:href="#DejaVuSans-Oblique-62"/>
      <use transform="translate(243.212891 0.015625)" xlink:href="#DejaVuSans-31"/>
     </g>
    </g>
    <g id="line2d_35">
     <path d="M 712.194364 309.315469 
L 778.194364 309.315469 
" style="fill:none;stroke:#ffffff;stroke-linecap:round;stroke-width:1.5;"/>
    </g>
    <g id="line2d_36">
     <defs>
      <path d="M 0 7.5 
C 1.989023 7.5 3.896849 6.709753 5.303301 5.303301 
C 6.709753 3.896849 7.5 1.989023 7.5 0 
C 7.5 -1.989023 6.709753 -3.896849 5.303301 -5.303301 
C 3.896849 -6.709753 1.989023 -7.5 0 -7.5 
C -1.989023 -7.5 -3.896849 -6.709753 -5.303301 -5.303301 
C -6.709753 -3.896849 -7.5 -1.989023 -7.5 0 
C -7.5 1.989023 -6.709753 3.896849 -5.303301 5.303301 
C -3.896849 6.709753 -1.989023 7.5 0 7.5 
z
" id="me74892db97" style="stroke:#ffffff;"/>
     </defs>
     <g>
      <use style="fill:#2ca02c;stroke:#ffffff;" x="745.194364" xlink:href="#me74892db97" y="309.315469"/>
     </g>
    </g>
    <g id="text_14">
     <!-- $abcb19$ -->
     <g style="fill:#262626;" transform="translate(804.594364 320.865469)scale(0.33 -0.33)">
      <defs>
       <path d="M 703 97 
L 703 672 
Q 941 559 1184 500 
Q 1428 441 1663 441 
Q 2288 441 2617 861 
Q 2947 1281 2994 2138 
Q 2813 1869 2534 1725 
Q 2256 1581 1919 1581 
Q 1219 1581 811 2004 
Q 403 2428 403 3163 
Q 403 3881 828 4315 
Q 1253 4750 1959 4750 
Q 2769 4750 3195 4129 
Q 3622 3509 3622 2328 
Q 3622 1225 3098 567 
Q 2575 -91 1691 -91 
Q 1453 -91 1209 -44 
Q 966 3 703 97 
z
M 1959 2075 
Q 2384 2075 2632 2365 
Q 2881 2656 2881 3163 
Q 2881 3666 2632 3958 
Q 2384 4250 1959 4250 
Q 1534 4250 1286 3958 
Q 1038 3666 1038 3163 
Q 1038 2656 1286 2365 
Q 1534 2075 1959 2075 
z
" id="DejaVuSans-39" transform="scale(0.015625)"/>
      </defs>
      <use transform="translate(0 0.015625)" xlink:href="#DejaVuSans-Oblique-61"/>
      <use transform="translate(61.279297 0.015625)" xlink:href="#DejaVuSans-Oblique-62"/>
      <use transform="translate(124.755859 0.015625)" xlink:href="#DejaVuSans-Oblique-63"/>
      <use transform="translate(179.736328 0.015625)" xlink:href="#DejaVuSans-Oblique-62"/>
      <use transform="translate(243.212891 0.015625)" xlink:href="#DejaVuSans-31"/>
      <use transform="translate(306.835938 0.015625)" xlink:href="#DejaVuSans-39"/>
     </g>
    </g>
    <g id="line2d_37">
     <path d="M 712.194364 357.753281 
L 778.194364 357.753281 
" style="fill:none;stroke:#ffffff;stroke-linecap:round;stroke-width:1.5;"/>
    </g>
    <g id="line2d_38">
     <defs>
      <path d="M 0 7.5 
C 1.989023 7.5 3.896849 6.709753 5.303301 5.303301 
C 6.709753 3.896849 7.5 1.989023 7.5 0 
C 7.5 -1.989023 6.709753 -3.896849 5.303301 -5.303301 
C 3.896849 -6.709753 1.989023 -7.5 0 -7.5 
C -1.989023 -7.5 -3.896849 -6.709753 -5.303301 -5.303301 
C -6.709753 -3.896849 -7.5 -1.989023 -7.5 0 
C -7.5 1.989023 -6.709753 3.896849 -5.303301 5.303301 
C -3.896849 6.709753 -1.989023 7.5 0 7.5 
z
" id="mf63e295ef0" style="stroke:#ffffff;"/>
     </defs>
     <g>
      <use style="fill:#d62728;stroke:#ffffff;" x="745.194364" xlink:href="#mf63e295ef0" y="357.753281"/>
     </g>
    </g>
    <g id="text_15">
     <!-- $abcb1,19$ -->
     <g style="fill:#262626;" transform="translate(804.594364 369.303281)scale(0.33 -0.33)">
      <defs>
       <path d="M 750 794 
L 1409 794 
L 1409 256 
L 897 -744 
L 494 -744 
L 750 256 
L 750 794 
z
" id="DejaVuSans-2c" transform="scale(0.015625)"/>
      </defs>
      <use transform="translate(0 0.015625)" xlink:href="#DejaVuSans-Oblique-61"/>
      <use transform="translate(61.279297 0.015625)" xlink:href="#DejaVuSans-Oblique-62"/>
      <use transform="translate(124.755859 0.015625)" xlink:href="#DejaVuSans-Oblique-63"/>
      <use transform="translate(179.736328 0.015625)" xlink:href="#DejaVuSans-Oblique-62"/>
      <use transform="translate(243.212891 0.015625)" xlink:href="#DejaVuSans-31"/>
      <use transform="translate(306.835938 0.015625)" xlink:href="#DejaVuSans-2c"/>
      <use transform="translate(358.105469 0.015625)" xlink:href="#DejaVuSans-31"/>
      <use transform="translate(421.728516 0.015625)" xlink:href="#DejaVuSans-39"/>
     </g>
    </g>
   </g>
  </g>
 </g>
 <defs>
  <clipPath id="pca78129131">
   <rect height="389.58" width="579.827071" x="160.65" y="67.08"/>
  </clipPath>
 </defs>
</svg>
