<?xml version="1.0" encoding="utf-8" standalone="no"?>
<!DOCTYPE svg PUBLIC "-//W3C//DTD SVG 1.1//EN"
  "http://www.w3.org/Graphics/SVG/1.1/DTD/svg11.dtd">
<svg height="576pt" version="1.1" viewBox="0 0 1008 576" width="1008pt" xmlns="http://www.w3.org/2000/svg" xmlns:xlink="http://www.w3.org/1999/xlink">
 <metadata>
  <rdf:RDF xmlns:cc="http://creativecommons.org/ns#" xmlns:dc="http://purl.org/dc/elements/1.1/" xmlns:rdf="http://www.w3.org/1999/02/22-rdf-syntax-ns#">
   <cc:Work>
    <dc:type rdf:resource="http://purl.org/dc/dcmitype/StillImage"/>
    <dc:date>2021-11-29T14:59:31.572211</dc:date>
    <dc:format>image/svg+xml</dc:format>
    <dc:creator>
     <cc:Agent>
      <dc:title>Matplotlib v3.4.1, https://matplotlib.org/</dc:title>
     </cc:Agent>
    </dc:creator>
   </cc:Work>
  </rdf:RDF>
 </metadata>
 <defs>
  <style type="text/css">*{stroke-linecap:butt;stroke-linejoin:round;}</style>
 </defs>
 <g id="figure_1">
  <g id="patch_1">
   <path d="M 0 576 
L 1008 576 
L 1008 0 
L 0 0 
z
" style="fill:#ffffff;"/>
  </g>
  <g id="axes_1">
   <g id="patch_2">
    <path d="M 150.03 306.061628 
L 969.12 306.061628 
L 969.12 41.960881 
L 150.03 41.960881 
z
" style="fill:#ffffff;"/>
   </g>
   <g id="matplotlib.axis_1">
    <g id="xtick_1">
     <g id="line2d_1">
      <defs>
       <path d="M 0 0 
L 0 6 
" id="m68b30029f6" style="stroke:#262626;stroke-width:1.25;"/>
      </defs>
      <g>
       <use style="fill:#262626;stroke:#262626;stroke-width:1.25;" x="181.533462" xlink:href="#m68b30029f6" y="306.061628"/>
      </g>
     </g>
     <g id="text_1">
      <!-- Col-0 -->
      <g style="fill:#262626;" transform="translate(116.360866 393.611964)rotate(-45)scale(0.33 -0.33)">
       <defs>
        <path d="M 4122 4306 
L 4122 3641 
Q 3803 3938 3442 4084 
Q 3081 4231 2675 4231 
Q 1875 4231 1450 3742 
Q 1025 3253 1025 2328 
Q 1025 1406 1450 917 
Q 1875 428 2675 428 
Q 3081 428 3442 575 
Q 3803 722 4122 1019 
L 4122 359 
Q 3791 134 3420 21 
Q 3050 -91 2638 -91 
Q 1578 -91 968 557 
Q 359 1206 359 2328 
Q 359 3453 968 4101 
Q 1578 4750 2638 4750 
Q 3056 4750 3426 4639 
Q 3797 4528 4122 4306 
z
" id="DejaVuSans-43" transform="scale(0.015625)"/>
        <path d="M 1959 3097 
Q 1497 3097 1228 2736 
Q 959 2375 959 1747 
Q 959 1119 1226 758 
Q 1494 397 1959 397 
Q 2419 397 2687 759 
Q 2956 1122 2956 1747 
Q 2956 2369 2687 2733 
Q 2419 3097 1959 3097 
z
M 1959 3584 
Q 2709 3584 3137 3096 
Q 3566 2609 3566 1747 
Q 3566 888 3137 398 
Q 2709 -91 1959 -91 
Q 1206 -91 779 398 
Q 353 888 353 1747 
Q 353 2609 779 3096 
Q 1206 3584 1959 3584 
z
" id="DejaVuSans-6f" transform="scale(0.015625)"/>
        <path d="M 603 4863 
L 1178 4863 
L 1178 0 
L 603 0 
L 603 4863 
z
" id="DejaVuSans-6c" transform="scale(0.015625)"/>
        <path d="M 313 2009 
L 1997 2009 
L 1997 1497 
L 313 1497 
L 313 2009 
z
" id="DejaVuSans-2d" transform="scale(0.015625)"/>
        <path d="M 2034 4250 
Q 1547 4250 1301 3770 
Q 1056 3291 1056 2328 
Q 1056 1369 1301 889 
Q 1547 409 2034 409 
Q 2525 409 2770 889 
Q 3016 1369 3016 2328 
Q 3016 3291 2770 3770 
Q 2525 4250 2034 4250 
z
M 2034 4750 
Q 2819 4750 3233 4129 
Q 3647 3509 3647 2328 
Q 3647 1150 3233 529 
Q 2819 -91 2034 -91 
Q 1250 -91 836 529 
Q 422 1150 422 2328 
Q 422 3509 836 4129 
Q 1250 4750 2034 4750 
z
" id="DejaVuSans-30" transform="scale(0.015625)"/>
       </defs>
       <use xlink:href="#DejaVuSans-43"/>
       <use x="69.824219" xlink:href="#DejaVuSans-6f"/>
       <use x="131.005859" xlink:href="#DejaVuSans-6c"/>
       <use x="158.789062" xlink:href="#DejaVuSans-2d"/>
       <use x="194.873047" xlink:href="#DejaVuSans-30"/>
      </g>
     </g>
    </g>
    <g id="xtick_2">
     <g id="line2d_2">
      <g>
       <use style="fill:#262626;stroke:#262626;stroke-width:1.25;" x="244.540385" xlink:href="#m68b30029f6" y="306.061628"/>
      </g>
     </g>
     <g id="text_2">
      <!-- $abcb1$ -->
      <g style="fill:#262626;" transform="translate(168.050545 404.929208)rotate(-45)scale(0.33 -0.33)">
       <defs>
        <path d="M 3438 1997 
L 3047 0 
L 2472 0 
L 2578 531 
Q 2325 219 2001 64 
Q 1678 -91 1281 -91 
Q 834 -91 548 182 
Q 263 456 263 884 
Q 263 1497 752 1853 
Q 1241 2209 2100 2209 
L 2900 2209 
L 2931 2363 
Q 2938 2388 2941 2417 
Q 2944 2447 2944 2509 
Q 2944 2788 2717 2942 
Q 2491 3097 2081 3097 
Q 1800 3097 1504 3025 
Q 1209 2953 897 2809 
L 997 3341 
Q 1322 3463 1633 3523 
Q 1944 3584 2234 3584 
Q 2853 3584 3176 3315 
Q 3500 3047 3500 2534 
Q 3500 2431 3484 2292 
Q 3469 2153 3438 1997 
z
M 2816 1759 
L 2241 1759 
Q 1534 1759 1195 1570 
Q 856 1381 856 984 
Q 856 709 1029 553 
Q 1203 397 1509 397 
Q 1978 397 2328 733 
Q 2678 1069 2791 1631 
L 2816 1759 
z
" id="DejaVuSans-Oblique-61" transform="scale(0.015625)"/>
        <path d="M 3169 2138 
Q 3169 2591 2961 2847 
Q 2753 3103 2388 3103 
Q 2122 3103 1889 2973 
Q 1656 2844 1484 2597 
Q 1303 2338 1198 1995 
Q 1094 1653 1094 1313 
Q 1094 881 1298 636 
Q 1503 391 1863 391 
Q 2134 391 2365 517 
Q 2597 644 2772 891 
Q 2950 1147 3059 1487 
Q 3169 1828 3169 2138 
z
M 1381 2969 
Q 1594 3256 1914 3420 
Q 2234 3584 2584 3584 
Q 3122 3584 3439 3221 
Q 3756 2859 3756 2241 
Q 3756 1734 3570 1259 
Q 3384 784 3041 416 
Q 2816 172 2522 40 
Q 2228 -91 1906 -91 
Q 1566 -91 1316 65 
Q 1066 222 909 531 
L 806 0 
L 231 0 
L 1178 4863 
L 1753 4863 
L 1381 2969 
z
" id="DejaVuSans-Oblique-62" transform="scale(0.015625)"/>
        <path d="M 3431 3366 
L 3316 2797 
Q 3109 2947 2876 3022 
Q 2644 3097 2394 3097 
Q 2119 3097 1870 3000 
Q 1622 2903 1453 2725 
Q 1184 2453 1037 2087 
Q 891 1722 891 1331 
Q 891 859 1127 628 
Q 1363 397 1844 397 
Q 2081 397 2348 469 
Q 2616 541 2906 684 
L 2797 116 
Q 2547 13 2283 -39 
Q 2019 -91 1741 -91 
Q 1044 -91 669 257 
Q 294 606 294 1253 
Q 294 1797 489 2255 
Q 684 2713 1069 3078 
Q 1331 3328 1684 3456 
Q 2038 3584 2456 3584 
Q 2700 3584 2940 3529 
Q 3181 3475 3431 3366 
z
" id="DejaVuSans-Oblique-63" transform="scale(0.015625)"/>
        <path d="M 794 531 
L 1825 531 
L 1825 4091 
L 703 3866 
L 703 4441 
L 1819 4666 
L 2450 4666 
L 2450 531 
L 3481 531 
L 3481 0 
L 794 0 
L 794 531 
z
" id="DejaVuSans-31" transform="scale(0.015625)"/>
       </defs>
       <use transform="translate(0 0.015625)" xlink:href="#DejaVuSans-Oblique-61"/>
       <use transform="translate(61.279297 0.015625)" xlink:href="#DejaVuSans-Oblique-62"/>
       <use transform="translate(124.755859 0.015625)" xlink:href="#DejaVuSans-Oblique-63"/>
       <use transform="translate(179.736328 0.015625)" xlink:href="#DejaVuSans-Oblique-62"/>
       <use transform="translate(243.212891 0.015625)" xlink:href="#DejaVuSans-31"/>
      </g>
     </g>
    </g>
    <g id="xtick_3">
     <g id="line2d_3">
      <g>
       <use style="fill:#262626;stroke:#262626;stroke-width:1.25;" x="307.547308" xlink:href="#m68b30029f6" y="306.061628"/>
      </g>
     </g>
     <g id="text_3">
      <!-- $abcb19$ -->
      <g style="fill:#262626;" transform="translate(216.123373 419.863303)rotate(-45)scale(0.33 -0.33)">
       <defs>
        <path d="M 703 97 
L 703 672 
Q 941 559 1184 500 
Q 1428 441 1663 441 
Q 2288 441 2617 861 
Q 2947 1281 2994 2138 
Q 2813 1869 2534 1725 
Q 2256 1581 1919 1581 
Q 1219 1581 811 2004 
Q 403 2428 403 3163 
Q 403 3881 828 4315 
Q 1253 4750 1959 4750 
Q 2769 4750 3195 4129 
Q 3622 3509 3622 2328 
Q 3622 1225 3098 567 
Q 2575 -91 1691 -91 
Q 1453 -91 1209 -44 
Q 966 3 703 97 
z
M 1959 2075 
Q 2384 2075 2632 2365 
Q 2881 2656 2881 3163 
Q 2881 3666 2632 3958 
Q 2384 4250 1959 4250 
Q 1534 4250 1286 3958 
Q 1038 3666 1038 3163 
Q 1038 2656 1286 2365 
Q 1534 2075 1959 2075 
z
" id="DejaVuSans-39" transform="scale(0.015625)"/>
       </defs>
       <use transform="translate(0 0.015625)" xlink:href="#DejaVuSans-Oblique-61"/>
       <use transform="translate(61.279297 0.015625)" xlink:href="#DejaVuSans-Oblique-62"/>
       <use transform="translate(124.755859 0.015625)" xlink:href="#DejaVuSans-Oblique-63"/>
       <use transform="translate(179.736328 0.015625)" xlink:href="#DejaVuSans-Oblique-62"/>
       <use transform="translate(243.212891 0.015625)" xlink:href="#DejaVuSans-31"/>
       <use transform="translate(306.835938 0.015625)" xlink:href="#DejaVuSans-39"/>
      </g>
     </g>
    </g>
    <g id="xtick_4">
     <g id="line2d_4">
      <g>
       <use style="fill:#262626;stroke:#262626;stroke-width:1.25;" x="370.554231" xlink:href="#m68b30029f6" y="306.061628"/>
      </g>
     </g>
     <g id="text_4">
      <!-- $abcb1,19$ -->
      <g style="fill:#262626;" transform="translate(252.295593 446.698006)rotate(-45)scale(0.33 -0.33)">
       <defs>
        <path d="M 750 794 
L 1409 794 
L 1409 256 
L 897 -744 
L 494 -744 
L 750 256 
L 750 794 
z
" id="DejaVuSans-2c" transform="scale(0.015625)"/>
       </defs>
       <use transform="translate(0 0.015625)" xlink:href="#DejaVuSans-Oblique-61"/>
       <use transform="translate(61.279297 0.015625)" xlink:href="#DejaVuSans-Oblique-62"/>
       <use transform="translate(124.755859 0.015625)" xlink:href="#DejaVuSans-Oblique-63"/>
       <use transform="translate(179.736328 0.015625)" xlink:href="#DejaVuSans-Oblique-62"/>
       <use transform="translate(243.212891 0.015625)" xlink:href="#DejaVuSans-31"/>
       <use transform="translate(306.835938 0.015625)" xlink:href="#DejaVuSans-2c"/>
       <use transform="translate(358.105469 0.015625)" xlink:href="#DejaVuSans-31"/>
       <use transform="translate(421.728516 0.015625)" xlink:href="#DejaVuSans-39"/>
      </g>
     </g>
    </g>
    <g id="xtick_5">
     <g id="line2d_5">
      <g>
       <use style="fill:#262626;stroke:#262626;stroke-width:1.25;" x="433.561154" xlink:href="#m68b30029f6" y="306.061628"/>
      </g>
     </g>
     <g id="text_5">
      <!-- $aux1$ -->
      <g style="fill:#262626;" transform="translate(370.838683 391.161839)rotate(-45)scale(0.33 -0.33)">
       <defs>
        <path d="M 428 1388 
L 838 3500 
L 1416 3500 
L 1006 1409 
Q 975 1256 961 1147 
Q 947 1038 947 966 
Q 947 700 1109 554 
Q 1272 409 1569 409 
Q 2031 409 2368 721 
Q 2706 1034 2809 1563 
L 3194 3500 
L 3769 3500 
L 3091 0 
L 2516 0 
L 2631 550 
Q 2388 244 2052 76 
Q 1716 -91 1338 -91 
Q 878 -91 622 161 
Q 366 413 366 863 
Q 366 956 381 1097 
Q 397 1238 428 1388 
z
" id="DejaVuSans-Oblique-75" transform="scale(0.015625)"/>
        <path d="M 3841 3500 
L 2234 1784 
L 3219 0 
L 2559 0 
L 1819 1388 
L 531 0 
L -166 0 
L 1556 1844 
L 641 3500 
L 1300 3500 
L 1972 2234 
L 3144 3500 
L 3841 3500 
z
" id="DejaVuSans-Oblique-78" transform="scale(0.015625)"/>
       </defs>
       <use transform="translate(0 0.09375)" xlink:href="#DejaVuSans-Oblique-61"/>
       <use transform="translate(61.279297 0.09375)" xlink:href="#DejaVuSans-Oblique-75"/>
       <use transform="translate(124.658203 0.09375)" xlink:href="#DejaVuSans-Oblique-78"/>
       <use transform="translate(183.837891 0.09375)" xlink:href="#DejaVuSans-31"/>
      </g>
     </g>
    </g>
    <g id="xtick_6">
     <g id="line2d_6">
      <g>
       <use style="fill:#262626;stroke:#262626;stroke-width:1.25;" x="496.568077" xlink:href="#m68b30029f6" y="306.061628"/>
      </g>
     </g>
     <g id="text_6">
      <!-- $aux1lax1,2,3$ -->
      <g style="fill:#262626;" transform="translate(330.707011 494.300434)rotate(-45)scale(0.33 -0.33)">
       <defs>
        <path d="M 1172 4863 
L 1747 4863 
L 800 0 
L 225 0 
L 1172 4863 
z
" id="DejaVuSans-Oblique-6c" transform="scale(0.015625)"/>
        <path d="M 1228 531 
L 3431 531 
L 3431 0 
L 469 0 
L 469 531 
Q 828 903 1448 1529 
Q 2069 2156 2228 2338 
Q 2531 2678 2651 2914 
Q 2772 3150 2772 3378 
Q 2772 3750 2511 3984 
Q 2250 4219 1831 4219 
Q 1534 4219 1204 4116 
Q 875 4013 500 3803 
L 500 4441 
Q 881 4594 1212 4672 
Q 1544 4750 1819 4750 
Q 2544 4750 2975 4387 
Q 3406 4025 3406 3419 
Q 3406 3131 3298 2873 
Q 3191 2616 2906 2266 
Q 2828 2175 2409 1742 
Q 1991 1309 1228 531 
z
" id="DejaVuSans-32" transform="scale(0.015625)"/>
        <path d="M 2597 2516 
Q 3050 2419 3304 2112 
Q 3559 1806 3559 1356 
Q 3559 666 3084 287 
Q 2609 -91 1734 -91 
Q 1441 -91 1130 -33 
Q 819 25 488 141 
L 488 750 
Q 750 597 1062 519 
Q 1375 441 1716 441 
Q 2309 441 2620 675 
Q 2931 909 2931 1356 
Q 2931 1769 2642 2001 
Q 2353 2234 1838 2234 
L 1294 2234 
L 1294 2753 
L 1863 2753 
Q 2328 2753 2575 2939 
Q 2822 3125 2822 3475 
Q 2822 3834 2567 4026 
Q 2313 4219 1838 4219 
Q 1578 4219 1281 4162 
Q 984 4106 628 3988 
L 628 4550 
Q 988 4650 1302 4700 
Q 1616 4750 1894 4750 
Q 2613 4750 3031 4423 
Q 3450 4097 3450 3541 
Q 3450 3153 3228 2886 
Q 3006 2619 2597 2516 
z
" id="DejaVuSans-33" transform="scale(0.015625)"/>
       </defs>
       <use transform="translate(0 0.015625)" xlink:href="#DejaVuSans-Oblique-61"/>
       <use transform="translate(61.279297 0.015625)" xlink:href="#DejaVuSans-Oblique-75"/>
       <use transform="translate(124.658203 0.015625)" xlink:href="#DejaVuSans-Oblique-78"/>
       <use transform="translate(183.837891 0.015625)" xlink:href="#DejaVuSans-31"/>
       <use transform="translate(247.460938 0.015625)" xlink:href="#DejaVuSans-Oblique-6c"/>
       <use transform="translate(275.244141 0.015625)" xlink:href="#DejaVuSans-Oblique-61"/>
       <use transform="translate(336.523438 0.015625)" xlink:href="#DejaVuSans-Oblique-78"/>
       <use transform="translate(395.703125 0.015625)" xlink:href="#DejaVuSans-31"/>
       <use transform="translate(459.326172 0.015625)" xlink:href="#DejaVuSans-2c"/>
       <use transform="translate(510.595703 0.015625)" xlink:href="#DejaVuSans-32"/>
       <use transform="translate(574.21875 0.015625)" xlink:href="#DejaVuSans-2c"/>
       <use transform="translate(625.488281 0.015625)" xlink:href="#DejaVuSans-33"/>
      </g>
     </g>
    </g>
    <g id="xtick_7">
     <g id="line2d_7">
      <g>
       <use style="fill:#262626;stroke:#262626;stroke-width:1.25;" x="559.575" xlink:href="#m68b30029f6" y="306.061628"/>
      </g>
     </g>
     <g id="text_7">
      <!-- $pin3$ -->
      <g style="fill:#262626;" transform="translate(503.572143 384.398473)rotate(-45)scale(0.33 -0.33)">
       <defs>
        <path d="M 3175 2156 
Q 3175 2616 2975 2859 
Q 2775 3103 2400 3103 
Q 2144 3103 1911 2972 
Q 1678 2841 1497 2591 
Q 1319 2344 1212 1994 
Q 1106 1644 1106 1300 
Q 1106 863 1306 627 
Q 1506 391 1875 391 
Q 2147 391 2380 519 
Q 2613 647 2778 891 
Q 2956 1147 3065 1494 
Q 3175 1841 3175 2156 
z
M 1394 2969 
Q 1625 3272 1939 3428 
Q 2253 3584 2638 3584 
Q 3175 3584 3472 3232 
Q 3769 2881 3769 2247 
Q 3769 1728 3584 1258 
Q 3400 788 3053 416 
Q 2822 169 2531 39 
Q 2241 -91 1919 -91 
Q 1547 -91 1294 64 
Q 1041 219 916 525 
L 556 -1331 
L -19 -1331 
L 922 3500 
L 1497 3500 
L 1394 2969 
z
" id="DejaVuSans-Oblique-70" transform="scale(0.015625)"/>
        <path d="M 1172 4863 
L 1747 4863 
L 1606 4134 
L 1031 4134 
L 1172 4863 
z
M 909 3500 
L 1484 3500 
L 800 0 
L 225 0 
L 909 3500 
z
" id="DejaVuSans-Oblique-69" transform="scale(0.015625)"/>
        <path d="M 3566 2113 
L 3156 0 
L 2578 0 
L 2988 2091 
Q 3016 2238 3031 2350 
Q 3047 2463 3047 2528 
Q 3047 2791 2881 2937 
Q 2716 3084 2419 3084 
Q 1956 3084 1622 2776 
Q 1288 2469 1184 1941 
L 800 0 
L 225 0 
L 903 3500 
L 1478 3500 
L 1363 2950 
Q 1603 3253 1940 3418 
Q 2278 3584 2650 3584 
Q 3113 3584 3367 3334 
Q 3622 3084 3622 2631 
Q 3622 2519 3608 2391 
Q 3594 2263 3566 2113 
z
" id="DejaVuSans-Oblique-6e" transform="scale(0.015625)"/>
       </defs>
       <use transform="translate(0 0.015625)" xlink:href="#DejaVuSans-Oblique-70"/>
       <use transform="translate(63.476562 0.015625)" xlink:href="#DejaVuSans-Oblique-69"/>
       <use transform="translate(91.259766 0.015625)" xlink:href="#DejaVuSans-Oblique-6e"/>
       <use transform="translate(154.638672 0.015625)" xlink:href="#DejaVuSans-33"/>
      </g>
     </g>
    </g>
    <g id="xtick_8">
     <g id="line2d_8">
      <g>
       <use style="fill:#262626;stroke:#262626;stroke-width:1.25;" x="622.581923" xlink:href="#m68b30029f6" y="306.061628"/>
      </g>
     </g>
     <g id="text_8">
      <!-- $pin4$ -->
      <g style="fill:#262626;" transform="translate(566.579066 384.398473)rotate(-45)scale(0.33 -0.33)">
       <defs>
        <path d="M 2419 4116 
L 825 1625 
L 2419 1625 
L 2419 4116 
z
M 2253 4666 
L 3047 4666 
L 3047 1625 
L 3713 1625 
L 3713 1100 
L 3047 1100 
L 3047 0 
L 2419 0 
L 2419 1100 
L 313 1100 
L 313 1709 
L 2253 4666 
z
" id="DejaVuSans-34" transform="scale(0.015625)"/>
       </defs>
       <use transform="translate(0 0.015625)" xlink:href="#DejaVuSans-Oblique-70"/>
       <use transform="translate(63.476562 0.015625)" xlink:href="#DejaVuSans-Oblique-69"/>
       <use transform="translate(91.259766 0.015625)" xlink:href="#DejaVuSans-Oblique-6e"/>
       <use transform="translate(154.638672 0.015625)" xlink:href="#DejaVuSans-34"/>
      </g>
     </g>
    </g>
    <g id="xtick_9">
     <g id="line2d_9">
      <g>
       <use style="fill:#262626;stroke:#262626;stroke-width:1.25;" x="685.588846" xlink:href="#m68b30029f6" y="306.061628"/>
      </g>
     </g>
     <g id="text_9">
      <!-- $pin7$ -->
      <g style="fill:#262626;" transform="translate(629.585989 384.398473)rotate(-45)scale(0.33 -0.33)">
       <defs>
        <path d="M 525 4666 
L 3525 4666 
L 3525 4397 
L 1831 0 
L 1172 0 
L 2766 4134 
L 525 4134 
L 525 4666 
z
" id="DejaVuSans-37" transform="scale(0.015625)"/>
       </defs>
       <use transform="translate(0 0.015625)" xlink:href="#DejaVuSans-Oblique-70"/>
       <use transform="translate(63.476562 0.015625)" xlink:href="#DejaVuSans-Oblique-69"/>
       <use transform="translate(91.259766 0.015625)" xlink:href="#DejaVuSans-Oblique-6e"/>
       <use transform="translate(154.638672 0.015625)" xlink:href="#DejaVuSans-37"/>
      </g>
     </g>
    </g>
    <g id="xtick_10">
     <g id="line2d_10">
      <g>
       <use style="fill:#262626;stroke:#262626;stroke-width:1.25;" x="748.595769" xlink:href="#m68b30029f6" y="306.061628"/>
      </g>
     </g>
     <g id="text_10">
      <!-- $pin3,4$ -->
      <g style="fill:#262626;" transform="translate(665.75821 411.233176)rotate(-45)scale(0.33 -0.33)">
       <use transform="translate(0 0.015625)" xlink:href="#DejaVuSans-Oblique-70"/>
       <use transform="translate(63.476562 0.015625)" xlink:href="#DejaVuSans-Oblique-69"/>
       <use transform="translate(91.259766 0.015625)" xlink:href="#DejaVuSans-Oblique-6e"/>
       <use transform="translate(154.638672 0.015625)" xlink:href="#DejaVuSans-33"/>
       <use transform="translate(218.261719 0.015625)" xlink:href="#DejaVuSans-2c"/>
       <use transform="translate(269.53125 0.015625)" xlink:href="#DejaVuSans-34"/>
      </g>
     </g>
    </g>
    <g id="xtick_11">
     <g id="line2d_11">
      <g>
       <use style="fill:#262626;stroke:#262626;stroke-width:1.25;" x="811.602692" xlink:href="#m68b30029f6" y="306.061628"/>
      </g>
     </g>
     <g id="text_11">
      <!-- $pin3,7$ -->
      <g style="fill:#262626;" transform="translate(728.765133 411.233176)rotate(-45)scale(0.33 -0.33)">
       <use transform="translate(0 0.015625)" xlink:href="#DejaVuSans-Oblique-70"/>
       <use transform="translate(63.476562 0.015625)" xlink:href="#DejaVuSans-Oblique-69"/>
       <use transform="translate(91.259766 0.015625)" xlink:href="#DejaVuSans-Oblique-6e"/>
       <use transform="translate(154.638672 0.015625)" xlink:href="#DejaVuSans-33"/>
       <use transform="translate(218.261719 0.015625)" xlink:href="#DejaVuSans-2c"/>
       <use transform="translate(269.53125 0.015625)" xlink:href="#DejaVuSans-37"/>
      </g>
     </g>
    </g>
    <g id="xtick_12">
     <g id="line2d_12">
      <g>
       <use style="fill:#262626;stroke:#262626;stroke-width:1.25;" x="874.609615" xlink:href="#m68b30029f6" y="306.061628"/>
      </g>
     </g>
     <g id="text_12">
      <!-- $pin4,7$ -->
      <g style="fill:#262626;" transform="translate(791.772056 411.233176)rotate(-45)scale(0.33 -0.33)">
       <use transform="translate(0 0.015625)" xlink:href="#DejaVuSans-Oblique-70"/>
       <use transform="translate(63.476562 0.015625)" xlink:href="#DejaVuSans-Oblique-69"/>
       <use transform="translate(91.259766 0.015625)" xlink:href="#DejaVuSans-Oblique-6e"/>
       <use transform="translate(154.638672 0.015625)" xlink:href="#DejaVuSans-34"/>
       <use transform="translate(218.261719 0.015625)" xlink:href="#DejaVuSans-2c"/>
       <use transform="translate(269.53125 0.015625)" xlink:href="#DejaVuSans-37"/>
      </g>
     </g>
    </g>
    <g id="xtick_13">
     <g id="line2d_13">
      <g>
       <use style="fill:#262626;stroke:#262626;stroke-width:1.25;" x="937.616538" xlink:href="#m68b30029f6" y="306.061628"/>
      </g>
     </g>
     <g id="text_13">
      <!-- $pin3,4,7$ -->
      <g style="fill:#262626;" transform="translate(827.944277 438.067878)rotate(-45)scale(0.33 -0.33)">
       <use transform="translate(0 0.015625)" xlink:href="#DejaVuSans-Oblique-70"/>
       <use transform="translate(63.476562 0.015625)" xlink:href="#DejaVuSans-Oblique-69"/>
       <use transform="translate(91.259766 0.015625)" xlink:href="#DejaVuSans-Oblique-6e"/>
       <use transform="translate(154.638672 0.015625)" xlink:href="#DejaVuSans-33"/>
       <use transform="translate(218.261719 0.015625)" xlink:href="#DejaVuSans-2c"/>
       <use transform="translate(269.53125 0.015625)" xlink:href="#DejaVuSans-34"/>
       <use transform="translate(333.154297 0.015625)" xlink:href="#DejaVuSans-2c"/>
       <use transform="translate(384.423828 0.015625)" xlink:href="#DejaVuSans-37"/>
      </g>
     </g>
    </g>
    <g id="text_14">
     <!-- Genotype -->
     <g style="fill:#262626;" transform="translate(471.917813 530.507661)scale(0.36 -0.36)">
      <defs>
       <path d="M 3809 666 
L 3809 1919 
L 2778 1919 
L 2778 2438 
L 4434 2438 
L 4434 434 
Q 4069 175 3628 42 
Q 3188 -91 2688 -91 
Q 1594 -91 976 548 
Q 359 1188 359 2328 
Q 359 3472 976 4111 
Q 1594 4750 2688 4750 
Q 3144 4750 3555 4637 
Q 3966 4525 4313 4306 
L 4313 3634 
Q 3963 3931 3569 4081 
Q 3175 4231 2741 4231 
Q 1884 4231 1454 3753 
Q 1025 3275 1025 2328 
Q 1025 1384 1454 906 
Q 1884 428 2741 428 
Q 3075 428 3337 486 
Q 3600 544 3809 666 
z
" id="DejaVuSans-47" transform="scale(0.015625)"/>
       <path d="M 3597 1894 
L 3597 1613 
L 953 1613 
Q 991 1019 1311 708 
Q 1631 397 2203 397 
Q 2534 397 2845 478 
Q 3156 559 3463 722 
L 3463 178 
Q 3153 47 2828 -22 
Q 2503 -91 2169 -91 
Q 1331 -91 842 396 
Q 353 884 353 1716 
Q 353 2575 817 3079 
Q 1281 3584 2069 3584 
Q 2775 3584 3186 3129 
Q 3597 2675 3597 1894 
z
M 3022 2063 
Q 3016 2534 2758 2815 
Q 2500 3097 2075 3097 
Q 1594 3097 1305 2825 
Q 1016 2553 972 2059 
L 3022 2063 
z
" id="DejaVuSans-65" transform="scale(0.015625)"/>
       <path d="M 3513 2113 
L 3513 0 
L 2938 0 
L 2938 2094 
Q 2938 2591 2744 2837 
Q 2550 3084 2163 3084 
Q 1697 3084 1428 2787 
Q 1159 2491 1159 1978 
L 1159 0 
L 581 0 
L 581 3500 
L 1159 3500 
L 1159 2956 
Q 1366 3272 1645 3428 
Q 1925 3584 2291 3584 
Q 2894 3584 3203 3211 
Q 3513 2838 3513 2113 
z
" id="DejaVuSans-6e" transform="scale(0.015625)"/>
       <path d="M 1172 4494 
L 1172 3500 
L 2356 3500 
L 2356 3053 
L 1172 3053 
L 1172 1153 
Q 1172 725 1289 603 
Q 1406 481 1766 481 
L 2356 481 
L 2356 0 
L 1766 0 
Q 1100 0 847 248 
Q 594 497 594 1153 
L 594 3053 
L 172 3053 
L 172 3500 
L 594 3500 
L 594 4494 
L 1172 4494 
z
" id="DejaVuSans-74" transform="scale(0.015625)"/>
       <path d="M 2059 -325 
Q 1816 -950 1584 -1140 
Q 1353 -1331 966 -1331 
L 506 -1331 
L 506 -850 
L 844 -850 
Q 1081 -850 1212 -737 
Q 1344 -625 1503 -206 
L 1606 56 
L 191 3500 
L 800 3500 
L 1894 763 
L 2988 3500 
L 3597 3500 
L 2059 -325 
z
" id="DejaVuSans-79" transform="scale(0.015625)"/>
       <path d="M 1159 525 
L 1159 -1331 
L 581 -1331 
L 581 3500 
L 1159 3500 
L 1159 2969 
Q 1341 3281 1617 3432 
Q 1894 3584 2278 3584 
Q 2916 3584 3314 3078 
Q 3713 2572 3713 1747 
Q 3713 922 3314 415 
Q 2916 -91 2278 -91 
Q 1894 -91 1617 61 
Q 1341 213 1159 525 
z
M 3116 1747 
Q 3116 2381 2855 2742 
Q 2594 3103 2138 3103 
Q 1681 3103 1420 2742 
Q 1159 2381 1159 1747 
Q 1159 1113 1420 752 
Q 1681 391 2138 391 
Q 2594 391 2855 752 
Q 3116 1113 3116 1747 
z
" id="DejaVuSans-70" transform="scale(0.015625)"/>
      </defs>
      <use xlink:href="#DejaVuSans-47"/>
      <use x="77.490234" xlink:href="#DejaVuSans-65"/>
      <use x="139.013672" xlink:href="#DejaVuSans-6e"/>
      <use x="202.392578" xlink:href="#DejaVuSans-6f"/>
      <use x="263.574219" xlink:href="#DejaVuSans-74"/>
      <use x="302.783203" xlink:href="#DejaVuSans-79"/>
      <use x="361.962891" xlink:href="#DejaVuSans-70"/>
      <use x="425.439453" xlink:href="#DejaVuSans-65"/>
     </g>
    </g>
   </g>
   <g id="matplotlib.axis_2">
    <g id="ytick_1">
     <g id="line2d_14">
      <defs>
       <path d="M 0 0 
L -6 0 
" id="m4fc2712c0a" style="stroke:#262626;stroke-width:1.25;"/>
      </defs>
      <g>
       <use style="fill:#262626;stroke:#262626;stroke-width:1.25;" x="150.03" xlink:href="#m4fc2712c0a" y="251.933203"/>
      </g>
     </g>
     <g id="text_15">
      <!-- 135 -->
      <g style="fill:#262626;" transform="translate(77.54125 264.470625)scale(0.33 -0.33)">
       <defs>
        <path d="M 691 4666 
L 3169 4666 
L 3169 4134 
L 1269 4134 
L 1269 2991 
Q 1406 3038 1543 3061 
Q 1681 3084 1819 3084 
Q 2600 3084 3056 2656 
Q 3513 2228 3513 1497 
Q 3513 744 3044 326 
Q 2575 -91 1722 -91 
Q 1428 -91 1123 -41 
Q 819 9 494 109 
L 494 744 
Q 775 591 1075 516 
Q 1375 441 1709 441 
Q 2250 441 2565 725 
Q 2881 1009 2881 1497 
Q 2881 1984 2565 2268 
Q 2250 2553 1709 2553 
Q 1456 2553 1204 2497 
Q 953 2441 691 2322 
L 691 4666 
z
" id="DejaVuSans-35" transform="scale(0.015625)"/>
       </defs>
       <use xlink:href="#DejaVuSans-31"/>
       <use x="63.623047" xlink:href="#DejaVuSans-33"/>
       <use x="127.246094" xlink:href="#DejaVuSans-35"/>
      </g>
     </g>
    </g>
    <g id="ytick_2">
     <g id="line2d_15">
      <g>
       <use style="fill:#262626;stroke:#262626;stroke-width:1.25;" x="150.03" xlink:href="#m4fc2712c0a" y="138.430971"/>
      </g>
     </g>
     <g id="text_16">
      <!-- 140 -->
      <g style="fill:#262626;" transform="translate(77.54125 150.968393)scale(0.33 -0.33)">
       <use xlink:href="#DejaVuSans-31"/>
       <use x="63.623047" xlink:href="#DejaVuSans-34"/>
       <use x="127.246094" xlink:href="#DejaVuSans-30"/>
      </g>
     </g>
    </g>
    <g id="text_17">
     <!-- Mean div. ang. -->
     <g style="fill:#262626;" transform="translate(66.054375 305.490005)rotate(-90)scale(0.36 -0.36)">
      <defs>
       <path d="M 628 4666 
L 1569 4666 
L 2759 1491 
L 3956 4666 
L 4897 4666 
L 4897 0 
L 4281 0 
L 4281 4097 
L 3078 897 
L 2444 897 
L 1241 4097 
L 1241 0 
L 628 0 
L 628 4666 
z
" id="DejaVuSans-4d" transform="scale(0.015625)"/>
       <path d="M 2194 1759 
Q 1497 1759 1228 1600 
Q 959 1441 959 1056 
Q 959 750 1161 570 
Q 1363 391 1709 391 
Q 2188 391 2477 730 
Q 2766 1069 2766 1631 
L 2766 1759 
L 2194 1759 
z
M 3341 1997 
L 3341 0 
L 2766 0 
L 2766 531 
Q 2569 213 2275 61 
Q 1981 -91 1556 -91 
Q 1019 -91 701 211 
Q 384 513 384 1019 
Q 384 1609 779 1909 
Q 1175 2209 1959 2209 
L 2766 2209 
L 2766 2266 
Q 2766 2663 2505 2880 
Q 2244 3097 1772 3097 
Q 1472 3097 1187 3025 
Q 903 2953 641 2809 
L 641 3341 
Q 956 3463 1253 3523 
Q 1550 3584 1831 3584 
Q 2591 3584 2966 3190 
Q 3341 2797 3341 1997 
z
" id="DejaVuSans-61" transform="scale(0.015625)"/>
       <path id="DejaVuSans-20" transform="scale(0.015625)"/>
       <path d="M 2906 2969 
L 2906 4863 
L 3481 4863 
L 3481 0 
L 2906 0 
L 2906 525 
Q 2725 213 2448 61 
Q 2172 -91 1784 -91 
Q 1150 -91 751 415 
Q 353 922 353 1747 
Q 353 2572 751 3078 
Q 1150 3584 1784 3584 
Q 2172 3584 2448 3432 
Q 2725 3281 2906 2969 
z
M 947 1747 
Q 947 1113 1208 752 
Q 1469 391 1925 391 
Q 2381 391 2643 752 
Q 2906 1113 2906 1747 
Q 2906 2381 2643 2742 
Q 2381 3103 1925 3103 
Q 1469 3103 1208 2742 
Q 947 2381 947 1747 
z
" id="DejaVuSans-64" transform="scale(0.015625)"/>
       <path d="M 603 3500 
L 1178 3500 
L 1178 0 
L 603 0 
L 603 3500 
z
M 603 4863 
L 1178 4863 
L 1178 4134 
L 603 4134 
L 603 4863 
z
" id="DejaVuSans-69" transform="scale(0.015625)"/>
       <path d="M 191 3500 
L 800 3500 
L 1894 563 
L 2988 3500 
L 3597 3500 
L 2284 0 
L 1503 0 
L 191 3500 
z
" id="DejaVuSans-76" transform="scale(0.015625)"/>
       <path d="M 684 794 
L 1344 794 
L 1344 0 
L 684 0 
L 684 794 
z
" id="DejaVuSans-2e" transform="scale(0.015625)"/>
       <path d="M 2906 1791 
Q 2906 2416 2648 2759 
Q 2391 3103 1925 3103 
Q 1463 3103 1205 2759 
Q 947 2416 947 1791 
Q 947 1169 1205 825 
Q 1463 481 1925 481 
Q 2391 481 2648 825 
Q 2906 1169 2906 1791 
z
M 3481 434 
Q 3481 -459 3084 -895 
Q 2688 -1331 1869 -1331 
Q 1566 -1331 1297 -1286 
Q 1028 -1241 775 -1147 
L 775 -588 
Q 1028 -725 1275 -790 
Q 1522 -856 1778 -856 
Q 2344 -856 2625 -561 
Q 2906 -266 2906 331 
L 2906 616 
Q 2728 306 2450 153 
Q 2172 0 1784 0 
Q 1141 0 747 490 
Q 353 981 353 1791 
Q 353 2603 747 3093 
Q 1141 3584 1784 3584 
Q 2172 3584 2450 3431 
Q 2728 3278 2906 2969 
L 2906 3500 
L 3481 3500 
L 3481 434 
z
" id="DejaVuSans-67" transform="scale(0.015625)"/>
      </defs>
      <use xlink:href="#DejaVuSans-4d"/>
      <use x="86.279297" xlink:href="#DejaVuSans-65"/>
      <use x="147.802734" xlink:href="#DejaVuSans-61"/>
      <use x="209.082031" xlink:href="#DejaVuSans-6e"/>
      <use x="272.460938" xlink:href="#DejaVuSans-20"/>
      <use x="304.248047" xlink:href="#DejaVuSans-64"/>
      <use x="367.724609" xlink:href="#DejaVuSans-69"/>
      <use x="395.507812" xlink:href="#DejaVuSans-76"/>
      <use x="446.9375" xlink:href="#DejaVuSans-2e"/>
      <use x="478.724609" xlink:href="#DejaVuSans-20"/>
      <use x="510.511719" xlink:href="#DejaVuSans-61"/>
      <use x="571.791016" xlink:href="#DejaVuSans-6e"/>
      <use x="635.169922" xlink:href="#DejaVuSans-67"/>
      <use x="698.646484" xlink:href="#DejaVuSans-2e"/>
     </g>
    </g>
   </g>
   <g id="patch_3">
    <path clip-path="url(#p458337c265)" d="M 156.330692 234.5743 
L 206.736231 234.5743 
L 206.736231 204.139568 
L 156.330692 204.139568 
L 156.330692 234.5743 
z
" style="fill:#959595;stroke:#313131;stroke-linejoin:miter;stroke-width:1.5;"/>
   </g>
   <g id="patch_4">
    <path clip-path="url(#p458337c265)" d="M 219.337615 227.011465 
L 269.743154 227.011465 
L 269.743154 212.221996 
L 219.337615 212.221996 
L 219.337615 227.011465 
z
" style="fill:#f1c0ac;stroke:#313131;stroke-linejoin:miter;stroke-width:1.5;"/>
   </g>
   <g id="patch_5">
    <path clip-path="url(#p458337c265)" d="M 282.344538 194.704289 
L 332.750077 194.704289 
L 332.750077 147.052139 
L 282.344538 147.052139 
L 282.344538 194.704289 
z
" style="fill:#e57760;stroke:#313131;stroke-linejoin:miter;stroke-width:1.5;"/>
   </g>
   <g id="patch_6">
    <path clip-path="url(#p458337c265)" d="M 345.351462 218.607276 
L 395.757 218.607276 
L 395.757 165.660019 
L 345.351462 165.660019 
L 345.351462 218.607276 
z
" style="fill:#b42e32;stroke:#313131;stroke-linejoin:miter;stroke-width:1.5;"/>
   </g>
   <g id="patch_7">
    <path clip-path="url(#p458337c265)" d="M 408.358385 237.090092 
L 458.763923 237.090092 
L 458.763923 215.864612 
L 408.358385 215.864612 
L 408.358385 237.090092 
z
" style="fill:#b3d7ae;stroke:#313131;stroke-linejoin:miter;stroke-width:1.5;"/>
   </g>
   <g id="patch_8">
    <path clip-path="url(#p458337c265)" d="M 471.365308 235.78448 
L 521.770846 235.78448 
L 521.770846 199.883069 
L 471.365308 199.883069 
L 471.365308 235.78448 
z
" style="fill:#44935b;stroke:#313131;stroke-linejoin:miter;stroke-width:1.5;"/>
   </g>
   <g id="patch_9">
    <path clip-path="url(#p458337c265)" d="M 534.372231 235.185044 
L 584.777769 235.185044 
L 584.777769 198.979856 
L 534.372231 198.979856 
L 534.372231 235.185044 
z
" style="fill:#e1ebf4;stroke:#313131;stroke-linejoin:miter;stroke-width:1.5;"/>
   </g>
   <g id="patch_10">
    <path clip-path="url(#p458337c265)" d="M 597.379154 228.094751 
L 647.784692 228.094751 
L 647.784692 165.23216 
L 597.379154 165.23216 
L 597.379154 228.094751 
z
" style="fill:#cbdbea;stroke:#313131;stroke-linejoin:miter;stroke-width:1.5;"/>
   </g>
   <g id="patch_11">
    <path clip-path="url(#p458337c265)" d="M 660.386077 206.126083 
L 710.791615 206.126083 
L 710.791615 145.925296 
L 660.386077 145.925296 
L 660.386077 206.126083 
z
" style="fill:#a6c7d8;stroke:#313131;stroke-linejoin:miter;stroke-width:1.5;"/>
   </g>
   <g id="patch_12">
    <path clip-path="url(#p458337c265)" d="M 723.393 215.547051 
L 773.798538 215.547051 
L 773.798538 115.852038 
L 723.393 115.852038 
L 723.393 215.547051 
z
" style="fill:#78aac8;stroke:#313131;stroke-linejoin:miter;stroke-width:1.5;"/>
   </g>
   <g id="patch_13">
    <path clip-path="url(#p458337c265)" d="M 786.399923 214.005918 
L 836.805462 214.005918 
L 836.805462 182.385294 
L 786.399923 182.385294 
L 786.399923 214.005918 
z
" style="fill:#528eb5;stroke:#313131;stroke-linejoin:miter;stroke-width:1.5;"/>
   </g>
   <g id="patch_14">
    <path clip-path="url(#p458337c265)" d="M 849.406846 227.819679 
L 899.812385 227.819679 
L 899.812385 168.665123 
L 849.406846 168.665123 
L 849.406846 227.819679 
z
" style="fill:#336fa2;stroke:#313131;stroke-linejoin:miter;stroke-width:1.5;"/>
   </g>
   <g id="patch_15">
    <path clip-path="url(#p458337c265)" d="M 912.413769 230.045332 
L 962.819308 230.045332 
L 962.819308 199.286481 
L 912.413769 199.286481 
L 912.413769 230.045332 
z
" style="fill:#1a5088;stroke:#313131;stroke-linejoin:miter;stroke-width:1.5;"/>
   </g>
   <g id="line2d_16">
    <path clip-path="url(#p458337c265)" d="M 181.533462 234.5743 
L 181.533462 261.555152 
" style="fill:none;stroke:#313131;stroke-linecap:round;stroke-width:1.5;"/>
   </g>
   <g id="line2d_17">
    <path clip-path="url(#p458337c265)" d="M 181.533462 204.139568 
L 181.533462 175.831075 
" style="fill:none;stroke:#313131;stroke-linecap:round;stroke-width:1.5;"/>
   </g>
   <g id="line2d_18">
    <path clip-path="url(#p458337c265)" d="M 168.932077 261.555152 
L 194.134846 261.555152 
" style="fill:none;stroke:#313131;stroke-linecap:round;stroke-width:1.5;"/>
   </g>
   <g id="line2d_19">
    <path clip-path="url(#p458337c265)" d="M 168.932077 175.831075 
L 194.134846 175.831075 
" style="fill:none;stroke:#313131;stroke-linecap:round;stroke-width:1.5;"/>
   </g>
   <g id="line2d_20">
    <path clip-path="url(#p458337c265)" d="M 244.540385 227.011465 
L 244.540385 227.011465 
" style="fill:none;stroke:#313131;stroke-linecap:round;stroke-width:1.5;"/>
   </g>
   <g id="line2d_21">
    <path clip-path="url(#p458337c265)" d="M 244.540385 212.221996 
L 244.540385 207.038662 
" style="fill:none;stroke:#313131;stroke-linecap:round;stroke-width:1.5;"/>
   </g>
   <g id="line2d_22">
    <path clip-path="url(#p458337c265)" d="M 231.939 227.011465 
L 257.141769 227.011465 
" style="fill:none;stroke:#313131;stroke-linecap:round;stroke-width:1.5;"/>
   </g>
   <g id="line2d_23">
    <path clip-path="url(#p458337c265)" d="M 231.939 207.038662 
L 257.141769 207.038662 
" style="fill:none;stroke:#313131;stroke-linecap:round;stroke-width:1.5;"/>
   </g>
   <g id="line2d_24">
    <path clip-path="url(#p458337c265)" d="M 307.547308 194.704289 
L 307.547308 235.558234 
" style="fill:none;stroke:#313131;stroke-linecap:round;stroke-width:1.5;"/>
   </g>
   <g id="line2d_25">
    <path clip-path="url(#p458337c265)" d="M 307.547308 147.052139 
L 307.547308 147.052139 
" style="fill:none;stroke:#313131;stroke-linecap:round;stroke-width:1.5;"/>
   </g>
   <g id="line2d_26">
    <path clip-path="url(#p458337c265)" d="M 294.945923 235.558234 
L 320.148692 235.558234 
" style="fill:none;stroke:#313131;stroke-linecap:round;stroke-width:1.5;"/>
   </g>
   <g id="line2d_27">
    <path clip-path="url(#p458337c265)" d="M 294.945923 147.052139 
L 320.148692 147.052139 
" style="fill:none;stroke:#313131;stroke-linecap:round;stroke-width:1.5;"/>
   </g>
   <g id="line2d_28">
    <path clip-path="url(#p458337c265)" d="M 370.554231 218.607276 
L 370.554231 268.103745 
" style="fill:none;stroke:#313131;stroke-linecap:round;stroke-width:1.5;"/>
   </g>
   <g id="line2d_29">
    <path clip-path="url(#p458337c265)" d="M 370.554231 165.660019 
L 370.554231 134.3669 
" style="fill:none;stroke:#313131;stroke-linecap:round;stroke-width:1.5;"/>
   </g>
   <g id="line2d_30">
    <path clip-path="url(#p458337c265)" d="M 357.952846 268.103745 
L 383.155615 268.103745 
" style="fill:none;stroke:#313131;stroke-linecap:round;stroke-width:1.5;"/>
   </g>
   <g id="line2d_31">
    <path clip-path="url(#p458337c265)" d="M 357.952846 134.3669 
L 383.155615 134.3669 
" style="fill:none;stroke:#313131;stroke-linecap:round;stroke-width:1.5;"/>
   </g>
   <g id="line2d_32">
    <path clip-path="url(#p458337c265)" d="M 433.561154 237.090092 
L 433.561154 242.349105 
" style="fill:none;stroke:#313131;stroke-linecap:round;stroke-width:1.5;"/>
   </g>
   <g id="line2d_33">
    <path clip-path="url(#p458337c265)" d="M 433.561154 215.864612 
L 433.561154 207.796024 
" style="fill:none;stroke:#313131;stroke-linecap:round;stroke-width:1.5;"/>
   </g>
   <g id="line2d_34">
    <path clip-path="url(#p458337c265)" d="M 420.959769 242.349105 
L 446.162538 242.349105 
" style="fill:none;stroke:#313131;stroke-linecap:round;stroke-width:1.5;"/>
   </g>
   <g id="line2d_35">
    <path clip-path="url(#p458337c265)" d="M 420.959769 207.796024 
L 446.162538 207.796024 
" style="fill:none;stroke:#313131;stroke-linecap:round;stroke-width:1.5;"/>
   </g>
   <g id="line2d_36">
    <path clip-path="url(#p458337c265)" d="M 496.568077 235.78448 
L 496.568077 247.060526 
" style="fill:none;stroke:#313131;stroke-linecap:round;stroke-width:1.5;"/>
   </g>
   <g id="line2d_37">
    <path clip-path="url(#p458337c265)" d="M 496.568077 199.883069 
L 496.568077 152.774813 
" style="fill:none;stroke:#313131;stroke-linecap:round;stroke-width:1.5;"/>
   </g>
   <g id="line2d_38">
    <path clip-path="url(#p458337c265)" d="M 483.966692 247.060526 
L 509.169462 247.060526 
" style="fill:none;stroke:#313131;stroke-linecap:round;stroke-width:1.5;"/>
   </g>
   <g id="line2d_39">
    <path clip-path="url(#p458337c265)" d="M 483.966692 152.774813 
L 509.169462 152.774813 
" style="fill:none;stroke:#313131;stroke-linecap:round;stroke-width:1.5;"/>
   </g>
   <g id="line2d_40">
    <path clip-path="url(#p458337c265)" d="M 559.575 235.185044 
L 559.575 244.856915 
" style="fill:none;stroke:#313131;stroke-linecap:round;stroke-width:1.5;"/>
   </g>
   <g id="line2d_41">
    <path clip-path="url(#p458337c265)" d="M 559.575 198.979856 
L 559.575 146.613211 
" style="fill:none;stroke:#313131;stroke-linecap:round;stroke-width:1.5;"/>
   </g>
   <g id="line2d_42">
    <path clip-path="url(#p458337c265)" d="M 546.973615 244.856915 
L 572.176385 244.856915 
" style="fill:none;stroke:#313131;stroke-linecap:round;stroke-width:1.5;"/>
   </g>
   <g id="line2d_43">
    <path clip-path="url(#p458337c265)" d="M 546.973615 146.613211 
L 572.176385 146.613211 
" style="fill:none;stroke:#313131;stroke-linecap:round;stroke-width:1.5;"/>
   </g>
   <g id="line2d_44">
    <path clip-path="url(#p458337c265)" d="M 622.581923 228.094751 
L 622.581923 266.089614 
" style="fill:none;stroke:#313131;stroke-linecap:round;stroke-width:1.5;"/>
   </g>
   <g id="line2d_45">
    <path clip-path="url(#p458337c265)" d="M 622.581923 165.23216 
L 622.581923 113.117119 
" style="fill:none;stroke:#313131;stroke-linecap:round;stroke-width:1.5;"/>
   </g>
   <g id="line2d_46">
    <path clip-path="url(#p458337c265)" d="M 609.980538 266.089614 
L 635.183308 266.089614 
" style="fill:none;stroke:#313131;stroke-linecap:round;stroke-width:1.5;"/>
   </g>
   <g id="line2d_47">
    <path clip-path="url(#p458337c265)" d="M 609.980538 113.117119 
L 635.183308 113.117119 
" style="fill:none;stroke:#313131;stroke-linecap:round;stroke-width:1.5;"/>
   </g>
   <g id="line2d_48">
    <path clip-path="url(#p458337c265)" d="M 685.588846 206.126083 
L 685.588846 249.327616 
" style="fill:none;stroke:#313131;stroke-linecap:round;stroke-width:1.5;"/>
   </g>
   <g id="line2d_49">
    <path clip-path="url(#p458337c265)" d="M 685.588846 145.925296 
L 685.588846 107.535173 
" style="fill:none;stroke:#313131;stroke-linecap:round;stroke-width:1.5;"/>
   </g>
   <g id="line2d_50">
    <path clip-path="url(#p458337c265)" d="M 672.987462 249.327616 
L 698.190231 249.327616 
" style="fill:none;stroke:#313131;stroke-linecap:round;stroke-width:1.5;"/>
   </g>
   <g id="line2d_51">
    <path clip-path="url(#p458337c265)" d="M 672.987462 107.535173 
L 698.190231 107.535173 
" style="fill:none;stroke:#313131;stroke-linecap:round;stroke-width:1.5;"/>
   </g>
   <g id="line2d_52">
    <path clip-path="url(#p458337c265)" d="M 748.595769 215.547051 
L 748.595769 233.525986 
" style="fill:none;stroke:#313131;stroke-linecap:round;stroke-width:1.5;"/>
   </g>
   <g id="line2d_53">
    <path clip-path="url(#p458337c265)" d="M 748.595769 115.852038 
L 748.595769 66.62841 
" style="fill:none;stroke:#313131;stroke-linecap:round;stroke-width:1.5;"/>
   </g>
   <g id="line2d_54">
    <path clip-path="url(#p458337c265)" d="M 735.994385 233.525986 
L 761.197154 233.525986 
" style="fill:none;stroke:#313131;stroke-linecap:round;stroke-width:1.5;"/>
   </g>
   <g id="line2d_55">
    <path clip-path="url(#p458337c265)" d="M 735.994385 66.62841 
L 761.197154 66.62841 
" style="fill:none;stroke:#313131;stroke-linecap:round;stroke-width:1.5;"/>
   </g>
   <g id="line2d_56">
    <path clip-path="url(#p458337c265)" d="M 811.602692 214.005918 
L 811.602692 238.184775 
" style="fill:none;stroke:#313131;stroke-linecap:round;stroke-width:1.5;"/>
   </g>
   <g id="line2d_57">
    <path clip-path="url(#p458337c265)" d="M 811.602692 182.385294 
L 811.602692 159.17959 
" style="fill:none;stroke:#313131;stroke-linecap:round;stroke-width:1.5;"/>
   </g>
   <g id="line2d_58">
    <path clip-path="url(#p458337c265)" d="M 799.001308 238.184775 
L 824.204077 238.184775 
" style="fill:none;stroke:#313131;stroke-linecap:round;stroke-width:1.5;"/>
   </g>
   <g id="line2d_59">
    <path clip-path="url(#p458337c265)" d="M 799.001308 159.17959 
L 824.204077 159.17959 
" style="fill:none;stroke:#313131;stroke-linecap:round;stroke-width:1.5;"/>
   </g>
   <g id="line2d_60">
    <path clip-path="url(#p458337c265)" d="M 874.609615 227.819679 
L 874.609615 294.057049 
" style="fill:none;stroke:#313131;stroke-linecap:round;stroke-width:1.5;"/>
   </g>
   <g id="line2d_61">
    <path clip-path="url(#p458337c265)" d="M 874.609615 168.665123 
L 874.609615 89.803484 
" style="fill:none;stroke:#313131;stroke-linecap:round;stroke-width:1.5;"/>
   </g>
   <g id="line2d_62">
    <path clip-path="url(#p458337c265)" d="M 862.008231 294.057049 
L 887.211 294.057049 
" style="fill:none;stroke:#313131;stroke-linecap:round;stroke-width:1.5;"/>
   </g>
   <g id="line2d_63">
    <path clip-path="url(#p458337c265)" d="M 862.008231 89.803484 
L 887.211 89.803484 
" style="fill:none;stroke:#313131;stroke-linecap:round;stroke-width:1.5;"/>
   </g>
   <g id="line2d_64">
    <path clip-path="url(#p458337c265)" d="M 937.616538 230.045332 
L 937.616538 246.64867 
" style="fill:none;stroke:#313131;stroke-linecap:round;stroke-width:1.5;"/>
   </g>
   <g id="line2d_65">
    <path clip-path="url(#p458337c265)" d="M 937.616538 199.286481 
L 937.616538 159.563001 
" style="fill:none;stroke:#313131;stroke-linecap:round;stroke-width:1.5;"/>
   </g>
   <g id="line2d_66">
    <path clip-path="url(#p458337c265)" d="M 925.015154 246.64867 
L 950.217923 246.64867 
" style="fill:none;stroke:#313131;stroke-linecap:round;stroke-width:1.5;"/>
   </g>
   <g id="line2d_67">
    <path clip-path="url(#p458337c265)" d="M 925.015154 159.563001 
L 950.217923 159.563001 
" style="fill:none;stroke:#313131;stroke-linecap:round;stroke-width:1.5;"/>
   </g>
   <g id="line2d_68">
    <path clip-path="url(#p458337c265)" d="M 150.03 215.915997 
L 969.12 215.915997 
" style="fill:none;stroke:#ff0000;stroke-dasharray:14.8,6.4;stroke-dashoffset:0;stroke-width:4;"/>
   </g>
   <g id="line2d_69">
    <path clip-path="url(#p458337c265)" d="M 156.330692 216.177419 
L 206.736231 216.177419 
" style="fill:none;stroke:#313131;stroke-linecap:round;stroke-width:1.5;"/>
   </g>
   <g id="line2d_70">
    <path clip-path="url(#p458337c265)" d="M 219.337615 221.860121 
L 269.743154 221.860121 
" style="fill:none;stroke:#313131;stroke-linecap:round;stroke-width:1.5;"/>
   </g>
   <g id="line2d_71">
    <path clip-path="url(#p458337c265)" d="M 282.344538 187.619004 
L 332.750077 187.619004 
" style="fill:none;stroke:#313131;stroke-linecap:round;stroke-width:1.5;"/>
   </g>
   <g id="line2d_72">
    <path clip-path="url(#p458337c265)" d="M 345.351462 191.66634 
L 395.757 191.66634 
" style="fill:none;stroke:#313131;stroke-linecap:round;stroke-width:1.5;"/>
   </g>
   <g id="line2d_73">
    <path clip-path="url(#p458337c265)" d="M 408.358385 221.925029 
L 458.763923 221.925029 
" style="fill:none;stroke:#313131;stroke-linecap:round;stroke-width:1.5;"/>
   </g>
   <g id="line2d_74">
    <path clip-path="url(#p458337c265)" d="M 471.365308 213.871777 
L 521.770846 213.871777 
" style="fill:none;stroke:#313131;stroke-linecap:round;stroke-width:1.5;"/>
   </g>
   <g id="line2d_75">
    <path clip-path="url(#p458337c265)" d="M 534.372231 211.655337 
L 584.777769 211.655337 
" style="fill:none;stroke:#313131;stroke-linecap:round;stroke-width:1.5;"/>
   </g>
   <g id="line2d_76">
    <path clip-path="url(#p458337c265)" d="M 597.379154 219.087525 
L 647.784692 219.087525 
" style="fill:none;stroke:#313131;stroke-linecap:round;stroke-width:1.5;"/>
   </g>
   <g id="line2d_77">
    <path clip-path="url(#p458337c265)" d="M 660.386077 162.591554 
L 710.791615 162.591554 
" style="fill:none;stroke:#313131;stroke-linecap:round;stroke-width:1.5;"/>
   </g>
   <g id="line2d_78">
    <path clip-path="url(#p458337c265)" d="M 723.393 192.274051 
L 773.798538 192.274051 
" style="fill:none;stroke:#313131;stroke-linecap:round;stroke-width:1.5;"/>
   </g>
   <g id="line2d_79">
    <path clip-path="url(#p458337c265)" d="M 786.399923 207.790402 
L 836.805462 207.790402 
" style="fill:none;stroke:#313131;stroke-linecap:round;stroke-width:1.5;"/>
   </g>
   <g id="line2d_80">
    <path clip-path="url(#p458337c265)" d="M 849.406846 209.142977 
L 899.812385 209.142977 
" style="fill:none;stroke:#313131;stroke-linecap:round;stroke-width:1.5;"/>
   </g>
   <g id="line2d_81">
    <path clip-path="url(#p458337c265)" d="M 912.413769 216.712478 
L 962.819308 216.712478 
" style="fill:none;stroke:#313131;stroke-linecap:round;stroke-width:1.5;"/>
   </g>
   <g id="patch_16">
    <path d="M 150.03 306.061628 
L 150.03 41.960881 
" style="fill:none;stroke:#262626;stroke-linecap:square;stroke-linejoin:miter;stroke-width:1.25;"/>
   </g>
   <g id="patch_17">
    <path d="M 150.03 306.061628 
L 969.12 306.061628 
" style="fill:none;stroke:#262626;stroke-linecap:square;stroke-linejoin:miter;stroke-width:1.25;"/>
   </g>
   <g id="PathCollection_1">
    <defs>
     <path d="M 0 2.5 
C 0.663008 2.5 1.29895 2.236584 1.767767 1.767767 
C 2.236584 1.29895 2.5 0.663008 2.5 -0 
C 2.5 -0.663008 2.236584 -1.29895 1.767767 -1.767767 
C 1.29895 -2.236584 0.663008 -2.5 0 -2.5 
C -0.663008 -2.5 -1.29895 -2.236584 -1.767767 -1.767767 
C -2.236584 -1.29895 -2.5 -0.663008 -2.5 0 
C -2.5 0.663008 -2.236584 1.29895 -1.767767 1.767767 
C -1.29895 2.236584 -0.663008 2.5 0 2.5 
z
" id="C0_0_485f1bda1d"/>
    </defs>
    <g clip-path="url(#p458337c265)">
     <use style="fill:#959595;stroke:#000000;" x="179.333087" xlink:href="#C0_0_485f1bda1d" y="205.477564"/>
    </g>
    <g clip-path="url(#p458337c265)">
     <use style="fill:#959595;stroke:#000000;" x="181.412385" xlink:href="#C0_0_485f1bda1d" y="237.512928"/>
    </g>
    <g clip-path="url(#p458337c265)">
     <use style="fill:#959595;stroke:#000000;" x="186.324466" xlink:href="#C0_0_485f1bda1d" y="246.788015"/>
    </g>
    <g clip-path="url(#p458337c265)">
     <use style="fill:#959595;stroke:#000000;" x="183.638988" xlink:href="#C0_0_485f1bda1d" y="210.176609"/>
    </g>
    <g clip-path="url(#p458337c265)">
     <use style="fill:#959595;stroke:#000000;" x="179.20102" xlink:href="#C0_0_485f1bda1d" y="216.539876"/>
    </g>
    <g clip-path="url(#p458337c265)">
     <use style="fill:#959595;stroke:#000000;" x="185.567162" xlink:href="#C0_0_485f1bda1d" y="216.789372"/>
    </g>
    <g clip-path="url(#p458337c265)">
     <use style="fill:#959595;stroke:#000000;" x="181.501746" xlink:href="#C0_0_485f1bda1d" y="201.286688"/>
    </g>
    <g clip-path="url(#p458337c265)">
     <use style="fill:#959595;stroke:#000000;" x="179.327907" xlink:href="#C0_0_485f1bda1d" y="199.327392"/>
    </g>
    <g clip-path="url(#p458337c265)">
     <use style="fill:#959595;stroke:#000000;" x="176.645247" xlink:href="#C0_0_485f1bda1d" y="239.299046"/>
    </g>
    <g clip-path="url(#p458337c265)">
     <use style="fill:#959595;stroke:#000000;" x="184.321302" xlink:href="#C0_0_485f1bda1d" y="192.928581"/>
    </g>
    <g clip-path="url(#p458337c265)">
     <use style="fill:#959595;stroke:#000000;" x="187.289453" xlink:href="#C0_0_485f1bda1d" y="221.046319"/>
    </g>
    <g clip-path="url(#p458337c265)">
     <use style="fill:#959595;stroke:#000000;" x="179.308056" xlink:href="#C0_0_485f1bda1d" y="210.446061"/>
    </g>
    <g clip-path="url(#p458337c265)">
     <use style="fill:#959595;stroke:#000000;" x="175.339866" xlink:href="#C0_0_485f1bda1d" y="204.139568"/>
    </g>
    <g clip-path="url(#p458337c265)">
     <use style="fill:#959595;stroke:#000000;" x="187.149155" xlink:href="#C0_0_485f1bda1d" y="231.149773"/>
    </g>
    <g clip-path="url(#p458337c265)">
     <use style="fill:#959595;stroke:#000000;" x="177.317782" xlink:href="#C0_0_485f1bda1d" y="208.794018"/>
    </g>
    <g clip-path="url(#p458337c265)">
     <use style="fill:#959595;stroke:#000000;" x="175.583771" xlink:href="#C0_0_485f1bda1d" y="218.136004"/>
    </g>
    <g clip-path="url(#p458337c265)">
     <use style="fill:#959595;stroke:#000000;" x="185.754413" xlink:href="#C0_0_485f1bda1d" y="216.177419"/>
    </g>
    <g clip-path="url(#p458337c265)">
     <use style="fill:#959595;stroke:#000000;" x="182.795562" xlink:href="#C0_0_485f1bda1d" y="235.602966"/>
    </g>
    <g clip-path="url(#p458337c265)">
     <use style="fill:#959595;stroke:#000000;" x="176.468906" xlink:href="#C0_0_485f1bda1d" y="213.507105"/>
    </g>
    <g clip-path="url(#p458337c265)">
     <use style="fill:#959595;stroke:#000000;" x="183.310268" xlink:href="#C0_0_485f1bda1d" y="226.8157"/>
    </g>
    <g clip-path="url(#p458337c265)">
     <use style="fill:#959595;stroke:#000000;" x="183.064566" xlink:href="#C0_0_485f1bda1d" y="214.99322"/>
    </g>
    <g clip-path="url(#p458337c265)">
     <use style="fill:#959595;stroke:#000000;" x="179.527445" xlink:href="#C0_0_485f1bda1d" y="202.01939"/>
    </g>
    <g clip-path="url(#p458337c265)">
     <use style="fill:#959595;stroke:#000000;" x="187.228534" xlink:href="#C0_0_485f1bda1d" y="124.183571"/>
    </g>
    <g clip-path="url(#p458337c265)">
     <use style="fill:#959595;stroke:#000000;" x="187.219804" xlink:href="#C0_0_485f1bda1d" y="261.555152"/>
    </g>
    <g clip-path="url(#p458337c265)">
     <use style="fill:#959595;stroke:#000000;" x="175.869517" xlink:href="#C0_0_485f1bda1d" y="234.5743"/>
    </g>
    <g clip-path="url(#p458337c265)">
     <use style="fill:#959595;stroke:#000000;" x="184.500421" xlink:href="#C0_0_485f1bda1d" y="175.831075"/>
    </g>
    <g clip-path="url(#p458337c265)">
     <use style="fill:#959595;stroke:#000000;" x="177.958081" xlink:href="#C0_0_485f1bda1d" y="241.866028"/>
    </g>
    <g clip-path="url(#p458337c265)">
     <use style="fill:#959595;stroke:#000000;" x="182.189457" xlink:href="#C0_0_485f1bda1d" y="237.706634"/>
    </g>
    <g clip-path="url(#p458337c265)">
     <use style="fill:#959595;stroke:#000000;" x="179.397933" xlink:href="#C0_0_485f1bda1d" y="183.521491"/>
    </g>
   </g>
   <g id="PathCollection_2">
    <defs>
     <path d="M 0 2.5 
C 0.663008 2.5 1.29895 2.236584 1.767767 1.767767 
C 2.236584 1.29895 2.5 0.663008 2.5 -0 
C 2.5 -0.663008 2.236584 -1.29895 1.767767 -1.767767 
C 1.29895 -2.236584 0.663008 -2.5 0 -2.5 
C -0.663008 -2.5 -1.29895 -2.236584 -1.767767 -1.767767 
C -2.236584 -1.29895 -2.5 -0.663008 -2.5 0 
C -2.5 0.663008 -2.236584 1.29895 -1.767767 1.767767 
C -1.29895 2.236584 -0.663008 2.5 0 2.5 
z
" id="C1_0_377bff45dc"/>
    </defs>
    <g clip-path="url(#p458337c265)">
     <use style="fill:#fcbba1;stroke:#000000;" x="241.724821" xlink:href="#C1_0_377bff45dc" y="227.011465"/>
    </g>
    <g clip-path="url(#p458337c265)">
     <use style="fill:#fcbba1;stroke:#000000;" x="239.787599" xlink:href="#C1_0_377bff45dc" y="255.629523"/>
    </g>
    <g clip-path="url(#p458337c265)">
     <use style="fill:#fcbba1;stroke:#000000;" x="242.248726" xlink:href="#C1_0_377bff45dc" y="221.860121"/>
    </g>
    <g clip-path="url(#p458337c265)">
     <use style="fill:#fcbba1;stroke:#000000;" x="246.942498" xlink:href="#C1_0_377bff45dc" y="212.221996"/>
    </g>
    <g clip-path="url(#p458337c265)">
     <use style="fill:#fcbba1;stroke:#000000;" x="240.158024" xlink:href="#C1_0_377bff45dc" y="207.038662"/>
    </g>
   </g>
   <g id="PathCollection_3">
    <defs>
     <path d="M 0 2.5 
C 0.663008 2.5 1.29895 2.236584 1.767767 1.767767 
C 2.236584 1.29895 2.5 0.663008 2.5 -0 
C 2.5 -0.663008 2.236584 -1.29895 1.767767 -1.767767 
C 1.29895 -2.236584 0.663008 -2.5 0 -2.5 
C -0.663008 -2.5 -1.29895 -2.236584 -1.767767 -1.767767 
C -2.236584 -1.29895 -2.5 -0.663008 -2.5 0 
C -2.5 0.663008 -2.236584 1.29895 -1.767767 1.767767 
C -1.29895 2.236584 -0.663008 2.5 0 2.5 
z
" id="C2_0_a072a5eb76"/>
    </defs>
    <g clip-path="url(#p458337c265)">
     <use style="fill:#fb694a;stroke:#000000;" x="302.962726" xlink:href="#C2_0_a072a5eb76" y="235.558234"/>
    </g>
    <g clip-path="url(#p458337c265)">
     <use style="fill:#fb694a;stroke:#000000;" x="311.992307" xlink:href="#C2_0_a072a5eb76" y="70.170769"/>
    </g>
    <g clip-path="url(#p458337c265)">
     <use style="fill:#fb694a;stroke:#000000;" x="310.783468" xlink:href="#C2_0_a072a5eb76" y="186.914064"/>
    </g>
    <g clip-path="url(#p458337c265)">
     <use style="fill:#fb694a;stroke:#000000;" x="309.702202" xlink:href="#C2_0_a072a5eb76" y="147.052139"/>
    </g>
    <g clip-path="url(#p458337c265)">
     <use style="fill:#fb694a;stroke:#000000;" x="305.772014" xlink:href="#C2_0_a072a5eb76" y="53.965461"/>
    </g>
    <g clip-path="url(#p458337c265)">
     <use style="fill:#fb694a;stroke:#000000;" x="311.475912" xlink:href="#C2_0_a072a5eb76" y="228.496054"/>
    </g>
    <g clip-path="url(#p458337c265)">
     <use style="fill:#fb694a;stroke:#000000;" x="309.538081" xlink:href="#C2_0_a072a5eb76" y="189.89164"/>
    </g>
    <g clip-path="url(#p458337c265)">
     <use style="fill:#fb694a;stroke:#000000;" x="308.584187" xlink:href="#C2_0_a072a5eb76" y="187.619004"/>
    </g>
    <g clip-path="url(#p458337c265)">
     <use style="fill:#fb694a;stroke:#000000;" x="302.354008" xlink:href="#C2_0_a072a5eb76" y="194.704289"/>
    </g>
   </g>
   <g id="PathCollection_4">
    <defs>
     <path d="M 0 2.5 
C 0.663008 2.5 1.29895 2.236584 1.767767 1.767767 
C 2.236584 1.29895 2.5 0.663008 2.5 -0 
C 2.5 -0.663008 2.236584 -1.29895 1.767767 -1.767767 
C 1.29895 -2.236584 0.663008 -2.5 0 -2.5 
C -0.663008 -2.5 -1.29895 -2.236584 -1.767767 -1.767767 
C -2.236584 -1.29895 -2.5 -0.663008 -2.5 0 
C -2.5 0.663008 -2.236584 1.29895 -1.767767 1.767767 
C -1.29895 2.236584 -0.663008 2.5 0 2.5 
z
" id="C3_0_53848620af"/>
    </defs>
    <g clip-path="url(#p458337c265)">
     <use style="fill:#ca181d;stroke:#000000;" x="364.695178" xlink:href="#C3_0_53848620af" y="166.834677"/>
    </g>
    <g clip-path="url(#p458337c265)">
     <use style="fill:#ca181d;stroke:#000000;" x="374.123478" xlink:href="#C3_0_53848620af" y="187.586103"/>
    </g>
    <g clip-path="url(#p458337c265)">
     <use style="fill:#ca181d;stroke:#000000;" x="368.133853" xlink:href="#C3_0_53848620af" y="219.997065"/>
    </g>
    <g clip-path="url(#p458337c265)">
     <use style="fill:#ca181d;stroke:#000000;" x="376.137155" xlink:href="#C3_0_53848620af" y="134.3669"/>
    </g>
    <g clip-path="url(#p458337c265)">
     <use style="fill:#ca181d;stroke:#000000;" x="368.02114" xlink:href="#C3_0_53848620af" y="214.437911"/>
    </g>
    <g clip-path="url(#p458337c265)">
     <use style="fill:#ca181d;stroke:#000000;" x="367.997907" xlink:href="#C3_0_53848620af" y="195.746577"/>
    </g>
    <g clip-path="url(#p458337c265)">
     <use style="fill:#ca181d;stroke:#000000;" x="365.746128" xlink:href="#C3_0_53848620af" y="156.108651"/>
    </g>
    <g clip-path="url(#p458337c265)">
     <use style="fill:#ca181d;stroke:#000000;" x="374.939547" xlink:href="#C3_0_53848620af" y="268.103745"/>
    </g>
    <g clip-path="url(#p458337c265)">
     <use style="fill:#ca181d;stroke:#000000;" x="372.876345" xlink:href="#C3_0_53848620af" y="165.268466"/>
    </g>
    <g clip-path="url(#p458337c265)">
     <use style="fill:#ca181d;stroke:#000000;" x="374.01525" xlink:href="#C3_0_53848620af" y="225.141258"/>
    </g>
   </g>
   <g id="PathCollection_5">
    <defs>
     <path d="M 0 2.5 
C 0.663008 2.5 1.29895 2.236584 1.767767 1.767767 
C 2.236584 1.29895 2.5 0.663008 2.5 -0 
C 2.5 -0.663008 2.236584 -1.29895 1.767767 -1.767767 
C 1.29895 -2.236584 0.663008 -2.5 0 -2.5 
C -0.663008 -2.5 -1.29895 -2.236584 -1.767767 -1.767767 
C -2.236584 -1.29895 -2.5 -0.663008 -2.5 0 
C -2.5 0.663008 -2.236584 1.29895 -1.767767 1.767767 
C -1.29895 2.236584 -0.663008 2.5 0 2.5 
z
" id="C4_0_71052a0da8"/>
    </defs>
    <g clip-path="url(#p458337c265)">
     <use style="fill:#aedea7;stroke:#000000;" x="431.427151" xlink:href="#C4_0_71052a0da8" y="207.796024"/>
    </g>
    <g clip-path="url(#p458337c265)">
     <use style="fill:#aedea7;stroke:#000000;" x="429.703238" xlink:href="#C4_0_71052a0da8" y="236.264076"/>
    </g>
    <g clip-path="url(#p458337c265)">
     <use style="fill:#aedea7;stroke:#000000;" x="438.287147" xlink:href="#C4_0_71052a0da8" y="239.568139"/>
    </g>
    <g clip-path="url(#p458337c265)">
     <use style="fill:#aedea7;stroke:#000000;" x="429.157147" xlink:href="#C4_0_71052a0da8" y="242.349105"/>
    </g>
    <g clip-path="url(#p458337c265)">
     <use style="fill:#aedea7;stroke:#000000;" x="433.461556" xlink:href="#C4_0_71052a0da8" y="215.896181"/>
    </g>
    <g clip-path="url(#p458337c265)">
     <use style="fill:#aedea7;stroke:#000000;" x="438.185178" xlink:href="#C4_0_71052a0da8" y="219.654908"/>
    </g>
    <g clip-path="url(#p458337c265)">
     <use style="fill:#aedea7;stroke:#000000;" x="429.530122" xlink:href="#C4_0_71052a0da8" y="224.19515"/>
    </g>
    <g clip-path="url(#p458337c265)">
     <use style="fill:#aedea7;stroke:#000000;" x="431.548615" xlink:href="#C4_0_71052a0da8" y="215.769903"/>
    </g>
   </g>
   <g id="PathCollection_6">
    <defs>
     <path d="M 0 2.5 
C 0.663008 2.5 1.29895 2.236584 1.767767 1.767767 
C 2.236584 1.29895 2.5 0.663008 2.5 -0 
C 2.5 -0.663008 2.236584 -1.29895 1.767767 -1.767767 
C 1.29895 -2.236584 0.663008 -2.5 0 -2.5 
C -0.663008 -2.5 -1.29895 -2.236584 -1.767767 -1.767767 
C -2.236584 -1.29895 -2.5 -0.663008 -2.5 0 
C -2.5 0.663008 -2.236584 1.29895 -1.767767 1.767767 
C -1.29895 2.236584 -0.663008 2.5 0 2.5 
z
" id="C5_0_7836112926"/>
    </defs>
    <g clip-path="url(#p458337c265)">
     <use style="fill:#37a055;stroke:#000000;" x="497.290214" xlink:href="#C5_0_7836112926" y="199.883069"/>
    </g>
    <g clip-path="url(#p458337c265)">
     <use style="fill:#37a055;stroke:#000000;" x="491.587548" xlink:href="#C5_0_7836112926" y="235.78448"/>
    </g>
    <g clip-path="url(#p458337c265)">
     <use style="fill:#37a055;stroke:#000000;" x="497.956495" xlink:href="#C5_0_7836112926" y="247.060526"/>
    </g>
    <g clip-path="url(#p458337c265)">
     <use style="fill:#37a055;stroke:#000000;" x="492.611724" xlink:href="#C5_0_7836112926" y="152.774813"/>
    </g>
    <g clip-path="url(#p458337c265)">
     <use style="fill:#37a055;stroke:#000000;" x="493.451379" xlink:href="#C5_0_7836112926" y="213.871777"/>
    </g>
   </g>
   <g id="PathCollection_7">
    <defs>
     <path d="M 0 2.5 
C 0.663008 2.5 1.29895 2.236584 1.767767 1.767767 
C 2.236584 1.29895 2.5 0.663008 2.5 -0 
C 2.5 -0.663008 2.236584 -1.29895 1.767767 -1.767767 
C 1.29895 -2.236584 0.663008 -2.5 0 -2.5 
C -0.663008 -2.5 -1.29895 -2.236584 -1.767767 -1.767767 
C -2.236584 -1.29895 -2.5 -0.663008 -2.5 0 
C -2.5 0.663008 -2.236584 1.29895 -1.767767 1.767767 
C -1.29895 2.236584 -0.663008 2.5 0 2.5 
z
" id="C6_0_46fefde3c2"/>
    </defs>
    <g clip-path="url(#p458337c265)">
     <use style="fill:#deebf7;stroke:#000000;" x="565.358683" xlink:href="#C6_0_46fefde3c2" y="210.868704"/>
    </g>
    <g clip-path="url(#p458337c265)">
     <use style="fill:#deebf7;stroke:#000000;" x="555.679306" xlink:href="#C6_0_46fefde3c2" y="146.613211"/>
    </g>
    <g clip-path="url(#p458337c265)">
     <use style="fill:#deebf7;stroke:#000000;" x="554.964144" xlink:href="#C6_0_46fefde3c2" y="228.706636"/>
    </g>
    <g clip-path="url(#p458337c265)">
     <use style="fill:#deebf7;stroke:#000000;" x="561.834357" xlink:href="#C6_0_46fefde3c2" y="211.655337"/>
    </g>
    <g clip-path="url(#p458337c265)">
     <use style="fill:#deebf7;stroke:#000000;" x="558.997943" xlink:href="#C6_0_46fefde3c2" y="188.012683"/>
    </g>
    <g clip-path="url(#p458337c265)">
     <use style="fill:#deebf7;stroke:#000000;" x="559.252205" xlink:href="#C6_0_46fefde3c2" y="209.94703"/>
    </g>
    <g clip-path="url(#p458337c265)">
     <use style="fill:#deebf7;stroke:#000000;" x="553.444438" xlink:href="#C6_0_46fefde3c2" y="242.406986"/>
    </g>
    <g clip-path="url(#p458337c265)">
     <use style="fill:#deebf7;stroke:#000000;" x="557.349936" xlink:href="#C6_0_46fefde3c2" y="244.856915"/>
    </g>
    <g clip-path="url(#p458337c265)">
     <use style="fill:#deebf7;stroke:#000000;" x="564.608608" xlink:href="#C6_0_46fefde3c2" y="220.632961"/>
    </g>
    <g clip-path="url(#p458337c265)">
     <use style="fill:#deebf7;stroke:#000000;" x="558.514387" xlink:href="#C6_0_46fefde3c2" y="133.232102"/>
    </g>
    <g clip-path="url(#p458337c265)">
     <use style="fill:#deebf7;stroke:#000000;" x="565.704156" xlink:href="#C6_0_46fefde3c2" y="241.663453"/>
    </g>
   </g>
   <g id="PathCollection_8">
    <defs>
     <path d="M 0 2.5 
C 0.663008 2.5 1.29895 2.236584 1.767767 1.767767 
C 2.236584 1.29895 2.5 0.663008 2.5 -0 
C 2.5 -0.663008 2.236584 -1.29895 1.767767 -1.767767 
C 1.29895 -2.236584 0.663008 -2.5 0 -2.5 
C -0.663008 -2.5 -1.29895 -2.236584 -1.767767 -1.767767 
C -2.236584 -1.29895 -2.5 -0.663008 -2.5 0 
C -2.5 0.663008 -2.236584 1.29895 -1.767767 1.767767 
C -1.29895 2.236584 -0.663008 2.5 0 2.5 
z
" id="C7_0_30a8cba36f"/>
    </defs>
    <g clip-path="url(#p458337c265)">
     <use style="fill:#c6dbef;stroke:#000000;" x="628.864275" xlink:href="#C7_0_30a8cba36f" y="165.849824"/>
    </g>
    <g clip-path="url(#p458337c265)">
     <use style="fill:#c6dbef;stroke:#000000;" x="617.786669" xlink:href="#C7_0_30a8cba36f" y="164.614495"/>
    </g>
    <g clip-path="url(#p458337c265)">
     <use style="fill:#c6dbef;stroke:#000000;" x="616.913307" xlink:href="#C7_0_30a8cba36f" y="235.080629"/>
    </g>
    <g clip-path="url(#p458337c265)">
     <use style="fill:#c6dbef;stroke:#000000;" x="618.709238" xlink:href="#C7_0_30a8cba36f" y="219.087525"/>
    </g>
    <g clip-path="url(#p458337c265)">
     <use style="fill:#c6dbef;stroke:#000000;" x="620.295775" xlink:href="#C7_0_30a8cba36f" y="211.858547"/>
    </g>
    <g clip-path="url(#p458337c265)">
     <use style="fill:#c6dbef;stroke:#000000;" x="621.031009" xlink:href="#C7_0_30a8cba36f" y="266.089614"/>
    </g>
    <g clip-path="url(#p458337c265)">
     <use style="fill:#c6dbef;stroke:#000000;" x="627.315287" xlink:href="#C7_0_30a8cba36f" y="113.117119"/>
    </g>
    <g clip-path="url(#p458337c265)">
     <use style="fill:#c6dbef;stroke:#000000;" x="624.334961" xlink:href="#C7_0_30a8cba36f" y="157.315126"/>
    </g>
    <g clip-path="url(#p458337c265)">
     <use style="fill:#c6dbef;stroke:#000000;" x="619.257685" xlink:href="#C7_0_30a8cba36f" y="219.209251"/>
    </g>
    <g clip-path="url(#p458337c265)">
     <use style="fill:#c6dbef;stroke:#000000;" x="626.205264" xlink:href="#C7_0_30a8cba36f" y="221.108874"/>
    </g>
    <g clip-path="url(#p458337c265)">
     <use style="fill:#c6dbef;stroke:#000000;" x="626.938834" xlink:href="#C7_0_30a8cba36f" y="259.031929"/>
    </g>
   </g>
   <g id="PathCollection_9">
    <defs>
     <path d="M 0 2.5 
C 0.663008 2.5 1.29895 2.236584 1.767767 1.767767 
C 2.236584 1.29895 2.5 0.663008 2.5 -0 
C 2.5 -0.663008 2.236584 -1.29895 1.767767 -1.767767 
C 1.29895 -2.236584 0.663008 -2.5 0 -2.5 
C -0.663008 -2.5 -1.29895 -2.236584 -1.767767 -1.767767 
C -2.236584 -1.29895 -2.5 -0.663008 -2.5 0 
C -2.5 0.663008 -2.236584 1.29895 -1.767767 1.767767 
C -1.29895 2.236584 -0.663008 2.5 0 2.5 
z
" id="C8_0_af5501fa2e"/>
    </defs>
    <g clip-path="url(#p458337c265)">
     <use style="fill:#9dcae1;stroke:#000000;" x="688.126544" xlink:href="#C8_0_af5501fa2e" y="162.591554"/>
    </g>
    <g clip-path="url(#p458337c265)">
     <use style="fill:#9dcae1;stroke:#000000;" x="690.505864" xlink:href="#C8_0_af5501fa2e" y="147.128476"/>
    </g>
    <g clip-path="url(#p458337c265)">
     <use style="fill:#9dcae1;stroke:#000000;" x="682.755887" xlink:href="#C8_0_af5501fa2e" y="188.482088"/>
    </g>
    <g clip-path="url(#p458337c265)">
     <use style="fill:#9dcae1;stroke:#000000;" x="686.853702" xlink:href="#C8_0_af5501fa2e" y="139.762456"/>
    </g>
    <g clip-path="url(#p458337c265)">
     <use style="fill:#9dcae1;stroke:#000000;" x="689.045319" xlink:href="#C8_0_af5501fa2e" y="236.706105"/>
    </g>
    <g clip-path="url(#p458337c265)">
     <use style="fill:#9dcae1;stroke:#000000;" x="691.525947" xlink:href="#C8_0_af5501fa2e" y="148.399827"/>
    </g>
    <g clip-path="url(#p458337c265)">
     <use style="fill:#9dcae1;stroke:#000000;" x="685.405188" xlink:href="#C8_0_af5501fa2e" y="107.535173"/>
    </g>
    <g clip-path="url(#p458337c265)">
     <use style="fill:#9dcae1;stroke:#000000;" x="683.251986" xlink:href="#C8_0_af5501fa2e" y="144.722116"/>
    </g>
    <g clip-path="url(#p458337c265)">
     <use style="fill:#9dcae1;stroke:#000000;" x="689.492348" xlink:href="#C8_0_af5501fa2e" y="178.621787"/>
    </g>
    <g clip-path="url(#p458337c265)">
     <use style="fill:#9dcae1;stroke:#000000;" x="684.125343" xlink:href="#C8_0_af5501fa2e" y="223.770078"/>
    </g>
    <g clip-path="url(#p458337c265)">
     <use style="fill:#9dcae1;stroke:#000000;" x="689.420847" xlink:href="#C8_0_af5501fa2e" y="249.327616"/>
    </g>
   </g>
   <g id="PathCollection_10">
    <defs>
     <path d="M 0 2.5 
C 0.663008 2.5 1.29895 2.236584 1.767767 1.767767 
C 2.236584 1.29895 2.5 0.663008 2.5 -0 
C 2.5 -0.663008 2.236584 -1.29895 1.767767 -1.767767 
C 1.29895 -2.236584 0.663008 -2.5 0 -2.5 
C -0.663008 -2.5 -1.29895 -2.236584 -1.767767 -1.767767 
C -2.236584 -1.29895 -2.5 -0.663008 -2.5 0 
C -2.5 0.663008 -2.236584 1.29895 -1.767767 1.767767 
C -1.29895 2.236584 -0.663008 2.5 0 2.5 
z
" id="C9_0_9c923e96a2"/>
    </defs>
    <g clip-path="url(#p458337c265)">
     <use style="fill:#6aaed6;stroke:#000000;" x="753.999607" xlink:href="#C9_0_9c923e96a2" y="229.860625"/>
    </g>
    <g clip-path="url(#p458337c265)">
     <use style="fill:#6aaed6;stroke:#000000;" x="751.425872" xlink:href="#C9_0_9c923e96a2" y="233.525986"/>
    </g>
    <g clip-path="url(#p458337c265)">
     <use style="fill:#6aaed6;stroke:#000000;" x="747.941487" xlink:href="#C9_0_9c923e96a2" y="66.62841"/>
    </g>
    <g clip-path="url(#p458337c265)">
     <use style="fill:#6aaed6;stroke:#000000;" x="746.380968" xlink:href="#C9_0_9c923e96a2" y="167.181647"/>
    </g>
    <g clip-path="url(#p458337c265)">
     <use style="fill:#6aaed6;stroke:#000000;" x="746.581138" xlink:href="#C9_0_9c923e96a2" y="120.626075"/>
    </g>
    <g clip-path="url(#p458337c265)">
     <use style="fill:#6aaed6;stroke:#000000;" x="743.062471" xlink:href="#C9_0_9c923e96a2" y="209.749403"/>
    </g>
    <g clip-path="url(#p458337c265)">
     <use style="fill:#6aaed6;stroke:#000000;" x="746.057606" xlink:href="#C9_0_9c923e96a2" y="213.791962"/>
    </g>
    <g clip-path="url(#p458337c265)">
     <use style="fill:#6aaed6;stroke:#000000;" x="749.064585" xlink:href="#C9_0_9c923e96a2" y="189.644158"/>
    </g>
    <g clip-path="url(#p458337c265)">
     <use style="fill:#6aaed6;stroke:#000000;" x="753.425539" xlink:href="#C9_0_9c923e96a2" y="92.196608"/>
    </g>
    <g clip-path="url(#p458337c265)">
     <use style="fill:#6aaed6;stroke:#000000;" x="749.894478" xlink:href="#C9_0_9c923e96a2" y="227.655226"/>
    </g>
    <g clip-path="url(#p458337c265)">
     <use style="fill:#6aaed6;stroke:#000000;" x="742.844778" xlink:href="#C9_0_9c923e96a2" y="220.812318"/>
    </g>
    <g clip-path="url(#p458337c265)">
     <use style="fill:#6aaed6;stroke:#000000;" x="750.513916" xlink:href="#C9_0_9c923e96a2" y="101.529928"/>
    </g>
    <g clip-path="url(#p458337c265)">
     <use style="fill:#6aaed6;stroke:#000000;" x="744.645863" xlink:href="#C9_0_9c923e96a2" y="194.903944"/>
    </g>
    <g clip-path="url(#p458337c265)">
     <use style="fill:#6aaed6;stroke:#000000;" x="754.383388" xlink:href="#C9_0_9c923e96a2" y="173.891549"/>
    </g>
    <g clip-path="url(#p458337c265)">
     <use style="fill:#6aaed6;stroke:#000000;" x="753.155828" xlink:href="#C9_0_9c923e96a2" y="85.752735"/>
    </g>
    <g clip-path="url(#p458337c265)">
     <use style="fill:#6aaed6;stroke:#000000;" x="746.312462" xlink:href="#C9_0_9c923e96a2" y="202.589062"/>
    </g>
   </g>
   <g id="PathCollection_11">
    <defs>
     <path d="M 0 2.5 
C 0.663008 2.5 1.29895 2.236584 1.767767 1.767767 
C 2.236584 1.29895 2.5 0.663008 2.5 -0 
C 2.5 -0.663008 2.236584 -1.29895 1.767767 -1.767767 
C 1.29895 -2.236584 0.663008 -2.5 0 -2.5 
C -0.663008 -2.5 -1.29895 -2.236584 -1.767767 -1.767767 
C -2.236584 -1.29895 -2.5 -0.663008 -2.5 0 
C -2.5 0.663008 -2.236584 1.29895 -1.767767 1.767767 
C -1.29895 2.236584 -0.663008 2.5 0 2.5 
z
" id="Ca_0_d83ce6928a"/>
    </defs>
    <g clip-path="url(#p458337c265)">
     <use style="fill:#4191c6;stroke:#000000;" x="809.651118" xlink:href="#Ca_0_d83ce6928a" y="182.385294"/>
    </g>
    <g clip-path="url(#p458337c265)">
     <use style="fill:#4191c6;stroke:#000000;" x="811.52802" xlink:href="#Ca_0_d83ce6928a" y="159.17959"/>
    </g>
    <g clip-path="url(#p458337c265)">
     <use style="fill:#4191c6;stroke:#000000;" x="805.89327" xlink:href="#Ca_0_d83ce6928a" y="167.673698"/>
    </g>
    <g clip-path="url(#p458337c265)">
     <use style="fill:#4191c6;stroke:#000000;" x="812.314541" xlink:href="#Ca_0_d83ce6928a" y="236.398395"/>
    </g>
    <g clip-path="url(#p458337c265)">
     <use style="fill:#4191c6;stroke:#000000;" x="815.386433" xlink:href="#Ca_0_d83ce6928a" y="208.78879"/>
    </g>
    <g clip-path="url(#p458337c265)">
     <use style="fill:#4191c6;stroke:#000000;" x="808.311017" xlink:href="#Ca_0_d83ce6928a" y="105.301336"/>
    </g>
    <g clip-path="url(#p458337c265)">
     <use style="fill:#4191c6;stroke:#000000;" x="810.186686" xlink:href="#Ca_0_d83ce6928a" y="184.510684"/>
    </g>
    <g clip-path="url(#p458337c265)">
     <use style="fill:#4191c6;stroke:#000000;" x="810.652946" xlink:href="#Ca_0_d83ce6928a" y="217.122864"/>
    </g>
    <g clip-path="url(#p458337c265)">
     <use style="fill:#4191c6;stroke:#000000;" x="810.742312" xlink:href="#Ca_0_d83ce6928a" y="211.794662"/>
    </g>
    <g clip-path="url(#p458337c265)">
     <use style="fill:#4191c6;stroke:#000000;" x="810.755123" xlink:href="#Ca_0_d83ce6928a" y="214.005918"/>
    </g>
    <g clip-path="url(#p458337c265)">
     <use style="fill:#4191c6;stroke:#000000;" x="808.773455" xlink:href="#Ca_0_d83ce6928a" y="207.790402"/>
    </g>
    <g clip-path="url(#p458337c265)">
     <use style="fill:#4191c6;stroke:#000000;" x="807.595382" xlink:href="#Ca_0_d83ce6928a" y="238.184775"/>
    </g>
    <g clip-path="url(#p458337c265)">
     <use style="fill:#4191c6;stroke:#000000;" x="816.773295" xlink:href="#Ca_0_d83ce6928a" y="199.085983"/>
    </g>
   </g>
   <g id="PathCollection_12">
    <defs>
     <path d="M 0 2.5 
C 0.663008 2.5 1.29895 2.236584 1.767767 1.767767 
C 2.236584 1.29895 2.5 0.663008 2.5 -0 
C 2.5 -0.663008 2.236584 -1.29895 1.767767 -1.767767 
C 1.29895 -2.236584 0.663008 -2.5 0 -2.5 
C -0.663008 -2.5 -1.29895 -2.236584 -1.767767 -1.767767 
C -2.236584 -1.29895 -2.5 -0.663008 -2.5 0 
C -2.5 0.663008 -2.236584 1.29895 -1.767767 1.767767 
C -1.29895 2.236584 -0.663008 2.5 0 2.5 
z
" id="Cb_0_a2a367d190"/>
    </defs>
    <g clip-path="url(#p458337c265)">
     <use style="fill:#2070b4;stroke:#000000;" x="875.819977" xlink:href="#Cb_0_a2a367d190" y="227.819679"/>
    </g>
    <g clip-path="url(#p458337c265)">
     <use style="fill:#2070b4;stroke:#000000;" x="877.406379" xlink:href="#Cb_0_a2a367d190" y="136.165063"/>
    </g>
    <g clip-path="url(#p458337c265)">
     <use style="fill:#2070b4;stroke:#000000;" x="876.732591" xlink:href="#Cb_0_a2a367d190" y="294.057049"/>
    </g>
    <g clip-path="url(#p458337c265)">
     <use style="fill:#2070b4;stroke:#000000;" x="879.643835" xlink:href="#Cb_0_a2a367d190" y="209.142977"/>
    </g>
    <g clip-path="url(#p458337c265)">
     <use style="fill:#2070b4;stroke:#000000;" x="879.466147" xlink:href="#Cb_0_a2a367d190" y="89.803484"/>
    </g>
    <g clip-path="url(#p458337c265)">
     <use style="fill:#2070b4;stroke:#000000;" x="873.40058" xlink:href="#Cb_0_a2a367d190" y="176.995012"/>
    </g>
    <g clip-path="url(#p458337c265)">
     <use style="fill:#2070b4;stroke:#000000;" x="877.023387" xlink:href="#Cb_0_a2a367d190" y="156.602189"/>
    </g>
    <g clip-path="url(#p458337c265)">
     <use style="fill:#2070b4;stroke:#000000;" x="871.706785" xlink:href="#Cb_0_a2a367d190" y="204.907559"/>
    </g>
    <g clip-path="url(#p458337c265)">
     <use style="fill:#2070b4;stroke:#000000;" x="873.354474" xlink:href="#Cb_0_a2a367d190" y="241.36819"/>
    </g>
    <g clip-path="url(#p458337c265)">
     <use style="fill:#2070b4;stroke:#000000;" x="878.871432" xlink:href="#Cb_0_a2a367d190" y="221.187717"/>
    </g>
    <g clip-path="url(#p458337c265)">
     <use style="fill:#2070b4;stroke:#000000;" x="878.089332" xlink:href="#Cb_0_a2a367d190" y="211.489072"/>
    </g>
    <g clip-path="url(#p458337c265)">
     <use style="fill:#2070b4;stroke:#000000;" x="878.122668" xlink:href="#Cb_0_a2a367d190" y="168.665123"/>
    </g>
    <g clip-path="url(#p458337c265)">
     <use style="fill:#2070b4;stroke:#000000;" x="880.58801" xlink:href="#Cb_0_a2a367d190" y="232.42094"/>
    </g>
   </g>
   <g id="PathCollection_13">
    <defs>
     <path d="M 0 2.5 
C 0.663008 2.5 1.29895 2.236584 1.767767 1.767767 
C 2.236584 1.29895 2.5 0.663008 2.5 -0 
C 2.5 -0.663008 2.236584 -1.29895 1.767767 -1.767767 
C 1.29895 -2.236584 0.663008 -2.5 0 -2.5 
C -0.663008 -2.5 -1.29895 -2.236584 -1.767767 -1.767767 
C -2.236584 -1.29895 -2.5 -0.663008 -2.5 0 
C -2.5 0.663008 -2.236584 1.29895 -1.767767 1.767767 
C -1.29895 2.236584 -0.663008 2.5 0 2.5 
z
" id="Cc_0_de7caa5d22"/>
    </defs>
    <g clip-path="url(#p458337c265)">
     <use style="fill:#08509b;stroke:#000000;" x="937.678112" xlink:href="#Cc_0_de7caa5d22" y="227.966176"/>
    </g>
    <g clip-path="url(#p458337c265)">
     <use style="fill:#08509b;stroke:#000000;" x="935.477291" xlink:href="#Cc_0_de7caa5d22" y="238.53379"/>
    </g>
    <g clip-path="url(#p458337c265)">
     <use style="fill:#08509b;stroke:#000000;" x="939.731224" xlink:href="#Cc_0_de7caa5d22" y="216.203479"/>
    </g>
    <g clip-path="url(#p458337c265)">
     <use style="fill:#08509b;stroke:#000000;" x="931.349031" xlink:href="#Cc_0_de7caa5d22" y="202.839007"/>
    </g>
    <g clip-path="url(#p458337c265)">
     <use style="fill:#08509b;stroke:#000000;" x="931.581546" xlink:href="#Cc_0_de7caa5d22" y="231.455647"/>
    </g>
    <g clip-path="url(#p458337c265)">
     <use style="fill:#08509b;stroke:#000000;" x="941.466156" xlink:href="#Cc_0_de7caa5d22" y="224.152718"/>
    </g>
    <g clip-path="url(#p458337c265)">
     <use style="fill:#08509b;stroke:#000000;" x="935.68346" xlink:href="#Cc_0_de7caa5d22" y="137.739629"/>
    </g>
    <g clip-path="url(#p458337c265)">
     <use style="fill:#08509b;stroke:#000000;" x="940.863049" xlink:href="#Cc_0_de7caa5d22" y="197.286075"/>
    </g>
    <g clip-path="url(#p458337c265)">
     <use style="fill:#08509b;stroke:#000000;" x="936.820732" xlink:href="#Cc_0_de7caa5d22" y="246.64867"/>
    </g>
    <g clip-path="url(#p458337c265)">
     <use style="fill:#08509b;stroke:#000000;" x="934.21117" xlink:href="#Cc_0_de7caa5d22" y="224.952474"/>
    </g>
    <g clip-path="url(#p458337c265)">
     <use style="fill:#08509b;stroke:#000000;" x="933.61594" xlink:href="#Cc_0_de7caa5d22" y="132.02059"/>
    </g>
    <g clip-path="url(#p458337c265)">
     <use style="fill:#08509b;stroke:#000000;" x="943.186295" xlink:href="#Cc_0_de7caa5d22" y="238.417869"/>
    </g>
    <g clip-path="url(#p458337c265)">
     <use style="fill:#08509b;stroke:#000000;" x="941.581722" xlink:href="#Cc_0_de7caa5d22" y="124.625036"/>
    </g>
    <g clip-path="url(#p458337c265)">
     <use style="fill:#08509b;stroke:#000000;" x="941.413096" xlink:href="#Cc_0_de7caa5d22" y="231.990566"/>
    </g>
    <g clip-path="url(#p458337c265)">
     <use style="fill:#08509b;stroke:#000000;" x="935.070502" xlink:href="#Cc_0_de7caa5d22" y="159.563001"/>
    </g>
    <g clip-path="url(#p458337c265)">
     <use style="fill:#08509b;stroke:#000000;" x="937.467542" xlink:href="#Cc_0_de7caa5d22" y="216.712478"/>
    </g>
    <g clip-path="url(#p458337c265)">
     <use style="fill:#08509b;stroke:#000000;" x="934.127865" xlink:href="#Cc_0_de7caa5d22" y="228.635018"/>
    </g>
    <g clip-path="url(#p458337c265)">
     <use style="fill:#08509b;stroke:#000000;" x="938.663084" xlink:href="#Cc_0_de7caa5d22" y="201.78998"/>
    </g>
    <g clip-path="url(#p458337c265)">
     <use style="fill:#08509b;stroke:#000000;" x="940.516507" xlink:href="#Cc_0_de7caa5d22" y="201.286887"/>
    </g>
   </g>
  </g>
 </g>
 <defs>
  <clipPath id="p458337c265">
   <rect height="264.100747" width="819.09" x="150.03" y="41.960881"/>
  </clipPath>
 </defs>
</svg>
