<?xml version="1.0" encoding="utf-8" standalone="no"?>
<!DOCTYPE svg PUBLIC "-//W3C//DTD SVG 1.1//EN"
  "http://www.w3.org/Graphics/SVG/1.1/DTD/svg11.dtd">
<svg height="576pt" version="1.1" viewBox="0 0 1008 576" width="1008pt" xmlns="http://www.w3.org/2000/svg" xmlns:xlink="http://www.w3.org/1999/xlink">
 <metadata>
  <rdf:RDF xmlns:cc="http://creativecommons.org/ns#" xmlns:dc="http://purl.org/dc/elements/1.1/" xmlns:rdf="http://www.w3.org/1999/02/22-rdf-syntax-ns#">
   <cc:Work>
    <dc:type rdf:resource="http://purl.org/dc/dcmitype/StillImage"/>
    <dc:date>2021-11-29T17:01:27.698811</dc:date>
    <dc:format>image/svg+xml</dc:format>
    <dc:creator>
     <cc:Agent>
      <dc:title>Matplotlib v3.4.1, https://matplotlib.org/</dc:title>
     </cc:Agent>
    </dc:creator>
   </cc:Work>
  </rdf:RDF>
 </metadata>
 <defs>
  <style type="text/css">*{stroke-linecap:butt;stroke-linejoin:round;}</style>
 </defs>
 <g id="figure_1">
  <g id="patch_1">
   <path d="M 0 576 
L 1008 576 
L 1008 0 
L 0 0 
z
" style="fill:#ffffff;"/>
  </g>
  <g id="axes_1">
   <g id="patch_2">
    <path d="M 139.5 306.061628 
L 969.12 306.061628 
L 969.12 38.88 
L 139.5 38.88 
z
" style="fill:#ffffff;"/>
   </g>
   <g id="matplotlib.axis_1">
    <g id="xtick_1">
     <g id="line2d_1">
      <defs>
       <path d="M 0 0 
L 0 6 
" id="m72c7b18743" style="stroke:#262626;stroke-width:1.25;"/>
      </defs>
      <g>
       <use style="fill:#262626;stroke:#262626;stroke-width:1.25;" x="208.635" xlink:href="#m72c7b18743" y="306.061628"/>
      </g>
     </g>
     <g id="text_1">
      <!-- Col-0 -->
      <g style="fill:#262626;" transform="translate(143.462404 393.611964)rotate(-45)scale(0.33 -0.33)">
       <defs>
        <path d="M 4122 4306 
L 4122 3641 
Q 3803 3938 3442 4084 
Q 3081 4231 2675 4231 
Q 1875 4231 1450 3742 
Q 1025 3253 1025 2328 
Q 1025 1406 1450 917 
Q 1875 428 2675 428 
Q 3081 428 3442 575 
Q 3803 722 4122 1019 
L 4122 359 
Q 3791 134 3420 21 
Q 3050 -91 2638 -91 
Q 1578 -91 968 557 
Q 359 1206 359 2328 
Q 359 3453 968 4101 
Q 1578 4750 2638 4750 
Q 3056 4750 3426 4639 
Q 3797 4528 4122 4306 
z
" id="DejaVuSans-43" transform="scale(0.015625)"/>
        <path d="M 1959 3097 
Q 1497 3097 1228 2736 
Q 959 2375 959 1747 
Q 959 1119 1226 758 
Q 1494 397 1959 397 
Q 2419 397 2687 759 
Q 2956 1122 2956 1747 
Q 2956 2369 2687 2733 
Q 2419 3097 1959 3097 
z
M 1959 3584 
Q 2709 3584 3137 3096 
Q 3566 2609 3566 1747 
Q 3566 888 3137 398 
Q 2709 -91 1959 -91 
Q 1206 -91 779 398 
Q 353 888 353 1747 
Q 353 2609 779 3096 
Q 1206 3584 1959 3584 
z
" id="DejaVuSans-6f" transform="scale(0.015625)"/>
        <path d="M 603 4863 
L 1178 4863 
L 1178 0 
L 603 0 
L 603 4863 
z
" id="DejaVuSans-6c" transform="scale(0.015625)"/>
        <path d="M 313 2009 
L 1997 2009 
L 1997 1497 
L 313 1497 
L 313 2009 
z
" id="DejaVuSans-2d" transform="scale(0.015625)"/>
        <path d="M 2034 4250 
Q 1547 4250 1301 3770 
Q 1056 3291 1056 2328 
Q 1056 1369 1301 889 
Q 1547 409 2034 409 
Q 2525 409 2770 889 
Q 3016 1369 3016 2328 
Q 3016 3291 2770 3770 
Q 2525 4250 2034 4250 
z
M 2034 4750 
Q 2819 4750 3233 4129 
Q 3647 3509 3647 2328 
Q 3647 1150 3233 529 
Q 2819 -91 2034 -91 
Q 1250 -91 836 529 
Q 422 1150 422 2328 
Q 422 3509 836 4129 
Q 1250 4750 2034 4750 
z
" id="DejaVuSans-30" transform="scale(0.015625)"/>
       </defs>
       <use xlink:href="#DejaVuSans-43"/>
       <use x="69.824219" xlink:href="#DejaVuSans-6f"/>
       <use x="131.005859" xlink:href="#DejaVuSans-6c"/>
       <use x="158.789062" xlink:href="#DejaVuSans-2d"/>
       <use x="194.873047" xlink:href="#DejaVuSans-30"/>
      </g>
     </g>
    </g>
    <g id="xtick_2">
     <g id="line2d_2">
      <g>
       <use style="fill:#262626;stroke:#262626;stroke-width:1.25;" x="346.905" xlink:href="#m72c7b18743" y="306.061628"/>
      </g>
     </g>
     <g id="text_2">
      <!-- $abcb1$ -->
      <g style="fill:#262626;" transform="translate(270.41516 404.929208)rotate(-45)scale(0.33 -0.33)">
       <defs>
        <path d="M 3438 1997 
L 3047 0 
L 2472 0 
L 2578 531 
Q 2325 219 2001 64 
Q 1678 -91 1281 -91 
Q 834 -91 548 182 
Q 263 456 263 884 
Q 263 1497 752 1853 
Q 1241 2209 2100 2209 
L 2900 2209 
L 2931 2363 
Q 2938 2388 2941 2417 
Q 2944 2447 2944 2509 
Q 2944 2788 2717 2942 
Q 2491 3097 2081 3097 
Q 1800 3097 1504 3025 
Q 1209 2953 897 2809 
L 997 3341 
Q 1322 3463 1633 3523 
Q 1944 3584 2234 3584 
Q 2853 3584 3176 3315 
Q 3500 3047 3500 2534 
Q 3500 2431 3484 2292 
Q 3469 2153 3438 1997 
z
M 2816 1759 
L 2241 1759 
Q 1534 1759 1195 1570 
Q 856 1381 856 984 
Q 856 709 1029 553 
Q 1203 397 1509 397 
Q 1978 397 2328 733 
Q 2678 1069 2791 1631 
L 2816 1759 
z
" id="DejaVuSans-Oblique-61" transform="scale(0.015625)"/>
        <path d="M 3169 2138 
Q 3169 2591 2961 2847 
Q 2753 3103 2388 3103 
Q 2122 3103 1889 2973 
Q 1656 2844 1484 2597 
Q 1303 2338 1198 1995 
Q 1094 1653 1094 1313 
Q 1094 881 1298 636 
Q 1503 391 1863 391 
Q 2134 391 2365 517 
Q 2597 644 2772 891 
Q 2950 1147 3059 1487 
Q 3169 1828 3169 2138 
z
M 1381 2969 
Q 1594 3256 1914 3420 
Q 2234 3584 2584 3584 
Q 3122 3584 3439 3221 
Q 3756 2859 3756 2241 
Q 3756 1734 3570 1259 
Q 3384 784 3041 416 
Q 2816 172 2522 40 
Q 2228 -91 1906 -91 
Q 1566 -91 1316 65 
Q 1066 222 909 531 
L 806 0 
L 231 0 
L 1178 4863 
L 1753 4863 
L 1381 2969 
z
" id="DejaVuSans-Oblique-62" transform="scale(0.015625)"/>
        <path d="M 3431 3366 
L 3316 2797 
Q 3109 2947 2876 3022 
Q 2644 3097 2394 3097 
Q 2119 3097 1870 3000 
Q 1622 2903 1453 2725 
Q 1184 2453 1037 2087 
Q 891 1722 891 1331 
Q 891 859 1127 628 
Q 1363 397 1844 397 
Q 2081 397 2348 469 
Q 2616 541 2906 684 
L 2797 116 
Q 2547 13 2283 -39 
Q 2019 -91 1741 -91 
Q 1044 -91 669 257 
Q 294 606 294 1253 
Q 294 1797 489 2255 
Q 684 2713 1069 3078 
Q 1331 3328 1684 3456 
Q 2038 3584 2456 3584 
Q 2700 3584 2940 3529 
Q 3181 3475 3431 3366 
z
" id="DejaVuSans-Oblique-63" transform="scale(0.015625)"/>
        <path d="M 794 531 
L 1825 531 
L 1825 4091 
L 703 3866 
L 703 4441 
L 1819 4666 
L 2450 4666 
L 2450 531 
L 3481 531 
L 3481 0 
L 794 0 
L 794 531 
z
" id="DejaVuSans-31" transform="scale(0.015625)"/>
       </defs>
       <use transform="translate(0 0.015625)" xlink:href="#DejaVuSans-Oblique-61"/>
       <use transform="translate(61.279297 0.015625)" xlink:href="#DejaVuSans-Oblique-62"/>
       <use transform="translate(124.755859 0.015625)" xlink:href="#DejaVuSans-Oblique-63"/>
       <use transform="translate(179.736328 0.015625)" xlink:href="#DejaVuSans-Oblique-62"/>
       <use transform="translate(243.212891 0.015625)" xlink:href="#DejaVuSans-31"/>
      </g>
     </g>
    </g>
    <g id="xtick_3">
     <g id="line2d_3">
      <g>
       <use style="fill:#262626;stroke:#262626;stroke-width:1.25;" x="485.175" xlink:href="#m72c7b18743" y="306.061628"/>
      </g>
     </g>
     <g id="text_3">
      <!-- $abcb19$ -->
      <g style="fill:#262626;" transform="translate(393.751065 419.863303)rotate(-45)scale(0.33 -0.33)">
       <defs>
        <path d="M 703 97 
L 703 672 
Q 941 559 1184 500 
Q 1428 441 1663 441 
Q 2288 441 2617 861 
Q 2947 1281 2994 2138 
Q 2813 1869 2534 1725 
Q 2256 1581 1919 1581 
Q 1219 1581 811 2004 
Q 403 2428 403 3163 
Q 403 3881 828 4315 
Q 1253 4750 1959 4750 
Q 2769 4750 3195 4129 
Q 3622 3509 3622 2328 
Q 3622 1225 3098 567 
Q 2575 -91 1691 -91 
Q 1453 -91 1209 -44 
Q 966 3 703 97 
z
M 1959 2075 
Q 2384 2075 2632 2365 
Q 2881 2656 2881 3163 
Q 2881 3666 2632 3958 
Q 2384 4250 1959 4250 
Q 1534 4250 1286 3958 
Q 1038 3666 1038 3163 
Q 1038 2656 1286 2365 
Q 1534 2075 1959 2075 
z
" id="DejaVuSans-39" transform="scale(0.015625)"/>
       </defs>
       <use transform="translate(0 0.015625)" xlink:href="#DejaVuSans-Oblique-61"/>
       <use transform="translate(61.279297 0.015625)" xlink:href="#DejaVuSans-Oblique-62"/>
       <use transform="translate(124.755859 0.015625)" xlink:href="#DejaVuSans-Oblique-63"/>
       <use transform="translate(179.736328 0.015625)" xlink:href="#DejaVuSans-Oblique-62"/>
       <use transform="translate(243.212891 0.015625)" xlink:href="#DejaVuSans-31"/>
       <use transform="translate(306.835938 0.015625)" xlink:href="#DejaVuSans-39"/>
      </g>
     </g>
    </g>
    <g id="xtick_4">
     <g id="line2d_4">
      <g>
       <use style="fill:#262626;stroke:#262626;stroke-width:1.25;" x="623.445" xlink:href="#m72c7b18743" y="306.061628"/>
      </g>
     </g>
     <g id="text_4">
      <!-- $abcb1,19$ -->
      <g style="fill:#262626;" transform="translate(505.186363 446.698006)rotate(-45)scale(0.33 -0.33)">
       <defs>
        <path d="M 750 794 
L 1409 794 
L 1409 256 
L 897 -744 
L 494 -744 
L 750 256 
L 750 794 
z
" id="DejaVuSans-2c" transform="scale(0.015625)"/>
       </defs>
       <use transform="translate(0 0.015625)" xlink:href="#DejaVuSans-Oblique-61"/>
       <use transform="translate(61.279297 0.015625)" xlink:href="#DejaVuSans-Oblique-62"/>
       <use transform="translate(124.755859 0.015625)" xlink:href="#DejaVuSans-Oblique-63"/>
       <use transform="translate(179.736328 0.015625)" xlink:href="#DejaVuSans-Oblique-62"/>
       <use transform="translate(243.212891 0.015625)" xlink:href="#DejaVuSans-31"/>
       <use transform="translate(306.835938 0.015625)" xlink:href="#DejaVuSans-2c"/>
       <use transform="translate(358.105469 0.015625)" xlink:href="#DejaVuSans-31"/>
       <use transform="translate(421.728516 0.015625)" xlink:href="#DejaVuSans-39"/>
      </g>
     </g>
    </g>
    <g id="xtick_5">
     <g id="line2d_5">
      <g>
       <use style="fill:#262626;stroke:#262626;stroke-width:1.25;" x="761.715" xlink:href="#m72c7b18743" y="306.061628"/>
      </g>
     </g>
     <g id="text_5">
      <!-- $aux1$ -->
      <g style="fill:#262626;" transform="translate(698.992529 391.161839)rotate(-45)scale(0.33 -0.33)">
       <defs>
        <path d="M 428 1388 
L 838 3500 
L 1416 3500 
L 1006 1409 
Q 975 1256 961 1147 
Q 947 1038 947 966 
Q 947 700 1109 554 
Q 1272 409 1569 409 
Q 2031 409 2368 721 
Q 2706 1034 2809 1563 
L 3194 3500 
L 3769 3500 
L 3091 0 
L 2516 0 
L 2631 550 
Q 2388 244 2052 76 
Q 1716 -91 1338 -91 
Q 878 -91 622 161 
Q 366 413 366 863 
Q 366 956 381 1097 
Q 397 1238 428 1388 
z
" id="DejaVuSans-Oblique-75" transform="scale(0.015625)"/>
        <path d="M 3841 3500 
L 2234 1784 
L 3219 0 
L 2559 0 
L 1819 1388 
L 531 0 
L -166 0 
L 1556 1844 
L 641 3500 
L 1300 3500 
L 1972 2234 
L 3144 3500 
L 3841 3500 
z
" id="DejaVuSans-Oblique-78" transform="scale(0.015625)"/>
       </defs>
       <use transform="translate(0 0.09375)" xlink:href="#DejaVuSans-Oblique-61"/>
       <use transform="translate(61.279297 0.09375)" xlink:href="#DejaVuSans-Oblique-75"/>
       <use transform="translate(124.658203 0.09375)" xlink:href="#DejaVuSans-Oblique-78"/>
       <use transform="translate(183.837891 0.09375)" xlink:href="#DejaVuSans-31"/>
      </g>
     </g>
    </g>
    <g id="xtick_6">
     <g id="line2d_6">
      <g>
       <use style="fill:#262626;stroke:#262626;stroke-width:1.25;" x="899.985" xlink:href="#m72c7b18743" y="306.061628"/>
      </g>
     </g>
     <g id="text_6">
      <!-- $aux1lax1,2,3$ -->
      <g style="fill:#262626;" transform="translate(734.123934 494.300434)rotate(-45)scale(0.33 -0.33)">
       <defs>
        <path d="M 1172 4863 
L 1747 4863 
L 800 0 
L 225 0 
L 1172 4863 
z
" id="DejaVuSans-Oblique-6c" transform="scale(0.015625)"/>
        <path d="M 1228 531 
L 3431 531 
L 3431 0 
L 469 0 
L 469 531 
Q 828 903 1448 1529 
Q 2069 2156 2228 2338 
Q 2531 2678 2651 2914 
Q 2772 3150 2772 3378 
Q 2772 3750 2511 3984 
Q 2250 4219 1831 4219 
Q 1534 4219 1204 4116 
Q 875 4013 500 3803 
L 500 4441 
Q 881 4594 1212 4672 
Q 1544 4750 1819 4750 
Q 2544 4750 2975 4387 
Q 3406 4025 3406 3419 
Q 3406 3131 3298 2873 
Q 3191 2616 2906 2266 
Q 2828 2175 2409 1742 
Q 1991 1309 1228 531 
z
" id="DejaVuSans-32" transform="scale(0.015625)"/>
        <path d="M 2597 2516 
Q 3050 2419 3304 2112 
Q 3559 1806 3559 1356 
Q 3559 666 3084 287 
Q 2609 -91 1734 -91 
Q 1441 -91 1130 -33 
Q 819 25 488 141 
L 488 750 
Q 750 597 1062 519 
Q 1375 441 1716 441 
Q 2309 441 2620 675 
Q 2931 909 2931 1356 
Q 2931 1769 2642 2001 
Q 2353 2234 1838 2234 
L 1294 2234 
L 1294 2753 
L 1863 2753 
Q 2328 2753 2575 2939 
Q 2822 3125 2822 3475 
Q 2822 3834 2567 4026 
Q 2313 4219 1838 4219 
Q 1578 4219 1281 4162 
Q 984 4106 628 3988 
L 628 4550 
Q 988 4650 1302 4700 
Q 1616 4750 1894 4750 
Q 2613 4750 3031 4423 
Q 3450 4097 3450 3541 
Q 3450 3153 3228 2886 
Q 3006 2619 2597 2516 
z
" id="DejaVuSans-33" transform="scale(0.015625)"/>
       </defs>
       <use transform="translate(0 0.015625)" xlink:href="#DejaVuSans-Oblique-61"/>
       <use transform="translate(61.279297 0.015625)" xlink:href="#DejaVuSans-Oblique-75"/>
       <use transform="translate(124.658203 0.015625)" xlink:href="#DejaVuSans-Oblique-78"/>
       <use transform="translate(183.837891 0.015625)" xlink:href="#DejaVuSans-31"/>
       <use transform="translate(247.460938 0.015625)" xlink:href="#DejaVuSans-Oblique-6c"/>
       <use transform="translate(275.244141 0.015625)" xlink:href="#DejaVuSans-Oblique-61"/>
       <use transform="translate(336.523438 0.015625)" xlink:href="#DejaVuSans-Oblique-78"/>
       <use transform="translate(395.703125 0.015625)" xlink:href="#DejaVuSans-31"/>
       <use transform="translate(459.326172 0.015625)" xlink:href="#DejaVuSans-2c"/>
       <use transform="translate(510.595703 0.015625)" xlink:href="#DejaVuSans-32"/>
       <use transform="translate(574.21875 0.015625)" xlink:href="#DejaVuSans-2c"/>
       <use transform="translate(625.488281 0.015625)" xlink:href="#DejaVuSans-33"/>
      </g>
     </g>
    </g>
    <g id="text_7">
     <!-- Genotype -->
     <g style="fill:#262626;" transform="translate(466.652813 530.507661)scale(0.36 -0.36)">
      <defs>
       <path d="M 3809 666 
L 3809 1919 
L 2778 1919 
L 2778 2438 
L 4434 2438 
L 4434 434 
Q 4069 175 3628 42 
Q 3188 -91 2688 -91 
Q 1594 -91 976 548 
Q 359 1188 359 2328 
Q 359 3472 976 4111 
Q 1594 4750 2688 4750 
Q 3144 4750 3555 4637 
Q 3966 4525 4313 4306 
L 4313 3634 
Q 3963 3931 3569 4081 
Q 3175 4231 2741 4231 
Q 1884 4231 1454 3753 
Q 1025 3275 1025 2328 
Q 1025 1384 1454 906 
Q 1884 428 2741 428 
Q 3075 428 3337 486 
Q 3600 544 3809 666 
z
" id="DejaVuSans-47" transform="scale(0.015625)"/>
       <path d="M 3597 1894 
L 3597 1613 
L 953 1613 
Q 991 1019 1311 708 
Q 1631 397 2203 397 
Q 2534 397 2845 478 
Q 3156 559 3463 722 
L 3463 178 
Q 3153 47 2828 -22 
Q 2503 -91 2169 -91 
Q 1331 -91 842 396 
Q 353 884 353 1716 
Q 353 2575 817 3079 
Q 1281 3584 2069 3584 
Q 2775 3584 3186 3129 
Q 3597 2675 3597 1894 
z
M 3022 2063 
Q 3016 2534 2758 2815 
Q 2500 3097 2075 3097 
Q 1594 3097 1305 2825 
Q 1016 2553 972 2059 
L 3022 2063 
z
" id="DejaVuSans-65" transform="scale(0.015625)"/>
       <path d="M 3513 2113 
L 3513 0 
L 2938 0 
L 2938 2094 
Q 2938 2591 2744 2837 
Q 2550 3084 2163 3084 
Q 1697 3084 1428 2787 
Q 1159 2491 1159 1978 
L 1159 0 
L 581 0 
L 581 3500 
L 1159 3500 
L 1159 2956 
Q 1366 3272 1645 3428 
Q 1925 3584 2291 3584 
Q 2894 3584 3203 3211 
Q 3513 2838 3513 2113 
z
" id="DejaVuSans-6e" transform="scale(0.015625)"/>
       <path d="M 1172 4494 
L 1172 3500 
L 2356 3500 
L 2356 3053 
L 1172 3053 
L 1172 1153 
Q 1172 725 1289 603 
Q 1406 481 1766 481 
L 2356 481 
L 2356 0 
L 1766 0 
Q 1100 0 847 248 
Q 594 497 594 1153 
L 594 3053 
L 172 3053 
L 172 3500 
L 594 3500 
L 594 4494 
L 1172 4494 
z
" id="DejaVuSans-74" transform="scale(0.015625)"/>
       <path d="M 2059 -325 
Q 1816 -950 1584 -1140 
Q 1353 -1331 966 -1331 
L 506 -1331 
L 506 -850 
L 844 -850 
Q 1081 -850 1212 -737 
Q 1344 -625 1503 -206 
L 1606 56 
L 191 3500 
L 800 3500 
L 1894 763 
L 2988 3500 
L 3597 3500 
L 2059 -325 
z
" id="DejaVuSans-79" transform="scale(0.015625)"/>
       <path d="M 1159 525 
L 1159 -1331 
L 581 -1331 
L 581 3500 
L 1159 3500 
L 1159 2969 
Q 1341 3281 1617 3432 
Q 1894 3584 2278 3584 
Q 2916 3584 3314 3078 
Q 3713 2572 3713 1747 
Q 3713 922 3314 415 
Q 2916 -91 2278 -91 
Q 1894 -91 1617 61 
Q 1341 213 1159 525 
z
M 3116 1747 
Q 3116 2381 2855 2742 
Q 2594 3103 2138 3103 
Q 1681 3103 1420 2742 
Q 1159 2381 1159 1747 
Q 1159 1113 1420 752 
Q 1681 391 2138 391 
Q 2594 391 2855 752 
Q 3116 1113 3116 1747 
z
" id="DejaVuSans-70" transform="scale(0.015625)"/>
      </defs>
      <use xlink:href="#DejaVuSans-47"/>
      <use x="77.490234" xlink:href="#DejaVuSans-65"/>
      <use x="139.013672" xlink:href="#DejaVuSans-6e"/>
      <use x="202.392578" xlink:href="#DejaVuSans-6f"/>
      <use x="263.574219" xlink:href="#DejaVuSans-74"/>
      <use x="302.783203" xlink:href="#DejaVuSans-79"/>
      <use x="361.962891" xlink:href="#DejaVuSans-70"/>
      <use x="425.439453" xlink:href="#DejaVuSans-65"/>
     </g>
    </g>
   </g>
   <g id="matplotlib.axis_2">
    <g id="ytick_1">
     <g id="line2d_7">
      <defs>
       <path d="M 0 0 
L -6 0 
" id="mac566c1b3d" style="stroke:#262626;stroke-width:1.25;"/>
      </defs>
      <g>
       <use style="fill:#262626;stroke:#262626;stroke-width:1.25;" x="139.5" xlink:href="#mac566c1b3d" y="274.628495"/>
      </g>
     </g>
     <g id="text_8">
      <!-- 1.00 -->
      <g style="fill:#262626;" transform="translate(56.523438 287.165917)scale(0.33 -0.33)">
       <defs>
        <path d="M 684 794 
L 1344 794 
L 1344 0 
L 684 0 
L 684 794 
z
" id="DejaVuSans-2e" transform="scale(0.015625)"/>
       </defs>
       <use xlink:href="#DejaVuSans-31"/>
       <use x="63.623047" xlink:href="#DejaVuSans-2e"/>
       <use x="95.410156" xlink:href="#DejaVuSans-30"/>
       <use x="159.033203" xlink:href="#DejaVuSans-30"/>
      </g>
     </g>
    </g>
    <g id="ytick_2">
     <g id="line2d_8">
      <g>
       <use style="fill:#262626;stroke:#262626;stroke-width:1.25;" x="139.5" xlink:href="#mac566c1b3d" y="196.045664"/>
      </g>
     </g>
     <g id="text_9">
      <!-- 1.25 -->
      <g style="fill:#262626;" transform="translate(56.523438 208.583086)scale(0.33 -0.33)">
       <defs>
        <path d="M 691 4666 
L 3169 4666 
L 3169 4134 
L 1269 4134 
L 1269 2991 
Q 1406 3038 1543 3061 
Q 1681 3084 1819 3084 
Q 2600 3084 3056 2656 
Q 3513 2228 3513 1497 
Q 3513 744 3044 326 
Q 2575 -91 1722 -91 
Q 1428 -91 1123 -41 
Q 819 9 494 109 
L 494 744 
Q 775 591 1075 516 
Q 1375 441 1709 441 
Q 2250 441 2565 725 
Q 2881 1009 2881 1497 
Q 2881 1984 2565 2268 
Q 2250 2553 1709 2553 
Q 1456 2553 1204 2497 
Q 953 2441 691 2322 
L 691 4666 
z
" id="DejaVuSans-35" transform="scale(0.015625)"/>
       </defs>
       <use xlink:href="#DejaVuSans-31"/>
       <use x="63.623047" xlink:href="#DejaVuSans-2e"/>
       <use x="95.410156" xlink:href="#DejaVuSans-32"/>
       <use x="159.033203" xlink:href="#DejaVuSans-35"/>
      </g>
     </g>
    </g>
    <g id="ytick_3">
     <g id="line2d_9">
      <g>
       <use style="fill:#262626;stroke:#262626;stroke-width:1.25;" x="139.5" xlink:href="#mac566c1b3d" y="117.462832"/>
      </g>
     </g>
     <g id="text_10">
      <!-- 1.50 -->
      <g style="fill:#262626;" transform="translate(56.523438 130.000254)scale(0.33 -0.33)">
       <use xlink:href="#DejaVuSans-31"/>
       <use x="63.623047" xlink:href="#DejaVuSans-2e"/>
       <use x="95.410156" xlink:href="#DejaVuSans-35"/>
       <use x="159.033203" xlink:href="#DejaVuSans-30"/>
      </g>
     </g>
    </g>
    <g id="ytick_4">
     <g id="line2d_10">
      <g>
       <use style="fill:#262626;stroke:#262626;stroke-width:1.25;" x="139.5" xlink:href="#mac566c1b3d" y="38.88"/>
      </g>
     </g>
     <g id="text_11">
      <!-- 1.75 -->
      <g style="fill:#262626;" transform="translate(56.523438 51.417422)scale(0.33 -0.33)">
       <defs>
        <path d="M 525 4666 
L 3525 4666 
L 3525 4397 
L 1831 0 
L 1172 0 
L 2766 4134 
L 525 4134 
L 525 4666 
z
" id="DejaVuSans-37" transform="scale(0.015625)"/>
       </defs>
       <use xlink:href="#DejaVuSans-31"/>
       <use x="63.623047" xlink:href="#DejaVuSans-2e"/>
       <use x="95.410156" xlink:href="#DejaVuSans-37"/>
       <use x="159.033203" xlink:href="#DejaVuSans-35"/>
      </g>
     </g>
    </g>
    <g id="text_12">
     <!-- Pr. curv. ratio -->
     <g style="fill:#262626;" transform="translate(45.036562 291.113314)rotate(-90)scale(0.36 -0.36)">
      <defs>
       <path d="M 1259 4147 
L 1259 2394 
L 2053 2394 
Q 2494 2394 2734 2622 
Q 2975 2850 2975 3272 
Q 2975 3691 2734 3919 
Q 2494 4147 2053 4147 
L 1259 4147 
z
M 628 4666 
L 2053 4666 
Q 2838 4666 3239 4311 
Q 3641 3956 3641 3272 
Q 3641 2581 3239 2228 
Q 2838 1875 2053 1875 
L 1259 1875 
L 1259 0 
L 628 0 
L 628 4666 
z
" id="DejaVuSans-50" transform="scale(0.015625)"/>
       <path d="M 2631 2963 
Q 2534 3019 2420 3045 
Q 2306 3072 2169 3072 
Q 1681 3072 1420 2755 
Q 1159 2438 1159 1844 
L 1159 0 
L 581 0 
L 581 3500 
L 1159 3500 
L 1159 2956 
Q 1341 3275 1631 3429 
Q 1922 3584 2338 3584 
Q 2397 3584 2469 3576 
Q 2541 3569 2628 3553 
L 2631 2963 
z
" id="DejaVuSans-72" transform="scale(0.015625)"/>
       <path id="DejaVuSans-20" transform="scale(0.015625)"/>
       <path d="M 3122 3366 
L 3122 2828 
Q 2878 2963 2633 3030 
Q 2388 3097 2138 3097 
Q 1578 3097 1268 2742 
Q 959 2388 959 1747 
Q 959 1106 1268 751 
Q 1578 397 2138 397 
Q 2388 397 2633 464 
Q 2878 531 3122 666 
L 3122 134 
Q 2881 22 2623 -34 
Q 2366 -91 2075 -91 
Q 1284 -91 818 406 
Q 353 903 353 1747 
Q 353 2603 823 3093 
Q 1294 3584 2113 3584 
Q 2378 3584 2631 3529 
Q 2884 3475 3122 3366 
z
" id="DejaVuSans-63" transform="scale(0.015625)"/>
       <path d="M 544 1381 
L 544 3500 
L 1119 3500 
L 1119 1403 
Q 1119 906 1312 657 
Q 1506 409 1894 409 
Q 2359 409 2629 706 
Q 2900 1003 2900 1516 
L 2900 3500 
L 3475 3500 
L 3475 0 
L 2900 0 
L 2900 538 
Q 2691 219 2414 64 
Q 2138 -91 1772 -91 
Q 1169 -91 856 284 
Q 544 659 544 1381 
z
M 1991 3584 
L 1991 3584 
z
" id="DejaVuSans-75" transform="scale(0.015625)"/>
       <path d="M 191 3500 
L 800 3500 
L 1894 563 
L 2988 3500 
L 3597 3500 
L 2284 0 
L 1503 0 
L 191 3500 
z
" id="DejaVuSans-76" transform="scale(0.015625)"/>
       <path d="M 2194 1759 
Q 1497 1759 1228 1600 
Q 959 1441 959 1056 
Q 959 750 1161 570 
Q 1363 391 1709 391 
Q 2188 391 2477 730 
Q 2766 1069 2766 1631 
L 2766 1759 
L 2194 1759 
z
M 3341 1997 
L 3341 0 
L 2766 0 
L 2766 531 
Q 2569 213 2275 61 
Q 1981 -91 1556 -91 
Q 1019 -91 701 211 
Q 384 513 384 1019 
Q 384 1609 779 1909 
Q 1175 2209 1959 2209 
L 2766 2209 
L 2766 2266 
Q 2766 2663 2505 2880 
Q 2244 3097 1772 3097 
Q 1472 3097 1187 3025 
Q 903 2953 641 2809 
L 641 3341 
Q 956 3463 1253 3523 
Q 1550 3584 1831 3584 
Q 2591 3584 2966 3190 
Q 3341 2797 3341 1997 
z
" id="DejaVuSans-61" transform="scale(0.015625)"/>
       <path d="M 603 3500 
L 1178 3500 
L 1178 0 
L 603 0 
L 603 3500 
z
M 603 4863 
L 1178 4863 
L 1178 4134 
L 603 4134 
L 603 4863 
z
" id="DejaVuSans-69" transform="scale(0.015625)"/>
      </defs>
      <use xlink:href="#DejaVuSans-50"/>
      <use x="58.552734" xlink:href="#DejaVuSans-72"/>
      <use x="90.541016" xlink:href="#DejaVuSans-2e"/>
      <use x="122.328125" xlink:href="#DejaVuSans-20"/>
      <use x="154.115234" xlink:href="#DejaVuSans-63"/>
      <use x="209.095703" xlink:href="#DejaVuSans-75"/>
      <use x="272.474609" xlink:href="#DejaVuSans-72"/>
      <use x="313.587891" xlink:href="#DejaVuSans-76"/>
      <use x="365.017578" xlink:href="#DejaVuSans-2e"/>
      <use x="396.804688" xlink:href="#DejaVuSans-20"/>
      <use x="428.591797" xlink:href="#DejaVuSans-72"/>
      <use x="469.705078" xlink:href="#DejaVuSans-61"/>
      <use x="530.984375" xlink:href="#DejaVuSans-74"/>
      <use x="570.193359" xlink:href="#DejaVuSans-69"/>
      <use x="597.976562" xlink:href="#DejaVuSans-6f"/>
     </g>
    </g>
   </g>
   <g id="patch_3">
    <path clip-path="url(#p154b08486d)" d="M 153.327 252.286043 
L 263.943 252.286043 
L 263.943 229.064079 
L 153.327 229.064079 
L 153.327 252.286043 
z
" style="fill:#959595;stroke:#414141;stroke-linejoin:miter;stroke-width:1.5;"/>
   </g>
   <g id="patch_4">
    <path clip-path="url(#p154b08486d)" d="M 291.597 235.717112 
L 402.213 235.717112 
L 402.213 227.119841 
L 291.597 227.119841 
L 291.597 235.717112 
z
" style="fill:#f1c0ac;stroke:#414141;stroke-linejoin:miter;stroke-width:1.5;"/>
   </g>
   <g id="patch_5">
    <path clip-path="url(#p154b08486d)" d="M 429.867 232.46096 
L 540.483 232.46096 
L 540.483 222.57582 
L 429.867 222.57582 
L 429.867 232.46096 
z
" style="fill:#e57760;stroke:#414141;stroke-linejoin:miter;stroke-width:1.5;"/>
   </g>
   <g id="patch_6">
    <path clip-path="url(#p154b08486d)" d="M 568.137 230.227354 
L 678.753 230.227354 
L 678.753 192.585172 
L 568.137 192.585172 
L 568.137 230.227354 
z
" style="fill:#b42e32;stroke:#414141;stroke-linejoin:miter;stroke-width:1.5;"/>
   </g>
   <g id="patch_7">
    <path clip-path="url(#p154b08486d)" d="M 706.407 258.20045 
L 817.023 258.20045 
L 817.023 217.481414 
L 706.407 217.481414 
L 706.407 258.20045 
z
" style="fill:#b3d7ae;stroke:#414141;stroke-linejoin:miter;stroke-width:1.5;"/>
   </g>
   <g id="patch_8">
    <path clip-path="url(#p154b08486d)" d="M 844.677 242.951314 
L 955.293 242.951314 
L 955.293 224.402536 
L 844.677 224.402536 
L 844.677 242.951314 
z
" style="fill:#44935b;stroke:#414141;stroke-linejoin:miter;stroke-width:1.5;"/>
   </g>
   <g id="line2d_11">
    <path clip-path="url(#p154b08486d)" d="M 208.635 252.286043 
L 208.635 267.220108 
" style="fill:none;stroke:#414141;stroke-linecap:round;stroke-width:1.5;"/>
   </g>
   <g id="line2d_12">
    <path clip-path="url(#p154b08486d)" d="M 208.635 229.064079 
L 208.635 202.439795 
" style="fill:none;stroke:#414141;stroke-linecap:round;stroke-width:1.5;"/>
   </g>
   <g id="line2d_13">
    <path clip-path="url(#p154b08486d)" d="M 180.981 267.220108 
L 236.289 267.220108 
" style="fill:none;stroke:#414141;stroke-linecap:round;stroke-width:1.5;"/>
   </g>
   <g id="line2d_14">
    <path clip-path="url(#p154b08486d)" d="M 180.981 202.439795 
L 236.289 202.439795 
" style="fill:none;stroke:#414141;stroke-linecap:round;stroke-width:1.5;"/>
   </g>
   <g id="line2d_15">
    <path clip-path="url(#p154b08486d)" d="M 346.905 235.717112 
L 346.905 248.149111 
" style="fill:none;stroke:#414141;stroke-linecap:round;stroke-width:1.5;"/>
   </g>
   <g id="line2d_16">
    <path clip-path="url(#p154b08486d)" d="M 346.905 227.119841 
L 346.905 216.334857 
" style="fill:none;stroke:#414141;stroke-linecap:round;stroke-width:1.5;"/>
   </g>
   <g id="line2d_17">
    <path clip-path="url(#p154b08486d)" d="M 319.251 248.149111 
L 374.559 248.149111 
" style="fill:none;stroke:#414141;stroke-linecap:round;stroke-width:1.5;"/>
   </g>
   <g id="line2d_18">
    <path clip-path="url(#p154b08486d)" d="M 319.251 216.334857 
L 374.559 216.334857 
" style="fill:none;stroke:#414141;stroke-linecap:round;stroke-width:1.5;"/>
   </g>
   <g id="line2d_19">
    <path clip-path="url(#p154b08486d)" d="M 485.175 232.46096 
L 485.175 232.46096 
" style="fill:none;stroke:#414141;stroke-linecap:round;stroke-width:1.5;"/>
   </g>
   <g id="line2d_20">
    <path clip-path="url(#p154b08486d)" d="M 485.175 222.57582 
L 485.175 211.321161 
" style="fill:none;stroke:#414141;stroke-linecap:round;stroke-width:1.5;"/>
   </g>
   <g id="line2d_21">
    <path clip-path="url(#p154b08486d)" d="M 457.521 232.46096 
L 512.829 232.46096 
" style="fill:none;stroke:#414141;stroke-linecap:round;stroke-width:1.5;"/>
   </g>
   <g id="line2d_22">
    <path clip-path="url(#p154b08486d)" d="M 457.521 211.321161 
L 512.829 211.321161 
" style="fill:none;stroke:#414141;stroke-linecap:round;stroke-width:1.5;"/>
   </g>
   <g id="line2d_23">
    <path clip-path="url(#p154b08486d)" d="M 623.445 230.227354 
L 623.445 272.600861 
" style="fill:none;stroke:#414141;stroke-linecap:round;stroke-width:1.5;"/>
   </g>
   <g id="line2d_24">
    <path clip-path="url(#p154b08486d)" d="M 623.445 192.585172 
L 623.445 188.180167 
" style="fill:none;stroke:#414141;stroke-linecap:round;stroke-width:1.5;"/>
   </g>
   <g id="line2d_25">
    <path clip-path="url(#p154b08486d)" d="M 595.791 272.600861 
L 651.099 272.600861 
" style="fill:none;stroke:#414141;stroke-linecap:round;stroke-width:1.5;"/>
   </g>
   <g id="line2d_26">
    <path clip-path="url(#p154b08486d)" d="M 595.791 188.180167 
L 651.099 188.180167 
" style="fill:none;stroke:#414141;stroke-linecap:round;stroke-width:1.5;"/>
   </g>
   <g id="line2d_27">
    <path clip-path="url(#p154b08486d)" d="M 761.715 258.20045 
L 761.715 263.493199 
" style="fill:none;stroke:#414141;stroke-linecap:round;stroke-width:1.5;"/>
   </g>
   <g id="line2d_28">
    <path clip-path="url(#p154b08486d)" d="M 761.715 217.481414 
L 761.715 178.704518 
" style="fill:none;stroke:#414141;stroke-linecap:round;stroke-width:1.5;"/>
   </g>
   <g id="line2d_29">
    <path clip-path="url(#p154b08486d)" d="M 734.061 263.493199 
L 789.369 263.493199 
" style="fill:none;stroke:#414141;stroke-linecap:round;stroke-width:1.5;"/>
   </g>
   <g id="line2d_30">
    <path clip-path="url(#p154b08486d)" d="M 734.061 178.704518 
L 789.369 178.704518 
" style="fill:none;stroke:#414141;stroke-linecap:round;stroke-width:1.5;"/>
   </g>
   <g id="line2d_31">
    <path clip-path="url(#p154b08486d)" d="M 899.985 242.951314 
L 899.985 249.457852 
" style="fill:none;stroke:#414141;stroke-linecap:round;stroke-width:1.5;"/>
   </g>
   <g id="line2d_32">
    <path clip-path="url(#p154b08486d)" d="M 899.985 224.402536 
L 899.985 222.279596 
" style="fill:none;stroke:#414141;stroke-linecap:round;stroke-width:1.5;"/>
   </g>
   <g id="line2d_33">
    <path clip-path="url(#p154b08486d)" d="M 872.331 249.457852 
L 927.639 249.457852 
" style="fill:none;stroke:#414141;stroke-linecap:round;stroke-width:1.5;"/>
   </g>
   <g id="line2d_34">
    <path clip-path="url(#p154b08486d)" d="M 872.331 222.279596 
L 927.639 222.279596 
" style="fill:none;stroke:#414141;stroke-linecap:round;stroke-width:1.5;"/>
   </g>
   <g id="line2d_35">
    <path clip-path="url(#p154b08486d)" d="M 139.5 242.804111 
L 969.12 242.804111 
" style="fill:none;stroke:#ff0000;stroke-dasharray:14.8,6.4;stroke-dashoffset:0;stroke-width:4;"/>
   </g>
   <g id="line2d_36">
    <path clip-path="url(#p154b08486d)" d="M 153.327 242.804111 
L 263.943 242.804111 
" style="fill:none;stroke:#414141;stroke-linecap:round;stroke-width:1.5;"/>
   </g>
   <g id="line2d_37">
    <path clip-path="url(#p154b08486d)" d="M 291.597 233.708882 
L 402.213 233.708882 
" style="fill:none;stroke:#414141;stroke-linecap:round;stroke-width:1.5;"/>
   </g>
   <g id="line2d_38">
    <path clip-path="url(#p154b08486d)" d="M 429.867 228.011853 
L 540.483 228.011853 
" style="fill:none;stroke:#414141;stroke-linecap:round;stroke-width:1.5;"/>
   </g>
   <g id="line2d_39">
    <path clip-path="url(#p154b08486d)" d="M 568.137 215.755806 
L 678.753 215.755806 
" style="fill:none;stroke:#414141;stroke-linecap:round;stroke-width:1.5;"/>
   </g>
   <g id="line2d_40">
    <path clip-path="url(#p154b08486d)" d="M 706.407 250.418923 
L 817.023 250.418923 
" style="fill:none;stroke:#414141;stroke-linecap:round;stroke-width:1.5;"/>
   </g>
   <g id="line2d_41">
    <path clip-path="url(#p154b08486d)" d="M 844.677 230.81221 
L 955.293 230.81221 
" style="fill:none;stroke:#414141;stroke-linecap:round;stroke-width:1.5;"/>
   </g>
   <g id="patch_9">
    <path d="M 139.5 306.061628 
L 139.5 38.88 
" style="fill:none;stroke:#262626;stroke-linecap:square;stroke-linejoin:miter;stroke-width:1.25;"/>
   </g>
   <g id="patch_10">
    <path d="M 139.5 306.061628 
L 969.12 306.061628 
" style="fill:none;stroke:#262626;stroke-linecap:square;stroke-linejoin:miter;stroke-width:1.25;"/>
   </g>
   <g id="PathCollection_1">
    <defs>
     <path d="M 0 2.5 
C 0.663008 2.5 1.29895 2.236584 1.767767 1.767767 
C 2.236584 1.29895 2.5 0.663008 2.5 -0 
C 2.5 -0.663008 2.236584 -1.29895 1.767767 -1.767767 
C 1.29895 -2.236584 0.663008 -2.5 0 -2.5 
C -0.663008 -2.5 -1.29895 -2.236584 -1.767767 -1.767767 
C -2.236584 -1.29895 -2.5 -0.663008 -2.5 0 
C -2.5 0.663008 -2.236584 1.29895 -1.767767 1.767767 
C -1.29895 2.236584 -0.663008 2.5 0 2.5 
z
" id="C0_0_a30c0d27fd"/>
    </defs>
    <g clip-path="url(#p154b08486d)">
     <use style="fill:#959595;stroke:#000000;" x="216.454701" xlink:href="#C0_0_a30c0d27fd" y="215.935536"/>
    </g>
    <g clip-path="url(#p154b08486d)">
     <use style="fill:#959595;stroke:#000000;" x="197.92412" xlink:href="#C0_0_a30c0d27fd" y="267.220108"/>
    </g>
    <g clip-path="url(#p154b08486d)">
     <use style="fill:#959595;stroke:#000000;" x="207.813039" xlink:href="#C0_0_a30c0d27fd" y="237.13226"/>
    </g>
    <g clip-path="url(#p154b08486d)">
     <use style="fill:#959595;stroke:#000000;" x="220.912389" xlink:href="#C0_0_a30c0d27fd" y="182.298893"/>
    </g>
    <g clip-path="url(#p154b08486d)">
     <use style="fill:#959595;stroke:#000000;" x="199.965351" xlink:href="#C0_0_a30c0d27fd" y="240.94445"/>
    </g>
    <g clip-path="url(#p154b08486d)">
     <use style="fill:#959595;stroke:#000000;" x="207.208099" xlink:href="#C0_0_a30c0d27fd" y="226.130292"/>
    </g>
    <g clip-path="url(#p154b08486d)">
     <use style="fill:#959595;stroke:#000000;" x="210.199052" xlink:href="#C0_0_a30c0d27fd" y="236.92618"/>
    </g>
    <g clip-path="url(#p154b08486d)">
     <use style="fill:#959595;stroke:#000000;" x="215.543153" xlink:href="#C0_0_a30c0d27fd" y="238.280895"/>
    </g>
    <g clip-path="url(#p154b08486d)">
     <use style="fill:#959595;stroke:#000000;" x="214.30019" xlink:href="#C0_0_a30c0d27fd" y="243.571645"/>
    </g>
    <g clip-path="url(#p154b08486d)">
     <use style="fill:#959595;stroke:#000000;" x="212.110055" xlink:href="#C0_0_a30c0d27fd" y="256.562049"/>
    </g>
    <g clip-path="url(#p154b08486d)">
     <use style="fill:#959595;stroke:#000000;" x="218.287654" xlink:href="#C0_0_a30c0d27fd" y="229.064079"/>
    </g>
    <g clip-path="url(#p154b08486d)">
     <use style="fill:#959595;stroke:#000000;" x="222.013455" xlink:href="#C0_0_a30c0d27fd" y="238.69272"/>
    </g>
    <g clip-path="url(#p154b08486d)">
     <use style="fill:#959595;stroke:#000000;" x="201.038693" xlink:href="#C0_0_a30c0d27fd" y="242.804111"/>
    </g>
    <g clip-path="url(#p154b08486d)">
     <use style="fill:#959595;stroke:#000000;" x="210.363377" xlink:href="#C0_0_a30c0d27fd" y="256.709598"/>
    </g>
    <g clip-path="url(#p154b08486d)">
     <use style="fill:#959595;stroke:#000000;" x="201.203223" xlink:href="#C0_0_a30c0d27fd" y="254.444523"/>
    </g>
    <g clip-path="url(#p154b08486d)">
     <use style="fill:#959595;stroke:#000000;" x="220.564733" xlink:href="#C0_0_a30c0d27fd" y="250.45579"/>
    </g>
    <g clip-path="url(#p154b08486d)">
     <use style="fill:#959595;stroke:#000000;" x="207.989657" xlink:href="#C0_0_a30c0d27fd" y="255.435199"/>
    </g>
    <g clip-path="url(#p154b08486d)">
     <use style="fill:#959595;stroke:#000000;" x="198.851101" xlink:href="#C0_0_a30c0d27fd" y="257.564819"/>
    </g>
    <g clip-path="url(#p154b08486d)">
     <use style="fill:#959595;stroke:#000000;" x="212.9879" xlink:href="#C0_0_a30c0d27fd" y="202.439795"/>
    </g>
    <g clip-path="url(#p154b08486d)">
     <use style="fill:#959595;stroke:#000000;" x="201.112824" xlink:href="#C0_0_a30c0d27fd" y="244.67657"/>
    </g>
    <g clip-path="url(#p154b08486d)">
     <use style="fill:#959595;stroke:#000000;" x="218.220682" xlink:href="#C0_0_a30c0d27fd" y="249.002472"/>
    </g>
    <g clip-path="url(#p154b08486d)">
     <use style="fill:#959595;stroke:#000000;" x="212.199495" xlink:href="#C0_0_a30c0d27fd" y="249.304188"/>
    </g>
    <g clip-path="url(#p154b08486d)">
     <use style="fill:#959595;stroke:#000000;" x="207.258633" xlink:href="#C0_0_a30c0d27fd" y="231.465696"/>
    </g>
    <g clip-path="url(#p154b08486d)">
     <use style="fill:#959595;stroke:#000000;" x="221.944051" xlink:href="#C0_0_a30c0d27fd" y="252.286043"/>
    </g>
    <g clip-path="url(#p154b08486d)">
     <use style="fill:#959595;stroke:#000000;" x="204.445752" xlink:href="#C0_0_a30c0d27fd" y="213.19669"/>
    </g>
    <g clip-path="url(#p154b08486d)">
     <use style="fill:#959595;stroke:#000000;" x="200.775761" xlink:href="#C0_0_a30c0d27fd" y="223.031877"/>
    </g>
    <g clip-path="url(#p154b08486d)">
     <use style="fill:#959595;stroke:#000000;" x="204.625999" xlink:href="#C0_0_a30c0d27fd" y="173.503167"/>
    </g>
    <g clip-path="url(#p154b08486d)">
     <use style="fill:#959595;stroke:#000000;" x="197.658112" xlink:href="#C0_0_a30c0d27fd" y="248.928048"/>
    </g>
    <g clip-path="url(#p154b08486d)">
     <use style="fill:#959595;stroke:#000000;" x="202.537916" xlink:href="#C0_0_a30c0d27fd" y="261.486777"/>
    </g>
   </g>
   <g id="PathCollection_2">
    <defs>
     <path d="M 0 2.5 
C 0.663008 2.5 1.29895 2.236584 1.767767 1.767767 
C 2.236584 1.29895 2.5 0.663008 2.5 -0 
C 2.5 -0.663008 2.236584 -1.29895 1.767767 -1.767767 
C 1.29895 -2.236584 0.663008 -2.5 0 -2.5 
C -0.663008 -2.5 -1.29895 -2.236584 -1.767767 -1.767767 
C -2.236584 -1.29895 -2.5 -0.663008 -2.5 0 
C -2.5 0.663008 -2.236584 1.29895 -1.767767 1.767767 
C -1.29895 2.236584 -0.663008 2.5 0 2.5 
z
" id="C1_0_3a39f58782"/>
    </defs>
    <g clip-path="url(#p154b08486d)">
     <use style="fill:#fcbba1;stroke:#000000;" x="339.157477" xlink:href="#C1_0_3a39f58782" y="233.708882"/>
    </g>
    <g clip-path="url(#p154b08486d)">
     <use style="fill:#fcbba1;stroke:#000000;" x="346.395073" xlink:href="#C1_0_3a39f58782" y="227.119841"/>
    </g>
    <g clip-path="url(#p154b08486d)">
     <use style="fill:#fcbba1;stroke:#000000;" x="340.85731" xlink:href="#C1_0_3a39f58782" y="235.717112"/>
    </g>
    <g clip-path="url(#p154b08486d)">
     <use style="fill:#fcbba1;stroke:#000000;" x="356.889457" xlink:href="#C1_0_3a39f58782" y="248.149111"/>
    </g>
    <g clip-path="url(#p154b08486d)">
     <use style="fill:#fcbba1;stroke:#000000;" x="357.545358" xlink:href="#C1_0_3a39f58782" y="216.334857"/>
    </g>
   </g>
   <g id="PathCollection_3">
    <defs>
     <path d="M 0 2.5 
C 0.663008 2.5 1.29895 2.236584 1.767767 1.767767 
C 2.236584 1.29895 2.5 0.663008 2.5 -0 
C 2.5 -0.663008 2.236584 -1.29895 1.767767 -1.767767 
C 1.29895 -2.236584 0.663008 -2.5 0 -2.5 
C -0.663008 -2.5 -1.29895 -2.236584 -1.767767 -1.767767 
C -2.236584 -1.29895 -2.5 -0.663008 -2.5 0 
C -2.5 0.663008 -2.236584 1.29895 -1.767767 1.767767 
C -1.29895 2.236584 -0.663008 2.5 0 2.5 
z
" id="C2_0_9da3fae54a"/>
    </defs>
    <g clip-path="url(#p154b08486d)">
     <use style="fill:#fb694a;stroke:#000000;" x="482.968233" xlink:href="#C2_0_9da3fae54a" y="232.46096"/>
    </g>
    <g clip-path="url(#p154b08486d)">
     <use style="fill:#fb694a;stroke:#000000;" x="487.100432" xlink:href="#C2_0_9da3fae54a" y="228.578844"/>
    </g>
    <g clip-path="url(#p154b08486d)">
     <use style="fill:#fb694a;stroke:#000000;" x="493.183015" xlink:href="#C2_0_9da3fae54a" y="222.57582"/>
    </g>
    <g clip-path="url(#p154b08486d)">
     <use style="fill:#fb694a;stroke:#000000;" x="483.341174" xlink:href="#C2_0_9da3fae54a" y="228.011853"/>
    </g>
    <g clip-path="url(#p154b08486d)">
     <use style="fill:#fb694a;stroke:#000000;" x="482.317743" xlink:href="#C2_0_9da3fae54a" y="211.321161"/>
    </g>
    <g clip-path="url(#p154b08486d)">
     <use style="fill:#fb694a;stroke:#000000;" x="491.834603" xlink:href="#C2_0_9da3fae54a" y="225.386668"/>
    </g>
    <g clip-path="url(#p154b08486d)">
     <use style="fill:#fb694a;stroke:#000000;" x="478.300983" xlink:href="#C2_0_9da3fae54a" y="179.227298"/>
    </g>
    <g clip-path="url(#p154b08486d)">
     <use style="fill:#fb694a;stroke:#000000;" x="475.128301" xlink:href="#C2_0_9da3fae54a" y="253.130056"/>
    </g>
    <g clip-path="url(#p154b08486d)">
     <use style="fill:#fb694a;stroke:#000000;" x="494.958812" xlink:href="#C2_0_9da3fae54a" y="255.934528"/>
    </g>
   </g>
   <g id="PathCollection_4">
    <defs>
     <path d="M 0 2.5 
C 0.663008 2.5 1.29895 2.236584 1.767767 1.767767 
C 2.236584 1.29895 2.5 0.663008 2.5 -0 
C 2.5 -0.663008 2.236584 -1.29895 1.767767 -1.767767 
C 1.29895 -2.236584 0.663008 -2.5 0 -2.5 
C -0.663008 -2.5 -1.29895 -2.236584 -1.767767 -1.767767 
C -2.236584 -1.29895 -2.5 -0.663008 -2.5 0 
C -2.5 0.663008 -2.236584 1.29895 -1.767767 1.767767 
C -1.29895 2.236584 -0.663008 2.5 0 2.5 
z
" id="C3_0_614d4da4ea"/>
    </defs>
    <g clip-path="url(#p154b08486d)">
     <use style="fill:#ca181d;stroke:#000000;" x="626.224067" xlink:href="#C3_0_614d4da4ea" y="188.34812"/>
    </g>
    <g clip-path="url(#p154b08486d)">
     <use style="fill:#ca181d;stroke:#000000;" x="619.615414" xlink:href="#C3_0_614d4da4ea" y="231.563903"/>
    </g>
    <g clip-path="url(#p154b08486d)">
     <use style="fill:#ca181d;stroke:#000000;" x="616.199769" xlink:href="#C3_0_614d4da4ea" y="226.217708"/>
    </g>
    <g clip-path="url(#p154b08486d)">
     <use style="fill:#ca181d;stroke:#000000;" x="618.056222" xlink:href="#C3_0_614d4da4ea" y="188.180167"/>
    </g>
    <g clip-path="url(#p154b08486d)">
     <use style="fill:#ca181d;stroke:#000000;" x="610.407435" xlink:href="#C3_0_614d4da4ea" y="237.743947"/>
    </g>
    <g clip-path="url(#p154b08486d)">
     <use style="fill:#ca181d;stroke:#000000;" x="630.717021" xlink:href="#C3_0_614d4da4ea" y="117.713955"/>
    </g>
    <g clip-path="url(#p154b08486d)">
     <use style="fill:#ca181d;stroke:#000000;" x="612.615784" xlink:href="#C3_0_614d4da4ea" y="212.431458"/>
    </g>
    <g clip-path="url(#p154b08486d)">
     <use style="fill:#ca181d;stroke:#000000;" x="634.903954" xlink:href="#C3_0_614d4da4ea" y="272.600861"/>
    </g>
    <g clip-path="url(#p154b08486d)">
     <use style="fill:#ca181d;stroke:#000000;" x="627.243848" xlink:href="#C3_0_614d4da4ea" y="205.296328"/>
    </g>
    <g clip-path="url(#p154b08486d)">
     <use style="fill:#ca181d;stroke:#000000;" x="629.439561" xlink:href="#C3_0_614d4da4ea" y="219.080154"/>
    </g>
   </g>
   <g id="PathCollection_5">
    <defs>
     <path d="M 0 2.5 
C 0.663008 2.5 1.29895 2.236584 1.767767 1.767767 
C 2.236584 1.29895 2.5 0.663008 2.5 -0 
C 2.5 -0.663008 2.236584 -1.29895 1.767767 -1.767767 
C 1.29895 -2.236584 0.663008 -2.5 0 -2.5 
C -0.663008 -2.5 -1.29895 -2.236584 -1.767767 -1.767767 
C -2.236584 -1.29895 -2.5 -0.663008 -2.5 0 
C -2.5 0.663008 -2.236584 1.29895 -1.767767 1.767767 
C -1.29895 2.236584 -0.663008 2.5 0 2.5 
z
" id="C4_0_18a80005f2"/>
    </defs>
    <g clip-path="url(#p154b08486d)">
     <use style="fill:#aedea7;stroke:#000000;" x="762.919554" xlink:href="#C4_0_18a80005f2" y="178.704518"/>
    </g>
    <g clip-path="url(#p154b08486d)">
     <use style="fill:#aedea7;stroke:#000000;" x="761.338076" xlink:href="#C4_0_18a80005f2" y="207.204913"/>
    </g>
    <g clip-path="url(#p154b08486d)">
     <use style="fill:#aedea7;stroke:#000000;" x="748.734417" xlink:href="#C4_0_18a80005f2" y="255.504879"/>
    </g>
    <g clip-path="url(#p154b08486d)">
     <use style="fill:#aedea7;stroke:#000000;" x="759.07584" xlink:href="#C4_0_18a80005f2" y="261.650972"/>
    </g>
    <g clip-path="url(#p154b08486d)">
     <use style="fill:#aedea7;stroke:#000000;" x="769.959452" xlink:href="#C4_0_18a80005f2" y="263.493199"/>
    </g>
    <g clip-path="url(#p154b08486d)">
     <use style="fill:#aedea7;stroke:#000000;" x="762.609213" xlink:href="#C4_0_18a80005f2" y="257.050276"/>
    </g>
    <g clip-path="url(#p154b08486d)">
     <use style="fill:#aedea7;stroke:#000000;" x="756.777439" xlink:href="#C4_0_18a80005f2" y="220.906914"/>
    </g>
    <g clip-path="url(#p154b08486d)">
     <use style="fill:#aedea7;stroke:#000000;" x="759.165189" xlink:href="#C4_0_18a80005f2" y="245.332968"/>
    </g>
   </g>
   <g id="PathCollection_6">
    <defs>
     <path d="M 0 2.5 
C 0.663008 2.5 1.29895 2.236584 1.767767 1.767767 
C 2.236584 1.29895 2.5 0.663008 2.5 -0 
C 2.5 -0.663008 2.236584 -1.29895 1.767767 -1.767767 
C 1.29895 -2.236584 0.663008 -2.5 0 -2.5 
C -0.663008 -2.5 -1.29895 -2.236584 -1.767767 -1.767767 
C -2.236584 -1.29895 -2.5 -0.663008 -2.5 0 
C -2.5 0.663008 -2.236584 1.29895 -1.767767 1.767767 
C -1.29895 2.236584 -0.663008 2.5 0 2.5 
z
" id="C5_0_fa441e619f"/>
    </defs>
    <g clip-path="url(#p154b08486d)">
     <use style="fill:#37a055;stroke:#000000;" x="912.395965" xlink:href="#C5_0_fa441e619f" y="249.457852"/>
    </g>
    <g clip-path="url(#p154b08486d)">
     <use style="fill:#37a055;stroke:#000000;" x="886.815938" xlink:href="#C5_0_fa441e619f" y="222.279596"/>
    </g>
    <g clip-path="url(#p154b08486d)">
     <use style="fill:#37a055;stroke:#000000;" x="907.691233" xlink:href="#C5_0_fa441e619f" y="235.501837"/>
    </g>
    <g clip-path="url(#p154b08486d)">
     <use style="fill:#37a055;stroke:#000000;" x="912.157276" xlink:href="#C5_0_fa441e619f" y="226.122582"/>
    </g>
    <g clip-path="url(#p154b08486d)">
     <use style="fill:#37a055;stroke:#000000;" x="911.49376" xlink:href="#C5_0_fa441e619f" y="273.752465"/>
    </g>
    <g clip-path="url(#p154b08486d)">
     <use style="fill:#37a055;stroke:#000000;" x="908.523799" xlink:href="#C5_0_fa441e619f" y="225.110183"/>
    </g>
    <g clip-path="url(#p154b08486d)">
     <use style="fill:#37a055;stroke:#000000;" x="887.800545" xlink:href="#C5_0_fa441e619f" y="186.734843"/>
    </g>
    <g clip-path="url(#p154b08486d)">
     <use style="fill:#37a055;stroke:#000000;" x="908.828752" xlink:href="#C5_0_fa441e619f" y="240.782468"/>
    </g>
   </g>
  </g>
 </g>
 <defs>
  <clipPath id="p154b08486d">
   <rect height="267.181628" width="829.62" x="139.5" y="38.88"/>
  </clipPath>
 </defs>
</svg>
