{
  "interface": "https://schema.skao.int/ska-tmc-configure/2.2",
  "transaction_id": "txn-....-00002",
  "pointing": {
    "target": {
      "reference_frame" : "ICRS",
      "ca_offset_arcsec": 0.0,
      "ie_offset_arcsec": 5.0
    }
  },
  "tmc": {
    "partial_configuration": true
  }
}
