{
    "interface": "https://schema.skao.int/ska-low-tmc-configure/4.0",
    "transaction_id": "txn-....-00001",
    "mccs": {
      "subarray_beams": [
        {
          "subarray_beam_id": 1,
          "update_rate": 0.0,
          "logical_bands": [
            {
              "start_channel": 80,
              "number_of_channels": 16
            },
            {
              "start_channel": 384,
              "number_of_channels": 16
            }
            
          ],
          "apertures": [
            {
              "aperture_id": "AP001.01",
              "weighting_key_ref": "aperture2"
              
            },
            {
              "aperture_id": "AP001.02",
              "weighting_key_ref": "aperture3"
              
            },
            {
              "aperture_id": "AP002.01",
              "weighting_key_ref": "aperture2"
              
            },
            {
              "aperture_id": "AP002.02",
              "weighting_key_ref": "aperture3"
              
            },
            {
              "aperture_id": "AP003.01",
              "weighting_key_ref": "aperture1"
              
            }
            
          ],
          "sky_coordinates": {
            "reference_frame": "ICRS",
            "c1": 180.0,
            "c2": 45.0
            
          }
          
        }
      ]
      
    },
    "sdp": {
      "interface": "https://schema.skao.int/ska-sdp-configure/0.4",
      "scan_type": "target:a"
      
    },
    "csp": {
      "interface": "https://schema.skao.int/ska-low-csp-configure/3.2",
      "common": {
        "config_id": "sbi-mvp01-20200325-00001-science_A",
        "eb_id": "eb-test-20220916-00000"
        
      },
      "lowcbf": {
        "stations": {
          "stns": [
            [
              1,
              1
            ],
            [
              2,
              1
            ],
            [
              3,
              1
            ],
            [
              4,
              1
            ],
            [
              5,
              1
            ],
            [
              6,
              1
            ]
          ],
          "stn_beams": [
            {
              "beam_id": 1,
              "freq_ids": [
                400
              ]
            }
          ]
          
        },
        "vis": {
          "fsp": {
            "firmware": "vis",
            "fsp_ids": [
              1
            ]
          },
          "stn_beams": [
            {
              "stn_beam_id": 1,
              "integration_ms": 849
              
            }
        ]
        
      }
    },
      "pst": {
        "beams": [
          {
            "beam_id": 1,
            "scan": {
              "activation_time": "2022-01-19T23:07:45Z",
              "bits_per_sample": 32,
              "num_of_polarizations": 2,
              "udp_nsamp": 32,
              "wt_nsamp": 32,
              "udp_nchan": 24,
              "num_frequency_channels": 432,
              "centre_frequency": 200000000.0,
              "total_bandwidth": 1562500.0,
              "observation_mode": "VOLTAGE_RECORDER",
              "observer_id": "jdoe",
              "project_id": "project1",
              "pointing_id": "pointing1",
              "source": "J1921+2153",
              "itrf": [
                5109360.133,
                2006852.586,
                -3238948.127
              ],
              "receiver_id": "receiver3",
              "feed_polarization": "LIN",
              "feed_handedness": 1,
              "feed_angle": 1.234,
              "feed_tracking_mode": "FA",
              "feed_position_angle": 10.0,
              "oversampling_ratio": [
                8,
                7
              ],
              "coordinates": {
                "equinox": 2000.0,
                "ra": "19:21:44.815",
                "dec": "21:53:02.400"
                
              },
              "max_scan_length": 20000.0,
              "subint_duration": 30.0,
              "receptors": [
                "receptor1",
                "receptor2"
              ],
              "receptor_weights": [
                0.4,
                0.6
              ],
              "num_channelization_stages": 2,
              "channelization_stages": [
                {
                  "num_filter_taps": 1,
                  "filter_coefficients": [
                    1.0
                  ],
                  "num_frequency_channels": 1024,
                  "oversampling_ratio": [
                    32,
                    27
                  ]
                  
                },
                {
                  "num_filter_taps": 1,
                  "filter_coefficients": [
                    1.0
                  ],
                  "num_frequency_channels": 256,
                  "oversampling_ratio": [
                    4,
                    3
                  ]
                  
                }
                
              ]
              
            }
            
          }
          
        ]
        
      }
      
    },
    "tmc": {
      "scan_duration": 10.0
    }
  }