AssignResources,EMPTY,EMPTY,NONE,NONE,STANDBY_FP,STANDBY_FP,OK,OK,EMPTY
AssignResources,EMPTY,EMPTY,NONE,NONE,STANDBY_FP,STANDBY_FP,OK,FAILED,EMPTY
AssignResources,EMPTY,EMPTY,NONE,NONE,STANDBY_FP,STANDBY_FP,OK,UNKNOWN,EMPTY
AssignResources,EMPTY,IDLE,NONE,NONE,STANDBY_FP,STANDBY_FP,OK,OK,RESOURCING
AssignResources,EMPTY,IDLE,NONE,NONE,STANDBY_FP,STANDBY_FP,OK,FAILED,RESOURCING
AssignResources,EMPTY,IDLE,NONE,NONE,STANDBY_FP,STANDBY_FP,OK,UNKNOWN,RESOURCING
AssignResources,RESOURCING,EMPTY,NONE,NONE,STANDBY_FP,STANDBY_FP,OK,OK,RESOURCING
AssignResources,RESOURCING,IDLE,NONE,NONE,STANDBY_FP,STANDBY_FP,OK,OK,RESOURCING
AssignResources,IDLE,EMPTY,NONE,NONE,STANDBY_FP,STANDBY_FP,OK,OK,RESOURCING
AssignResources,IDLE,EMPTY,NONE,NONE,STANDBY_FP,STANDBY_FP,OK,FAILED,RESOURCING
AssignResources,IDLE,EMPTY,NONE,NONE,STANDBY_FP,STANDBY_FP,OK,UNKNOWN,RESOURCING
AssignResources,IDLE,IDLE,NONE,NONE,STANDBY_FP,STANDBY_FP,OK,OK,IDLE
AssignResources,IDLE,IDLE,NONE,NONE,STANDBY_FP,STANDBY_FP,OK,FAILED,RESOURCING
AssignResources,IDLE,IDLE,NONE,NONE,STANDBY_FP,STANDBY_FP,OK,UNKNOWN,RESOURCING
AssignResources,IDLE,IDLE,READY,READY,CONFIG,CONFIG,OK,OK,IDLE
AssignResources,IDLE,IDLE,READY,READY,CONFIG,CONFIG,OK,FAILED,RESOURCING
AssignResources,IDLE,IDLE,READY,READY,CONFIG,CONFIG,OK,UNKNOWN,RESOURCING
AssignResources,IDLE,IDLE,READY,READY,CONFIG,OPERATE,OK,OK,IDLE
AssignResources,IDLE,IDLE,READY,READY,CONFIG,OPERATE,OK,FAILED,RESOURCING
AssignResources,IDLE,IDLE,READY,READY,CONFIG,OPERATE,OK,UNKNOWN,RESOURCING
AssignResources,IDLE,IDLE,READY,READY,OPERATE,CONFIG,OK,OK,IDLE
AssignResources,IDLE,IDLE,READY,READY,OPERATE,CONFIG,OK,FAILED,RESOURCING
AssignResources,IDLE,IDLE,READY,READY,OPERATE,CONFIG,OK,UNKNOWN,RESOURCING
AssignResources,IDLE,IDLE,READY,READY,OPERATE,OPERATE,OK,OK,IDLE
AssignResources,IDLE,IDLE,READY,READY,OPERATE,OPERATE,OK,FAILED,RESOURCING
AssignResources,IDLE,IDLE,READY,READY,OPERATE,OPERATE,OK,UNKNOWN,RESOURCING
AssignResources,IDLE,IDLE,READY,TRACK,CONFIG,CONFIG,OK,OK,IDLE
AssignResources,IDLE,IDLE,READY,TRACK,CONFIG,CONFIG,OK,FAILED,RESOURCING
AssignResources,IDLE,IDLE,READY,TRACK,CONFIG,CONFIG,OK,UNKNOWN,RESOURCING
AssignResources,IDLE,IDLE,READY,TRACK,CONFIG,OPERATE,OK,OK,IDLE
AssignResources,IDLE,IDLE,READY,TRACK,CONFIG,OPERATE,OK,FAILED,RESOURCING
AssignResources,IDLE,IDLE,READY,TRACK,CONFIG,OPERATE,OK,UNKNOWN,RESOURCING
AssignResources,IDLE,IDLE,READY,TRACK,OPERATE,CONFIG,OK,OK,IDLE
AssignResources,IDLE,IDLE,READY,TRACK,OPERATE,CONFIG,OK,FAILED,RESOURCING
AssignResources,IDLE,IDLE,READY,TRACK,OPERATE,CONFIG,OK,UNKNOWN,RESOURCING
AssignResources,IDLE,IDLE,READY,TRACK,OPERATE,OPERATE,OK,OK,IDLE
AssignResources,IDLE,IDLE,READY,TRACK,OPERATE,OPERATE,OK,FAILED,RESOURCING
AssignResources,IDLE,IDLE,READY,TRACK,OPERATE,OPERATE,OK,UNKNOWN,RESOURCING
AssignResources,IDLE,IDLE,READY,SLEW,CONFIG,CONFIG,OK,OK,IDLE
AssignResources,IDLE,IDLE,READY,SLEW,CONFIG,CONFIG,OK,FAILED,RESOURCING
AssignResources,IDLE,IDLE,READY,SLEW,CONFIG,CONFIG,OK,UNKNOWN,RESOURCING
AssignResources,IDLE,IDLE,READY,SLEW,CONFIG,OPERATE,OK,OK,IDLE
AssignResources,IDLE,IDLE,READY,SLEW,CONFIG,OPERATE,OK,FAILED,RESOURCING
AssignResources,IDLE,IDLE,READY,SLEW,CONFIG,OPERATE,OK,UNKNOWN,RESOURCING
AssignResources,IDLE,IDLE,READY,SLEW,OPERATE,CONFIG,OK,OK,IDLE
AssignResources,IDLE,IDLE,READY,SLEW,OPERATE,CONFIG,OK,FAILED,RESOURCING
AssignResources,IDLE,IDLE,READY,SLEW,OPERATE,CONFIG,OK,UNKNOWN,RESOURCING
AssignResources,IDLE,IDLE,READY,SLEW,OPERATE,OPERATE,OK,OK,IDLE
AssignResources,IDLE,IDLE,READY,SLEW,OPERATE,OPERATE,OK,FAILED,RESOURCING
AssignResources,IDLE,IDLE,READY,SLEW,OPERATE,OPERATE,OK,UNKNOWN,RESOURCING
AssignResources,IDLE,IDLE,TRACK,READY,CONFIG,CONFIG,OK,OK,IDLE
AssignResources,IDLE,IDLE,TRACK,READY,CONFIG,CONFIG,OK,FAILED,RESOURCING
AssignResources,IDLE,IDLE,TRACK,READY,CONFIG,CONFIG,OK,UNKNOWN,RESOURCING
AssignResources,IDLE,IDLE,TRACK,READY,CONFIG,OPERATE,OK,OK,IDLE
AssignResources,IDLE,IDLE,TRACK,READY,CONFIG,OPERATE,OK,FAILED,RESOURCING
AssignResources,IDLE,IDLE,TRACK,READY,CONFIG,OPERATE,OK,UNKNOWN,RESOURCING
AssignResources,IDLE,IDLE,TRACK,READY,OPERATE,CONFIG,OK,OK,IDLE
AssignResources,IDLE,IDLE,TRACK,READY,OPERATE,CONFIG,OK,FAILED,RESOURCING
AssignResources,IDLE,IDLE,TRACK,READY,OPERATE,CONFIG,OK,UNKNOWN,RESOURCING
AssignResources,IDLE,IDLE,TRACK,READY,OPERATE,OPERATE,OK,OK,IDLE
AssignResources,IDLE,IDLE,TRACK,READY,OPERATE,OPERATE,OK,FAILED,RESOURCING
AssignResources,IDLE,IDLE,TRACK,READY,OPERATE,OPERATE,OK,UNKNOWN,RESOURCING
AssignResources,IDLE,IDLE,TRACK,TRACK,CONFIG,CONFIG,OK,OK,IDLE
AssignResources,IDLE,IDLE,TRACK,TRACK,CONFIG,CONFIG,OK,FAILED,RESOURCING
AssignResources,IDLE,IDLE,TRACK,TRACK,CONFIG,CONFIG,OK,UNKNOWN,RESOURCING
AssignResources,IDLE,IDLE,TRACK,TRACK,CONFIG,OPERATE,OK,OK,IDLE
AssignResources,IDLE,IDLE,TRACK,TRACK,CONFIG,OPERATE,OK,FAILED,RESOURCING
AssignResources,IDLE,IDLE,TRACK,TRACK,CONFIG,OPERATE,OK,UNKNOWN,RESOURCING
AssignResources,IDLE,IDLE,TRACK,TRACK,OPERATE,CONFIG,OK,OK,IDLE
AssignResources,IDLE,IDLE,TRACK,TRACK,OPERATE,CONFIG,OK,FAILED,RESOURCING
AssignResources,IDLE,IDLE,TRACK,TRACK,OPERATE,CONFIG,OK,UNKNOWN,RESOURCING
AssignResources,IDLE,IDLE,TRACK,TRACK,OPERATE,OPERATE,OK,OK,IDLE
AssignResources,IDLE,IDLE,TRACK,TRACK,OPERATE,OPERATE,OK,FAILED,RESOURCING
AssignResources,IDLE,IDLE,TRACK,TRACK,OPERATE,OPERATE,OK,UNKNOWN,RESOURCING
AssignResources,IDLE,IDLE,TRACK,SLEW,CONFIG,CONFIG,OK,OK,IDLE
AssignResources,IDLE,IDLE,TRACK,SLEW,CONFIG,CONFIG,OK,FAILED,RESOURCING
AssignResources,IDLE,IDLE,TRACK,SLEW,CONFIG,CONFIG,OK,UNKNOWN,RESOURCING
AssignResources,IDLE,IDLE,TRACK,SLEW,CONFIG,OPERATE,OK,OK,IDLE
AssignResources,IDLE,IDLE,TRACK,SLEW,CONFIG,OPERATE,OK,FAILED,RESOURCING
AssignResources,IDLE,IDLE,TRACK,SLEW,CONFIG,OPERATE,OK,UNKNOWN,RESOURCING
AssignResources,IDLE,IDLE,TRACK,SLEW,OPERATE,CONFIG,OK,OK,IDLE
AssignResources,IDLE,IDLE,TRACK,SLEW,OPERATE,CONFIG,OK,FAILED,RESOURCING
AssignResources,IDLE,IDLE,TRACK,SLEW,OPERATE,CONFIG,OK,UNKNOWN,RESOURCING
AssignResources,IDLE,IDLE,TRACK,SLEW,OPERATE,OPERATE,OK,OK,IDLE
AssignResources,IDLE,IDLE,TRACK,SLEW,OPERATE,OPERATE,OK,FAILED,RESOURCING
AssignResources,IDLE,IDLE,TRACK,SLEW,OPERATE,OPERATE,OK,UNKNOWN,RESOURCING
AssignResources,IDLE,IDLE,SLEW,READY,CONFIG,CONFIG,OK,OK,IDLE
AssignResources,IDLE,IDLE,SLEW,READY,CONFIG,CONFIG,OK,FAILED,RESOURCING
AssignResources,IDLE,IDLE,SLEW,READY,CONFIG,CONFIG,OK,UNKNOWN,RESOURCING
AssignResources,IDLE,IDLE,SLEW,READY,CONFIG,OPERATE,OK,OK,IDLE
AssignResources,IDLE,IDLE,SLEW,READY,CONFIG,OPERATE,OK,FAILED,RESOURCING
AssignResources,IDLE,IDLE,SLEW,READY,CONFIG,OPERATE,OK,UNKNOWN,RESOURCING
AssignResources,IDLE,IDLE,SLEW,READY,OPERATE,CONFIG,OK,OK,IDLE
AssignResources,IDLE,IDLE,SLEW,READY,OPERATE,CONFIG,OK,FAILED,RESOURCING
AssignResources,IDLE,IDLE,SLEW,READY,OPERATE,CONFIG,OK,UNKNOWN,RESOURCING
AssignResources,IDLE,IDLE,SLEW,READY,OPERATE,OPERATE,OK,OK,IDLE
AssignResources,IDLE,IDLE,SLEW,READY,OPERATE,OPERATE,OK,FAILED,RESOURCING
AssignResources,IDLE,IDLE,SLEW,READY,OPERATE,OPERATE,OK,UNKNOWN,RESOURCING
AssignResources,IDLE,IDLE,SLEW,TRACK,CONFIG,CONFIG,OK,OK,IDLE
AssignResources,IDLE,IDLE,SLEW,TRACK,CONFIG,CONFIG,OK,FAILED,RESOURCING
AssignResources,IDLE,IDLE,SLEW,TRACK,CONFIG,CONFIG,OK,UNKNOWN,RESOURCING
AssignResources,IDLE,IDLE,SLEW,TRACK,CONFIG,OPERATE,OK,OK,IDLE
AssignResources,IDLE,IDLE,SLEW,TRACK,CONFIG,OPERATE,OK,FAILED,RESOURCING
AssignResources,IDLE,IDLE,SLEW,TRACK,CONFIG,OPERATE,OK,UNKNOWN,RESOURCING
AssignResources,IDLE,IDLE,SLEW,TRACK,OPERATE,CONFIG,OK,OK,IDLE
AssignResources,IDLE,IDLE,SLEW,TRACK,OPERATE,CONFIG,OK,FAILED,RESOURCING
AssignResources,IDLE,IDLE,SLEW,TRACK,OPERATE,CONFIG,OK,UNKNOWN,RESOURCING
AssignResources,IDLE,IDLE,SLEW,TRACK,OPERATE,OPERATE,OK,OK,IDLE
AssignResources,IDLE,IDLE,SLEW,TRACK,OPERATE,OPERATE,OK,FAILED,RESOURCING
AssignResources,IDLE,IDLE,SLEW,TRACK,OPERATE,OPERATE,OK,UNKNOWN,RESOURCING
AssignResources,IDLE,IDLE,SLEW,SLEW,CONFIG,CONFIG,OK,OK,IDLE
AssignResources,IDLE,IDLE,SLEW,SLEW,CONFIG,CONFIG,OK,FAILED,RESOURCING
AssignResources,IDLE,IDLE,SLEW,SLEW,CONFIG,CONFIG,OK,UNKNOWN,RESOURCING
AssignResources,IDLE,IDLE,SLEW,SLEW,CONFIG,OPERATE,OK,OK,IDLE
AssignResources,IDLE,IDLE,SLEW,SLEW,CONFIG,OPERATE,OK,FAILED,RESOURCING
AssignResources,IDLE,IDLE,SLEW,SLEW,CONFIG,OPERATE,OK,UNKNOWN,RESOURCING
AssignResources,IDLE,IDLE,SLEW,SLEW,OPERATE,CONFIG,OK,OK,IDLE
AssignResources,IDLE,IDLE,SLEW,SLEW,OPERATE,CONFIG,OK,FAILED,RESOURCING
AssignResources,IDLE,IDLE,SLEW,SLEW,OPERATE,CONFIG,OK,UNKNOWN,RESOURCING
AssignResources,IDLE,IDLE,SLEW,SLEW,OPERATE,OPERATE,OK,OK,IDLE
AssignResources,IDLE,IDLE,SLEW,SLEW,OPERATE,OPERATE,OK,FAILED,RESOURCING
AssignResources,IDLE,IDLE,SLEW,SLEW,OPERATE,OPERATE,OK,UNKNOWN,RESOURCING
Configure,CONFIGURING,IDLE,READY,READY,CONFIG,CONFIG,OK,OK,CONFIGURING
Configure,READY,IDLE,READY,READY,CONFIG,CONFIG,OK,OK,CONFIGURING
Configure,READY,IDLE,READY,READY,CONFIG,CONFIG,OK,FAILED,CONFIGURING
Configure,READY,IDLE,READY,READY,CONFIG,CONFIG,OK,UNKNOWN,CONFIGURING
Configure,READY,IDLE,READY,READY,CONFIG,OPERATE,OK,OK,CONFIGURING
Configure,READY,IDLE,READY,READY,CONFIG,OPERATE,OK,FAILED,CONFIGURING
Configure,READY,IDLE,READY,READY,CONFIG,OPERATE,OK,UNKNOWN,CONFIGURING
Configure,READY,IDLE,READY,READY,OPERATE,CONFIG,OK,OK,CONFIGURING
Configure,READY,IDLE,READY,READY,OPERATE,CONFIG,OK,FAILED,CONFIGURING
Configure,READY,IDLE,READY,READY,OPERATE,CONFIG,OK,UNKNOWN,CONFIGURING
Configure,READY,IDLE,READY,READY,OPERATE,OPERATE,OK,OK,CONFIGURING
Configure,READY,IDLE,READY,READY,OPERATE,OPERATE,OK,FAILED,CONFIGURING
Configure,READY,IDLE,READY,READY,OPERATE,OPERATE,OK,UNKNOWN,CONFIGURING
Configure,READY,IDLE,READY,TRACK,CONFIG,CONFIG,OK,OK,CONFIGURING
Configure,READY,IDLE,READY,TRACK,CONFIG,CONFIG,OK,FAILED,CONFIGURING
Configure,READY,IDLE,READY,TRACK,CONFIG,CONFIG,OK,UNKNOWN,CONFIGURING
Configure,READY,IDLE,READY,TRACK,CONFIG,OPERATE,OK,OK,CONFIGURING
Configure,READY,IDLE,READY,TRACK,CONFIG,OPERATE,OK,FAILED,CONFIGURING
Configure,READY,IDLE,READY,TRACK,CONFIG,OPERATE,OK,UNKNOWN,CONFIGURING
Configure,READY,IDLE,READY,TRACK,OPERATE,CONFIG,OK,OK,CONFIGURING
Configure,READY,IDLE,READY,TRACK,OPERATE,CONFIG,OK,FAILED,CONFIGURING
Configure,READY,IDLE,READY,TRACK,OPERATE,CONFIG,OK,UNKNOWN,CONFIGURING
Configure,READY,IDLE,READY,TRACK,OPERATE,OPERATE,OK,OK,CONFIGURING
Configure,READY,IDLE,READY,TRACK,OPERATE,OPERATE,OK,FAILED,CONFIGURING
Configure,READY,IDLE,READY,TRACK,OPERATE,OPERATE,OK,UNKNOWN,CONFIGURING
Configure,READY,IDLE,READY,SLEW,CONFIG,CONFIG,OK,OK,CONFIGURING
Configure,READY,IDLE,READY,SLEW,CONFIG,CONFIG,OK,FAILED,CONFIGURING
Configure,READY,IDLE,READY,SLEW,CONFIG,CONFIG,OK,UNKNOWN,CONFIGURING
Configure,READY,IDLE,READY,SLEW,CONFIG,OPERATE,OK,OK,CONFIGURING
Configure,READY,IDLE,READY,SLEW,CONFIG,OPERATE,OK,FAILED,CONFIGURING
Configure,READY,IDLE,READY,SLEW,CONFIG,OPERATE,OK,UNKNOWN,CONFIGURING
Configure,READY,IDLE,READY,SLEW,OPERATE,CONFIG,OK,OK,CONFIGURING
Configure,READY,IDLE,READY,SLEW,OPERATE,CONFIG,OK,FAILED,CONFIGURING
Configure,READY,IDLE,READY,SLEW,OPERATE,CONFIG,OK,UNKNOWN,CONFIGURING
Configure,READY,IDLE,READY,SLEW,OPERATE,OPERATE,OK,OK,CONFIGURING
Configure,READY,IDLE,READY,SLEW,OPERATE,OPERATE,OK,FAILED,CONFIGURING
Configure,READY,IDLE,READY,SLEW,OPERATE,OPERATE,OK,UNKNOWN,CONFIGURING
Configure,READY,IDLE,TRACK,READY,CONFIG,CONFIG,OK,OK,CONFIGURING
Configure,READY,IDLE,TRACK,READY,CONFIG,CONFIG,OK,FAILED,CONFIGURING
Configure,READY,IDLE,TRACK,READY,CONFIG,CONFIG,OK,UNKNOWN,CONFIGURING
Configure,READY,IDLE,TRACK,READY,CONFIG,OPERATE,OK,OK,CONFIGURING
Configure,READY,IDLE,TRACK,READY,CONFIG,OPERATE,OK,FAILED,CONFIGURING
Configure,READY,IDLE,TRACK,READY,CONFIG,OPERATE,OK,UNKNOWN,CONFIGURING
Configure,READY,IDLE,TRACK,READY,OPERATE,CONFIG,OK,OK,CONFIGURING
Configure,READY,IDLE,TRACK,READY,OPERATE,CONFIG,OK,FAILED,CONFIGURING
Configure,READY,IDLE,TRACK,READY,OPERATE,CONFIG,OK,UNKNOWN,CONFIGURING
Configure,READY,IDLE,TRACK,READY,OPERATE,OPERATE,OK,OK,CONFIGURING
Configure,READY,IDLE,TRACK,READY,OPERATE,OPERATE,OK,FAILED,CONFIGURING
Configure,READY,IDLE,TRACK,READY,OPERATE,OPERATE,OK,UNKNOWN,CONFIGURING
Configure,READY,IDLE,TRACK,TRACK,CONFIG,CONFIG,OK,OK,CONFIGURING
Configure,READY,IDLE,TRACK,TRACK,CONFIG,CONFIG,OK,FAILED,CONFIGURING
Configure,READY,IDLE,TRACK,TRACK,CONFIG,CONFIG,OK,UNKNOWN,CONFIGURING
Configure,READY,IDLE,TRACK,TRACK,CONFIG,OPERATE,OK,OK,CONFIGURING
Configure,READY,IDLE,TRACK,TRACK,CONFIG,OPERATE,OK,FAILED,CONFIGURING
Configure,READY,IDLE,TRACK,TRACK,CONFIG,OPERATE,OK,UNKNOWN,CONFIGURING
Configure,READY,IDLE,TRACK,TRACK,OPERATE,CONFIG,OK,OK,CONFIGURING
Configure,READY,IDLE,TRACK,TRACK,OPERATE,CONFIG,OK,FAILED,CONFIGURING
Configure,READY,IDLE,TRACK,TRACK,OPERATE,CONFIG,OK,UNKNOWN,CONFIGURING
Configure,READY,IDLE,TRACK,TRACK,OPERATE,OPERATE,OK,OK,CONFIGURING
Configure,READY,IDLE,TRACK,TRACK,OPERATE,OPERATE,OK,FAILED,CONFIGURING
Configure,READY,IDLE,TRACK,TRACK,OPERATE,OPERATE,OK,UNKNOWN,CONFIGURING
Configure,READY,IDLE,TRACK,SLEW,CONFIG,CONFIG,OK,OK,CONFIGURING
Configure,READY,IDLE,TRACK,SLEW,CONFIG,CONFIG,OK,FAILED,CONFIGURING
Configure,READY,IDLE,TRACK,SLEW,CONFIG,CONFIG,OK,UNKNOWN,CONFIGURING
Configure,READY,IDLE,TRACK,SLEW,CONFIG,OPERATE,OK,OK,CONFIGURING
Configure,READY,IDLE,TRACK,SLEW,CONFIG,OPERATE,OK,FAILED,CONFIGURING
Configure,READY,IDLE,TRACK,SLEW,CONFIG,OPERATE,OK,UNKNOWN,CONFIGURING
Configure,READY,IDLE,TRACK,SLEW,OPERATE,CONFIG,OK,OK,CONFIGURING
Configure,READY,IDLE,TRACK,SLEW,OPERATE,CONFIG,OK,FAILED,CONFIGURING
Configure,READY,IDLE,TRACK,SLEW,OPERATE,CONFIG,OK,UNKNOWN,CONFIGURING
Configure,READY,IDLE,TRACK,SLEW,OPERATE,OPERATE,OK,OK,CONFIGURING
Configure,READY,IDLE,TRACK,SLEW,OPERATE,OPERATE,OK,FAILED,CONFIGURING
Configure,READY,IDLE,TRACK,SLEW,OPERATE,OPERATE,OK,UNKNOWN,CONFIGURING
Configure,READY,IDLE,SLEW,READY,CONFIG,CONFIG,OK,OK,CONFIGURING
Configure,READY,IDLE,SLEW,READY,CONFIG,CONFIG,OK,FAILED,CONFIGURING
Configure,READY,IDLE,SLEW,READY,CONFIG,CONFIG,OK,UNKNOWN,CONFIGURING
Configure,READY,IDLE,SLEW,READY,CONFIG,OPERATE,OK,OK,CONFIGURING
Configure,READY,IDLE,SLEW,READY,CONFIG,OPERATE,OK,FAILED,CONFIGURING
Configure,READY,IDLE,SLEW,READY,CONFIG,OPERATE,OK,UNKNOWN,CONFIGURING
Configure,READY,IDLE,SLEW,READY,OPERATE,CONFIG,OK,OK,CONFIGURING
Configure,READY,IDLE,SLEW,READY,OPERATE,CONFIG,OK,FAILED,CONFIGURING
Configure,READY,IDLE,SLEW,READY,OPERATE,CONFIG,OK,UNKNOWN,CONFIGURING
Configure,READY,IDLE,SLEW,READY,OPERATE,OPERATE,OK,OK,CONFIGURING
Configure,READY,IDLE,SLEW,READY,OPERATE,OPERATE,OK,FAILED,CONFIGURING
Configure,READY,IDLE,SLEW,READY,OPERATE,OPERATE,OK,UNKNOWN,CONFIGURING
Configure,READY,IDLE,SLEW,TRACK,CONFIG,CONFIG,OK,OK,CONFIGURING
Configure,READY,IDLE,SLEW,TRACK,CONFIG,CONFIG,OK,FAILED,CONFIGURING
Configure,READY,IDLE,SLEW,TRACK,CONFIG,CONFIG,OK,UNKNOWN,CONFIGURING
Configure,READY,IDLE,SLEW,TRACK,CONFIG,OPERATE,OK,OK,CONFIGURING
Configure,READY,IDLE,SLEW,TRACK,CONFIG,OPERATE,OK,FAILED,CONFIGURING
Configure,READY,IDLE,SLEW,TRACK,CONFIG,OPERATE,OK,UNKNOWN,CONFIGURING
Configure,READY,IDLE,SLEW,TRACK,OPERATE,CONFIG,OK,OK,CONFIGURING
Configure,READY,IDLE,SLEW,TRACK,OPERATE,CONFIG,OK,FAILED,CONFIGURING
Configure,READY,IDLE,SLEW,TRACK,OPERATE,CONFIG,OK,UNKNOWN,CONFIGURING
Configure,READY,IDLE,SLEW,TRACK,OPERATE,OPERATE,OK,OK,CONFIGURING
Configure,READY,IDLE,SLEW,TRACK,OPERATE,OPERATE,OK,FAILED,CONFIGURING
Configure,READY,IDLE,SLEW,TRACK,OPERATE,OPERATE,OK,UNKNOWN,CONFIGURING
Configure,READY,IDLE,SLEW,SLEW,CONFIG,CONFIG,OK,OK,CONFIGURING
Configure,READY,IDLE,SLEW,SLEW,CONFIG,CONFIG,OK,FAILED,CONFIGURING
Configure,READY,IDLE,SLEW,SLEW,CONFIG,CONFIG,OK,UNKNOWN,CONFIGURING
Configure,READY,IDLE,SLEW,SLEW,CONFIG,OPERATE,OK,OK,CONFIGURING
Configure,READY,IDLE,SLEW,SLEW,CONFIG,OPERATE,OK,FAILED,CONFIGURING
Configure,READY,IDLE,SLEW,SLEW,CONFIG,OPERATE,OK,UNKNOWN,CONFIGURING
Configure,READY,IDLE,SLEW,SLEW,OPERATE,CONFIG,OK,OK,CONFIGURING
Configure,READY,IDLE,SLEW,SLEW,OPERATE,CONFIG,OK,FAILED,CONFIGURING
Configure,READY,IDLE,SLEW,SLEW,OPERATE,CONFIG,OK,UNKNOWN,CONFIGURING
Configure,READY,IDLE,SLEW,SLEW,OPERATE,OPERATE,OK,OK,CONFIGURING
Configure,READY,IDLE,SLEW,SLEW,OPERATE,OPERATE,OK,FAILED,CONFIGURING
Configure,READY,IDLE,SLEW,SLEW,OPERATE,OPERATE,OK,UNKNOWN,CONFIGURING
Configure,READY,READY,READY,READY,CONFIG,CONFIG,OK,OK,CONFIGURING
Configure,READY,READY,READY,READY,CONFIG,CONFIG,OK,FAILED,CONFIGURING
Configure,READY,READY,READY,READY,CONFIG,CONFIG,OK,UNKNOWN,CONFIGURING
Configure,READY,READY,READY,READY,CONFIG,OPERATE,OK,OK,CONFIGURING
Configure,READY,READY,READY,READY,CONFIG,OPERATE,OK,FAILED,CONFIGURING
Configure,READY,READY,READY,READY,CONFIG,OPERATE,OK,UNKNOWN,CONFIGURING
Configure,READY,READY,READY,READY,OPERATE,CONFIG,OK,OK,CONFIGURING
Configure,READY,READY,READY,READY,OPERATE,CONFIG,OK,FAILED,CONFIGURING
Configure,READY,READY,READY,READY,OPERATE,CONFIG,OK,UNKNOWN,CONFIGURING
Configure,READY,READY,READY,READY,OPERATE,OPERATE,OK,OK,CONFIGURING
Configure,READY,READY,READY,READY,OPERATE,OPERATE,OK,FAILED,CONFIGURING
Configure,READY,READY,READY,READY,OPERATE,OPERATE,OK,UNKNOWN,CONFIGURING
Configure,READY,READY,READY,TRACK,CONFIG,CONFIG,OK,OK,CONFIGURING
Configure,READY,READY,READY,TRACK,CONFIG,CONFIG,OK,FAILED,CONFIGURING
Configure,READY,READY,READY,TRACK,CONFIG,CONFIG,OK,UNKNOWN,CONFIGURING
Configure,READY,READY,READY,TRACK,CONFIG,OPERATE,OK,OK,CONFIGURING
Configure,READY,READY,READY,TRACK,CONFIG,OPERATE,OK,FAILED,CONFIGURING
Configure,READY,READY,READY,TRACK,CONFIG,OPERATE,OK,UNKNOWN,CONFIGURING
Configure,READY,READY,READY,TRACK,OPERATE,CONFIG,OK,OK,CONFIGURING
Configure,READY,READY,READY,TRACK,OPERATE,CONFIG,OK,FAILED,CONFIGURING
Configure,READY,READY,READY,TRACK,OPERATE,CONFIG,OK,UNKNOWN,CONFIGURING
Configure,READY,READY,READY,TRACK,OPERATE,OPERATE,OK,OK,CONFIGURING
Configure,READY,READY,READY,TRACK,OPERATE,OPERATE,OK,FAILED,CONFIGURING
Configure,READY,READY,READY,TRACK,OPERATE,OPERATE,OK,UNKNOWN,CONFIGURING
Configure,READY,READY,READY,SLEW,CONFIG,CONFIG,OK,OK,CONFIGURING
Configure,READY,READY,READY,SLEW,CONFIG,CONFIG,OK,FAILED,CONFIGURING
Configure,READY,READY,READY,SLEW,CONFIG,CONFIG,OK,UNKNOWN,CONFIGURING
Configure,READY,READY,READY,SLEW,CONFIG,OPERATE,OK,OK,CONFIGURING
Configure,READY,READY,READY,SLEW,CONFIG,OPERATE,OK,FAILED,CONFIGURING
Configure,READY,READY,READY,SLEW,CONFIG,OPERATE,OK,UNKNOWN,CONFIGURING
Configure,READY,READY,READY,SLEW,OPERATE,CONFIG,OK,OK,CONFIGURING
Configure,READY,READY,READY,SLEW,OPERATE,CONFIG,OK,FAILED,CONFIGURING
Configure,READY,READY,READY,SLEW,OPERATE,CONFIG,OK,UNKNOWN,CONFIGURING
Configure,READY,READY,READY,SLEW,OPERATE,OPERATE,OK,OK,CONFIGURING
Configure,READY,READY,READY,SLEW,OPERATE,OPERATE,OK,FAILED,CONFIGURING
Configure,READY,READY,READY,SLEW,OPERATE,OPERATE,OK,UNKNOWN,CONFIGURING
Configure,READY,READY,TRACK,READY,CONFIG,CONFIG,OK,OK,CONFIGURING
Configure,READY,READY,TRACK,READY,CONFIG,CONFIG,OK,FAILED,CONFIGURING
Configure,READY,READY,TRACK,READY,CONFIG,CONFIG,OK,UNKNOWN,CONFIGURING
Configure,READY,READY,TRACK,READY,CONFIG,OPERATE,OK,OK,CONFIGURING
Configure,READY,READY,TRACK,READY,CONFIG,OPERATE,OK,FAILED,CONFIGURING
Configure,READY,READY,TRACK,READY,CONFIG,OPERATE,OK,UNKNOWN,CONFIGURING
Configure,READY,READY,TRACK,READY,OPERATE,CONFIG,OK,OK,CONFIGURING
Configure,READY,READY,TRACK,READY,OPERATE,CONFIG,OK,FAILED,CONFIGURING
Configure,READY,READY,TRACK,READY,OPERATE,CONFIG,OK,UNKNOWN,CONFIGURING
Configure,READY,READY,TRACK,READY,OPERATE,OPERATE,OK,OK,CONFIGURING
Configure,READY,READY,TRACK,READY,OPERATE,OPERATE,OK,FAILED,CONFIGURING
Configure,READY,READY,TRACK,READY,OPERATE,OPERATE,OK,UNKNOWN,CONFIGURING
Configure,READY,READY,TRACK,TRACK,CONFIG,CONFIG,OK,OK,None
Configure,READY,READY,TRACK,TRACK,CONFIG,CONFIG,OK,FAILED,CONFIGURING
Configure,READY,READY,TRACK,TRACK,CONFIG,CONFIG,OK,UNKNOWN,CONFIGURING
Configure,READY,READY,TRACK,TRACK,CONFIG,OPERATE,OK,OK,None
Configure,READY,READY,TRACK,TRACK,CONFIG,OPERATE,OK,FAILED,CONFIGURING
Configure,READY,READY,TRACK,TRACK,CONFIG,OPERATE,OK,UNKNOWN,CONFIGURING
Configure,READY,READY,TRACK,TRACK,OPERATE,CONFIG,OK,OK,None
Configure,READY,READY,TRACK,TRACK,OPERATE,CONFIG,OK,FAILED,CONFIGURING
Configure,READY,READY,TRACK,TRACK,OPERATE,CONFIG,OK,UNKNOWN,CONFIGURING
Configure,READY,READY,TRACK,TRACK,OPERATE,OPERATE,OK,OK,READY
Configure,READY,READY,TRACK,TRACK,OPERATE,OPERATE,OK,FAILED,CONFIGURING
Configure,READY,READY,TRACK,TRACK,OPERATE,OPERATE,OK,UNKNOWN,CONFIGURING
Configure,READY,READY,TRACK,SLEW,CONFIG,CONFIG,OK,OK,None
Configure,READY,READY,TRACK,SLEW,CONFIG,CONFIG,OK,FAILED,CONFIGURING
Configure,READY,READY,TRACK,SLEW,CONFIG,CONFIG,OK,UNKNOWN,CONFIGURING
Configure,READY,READY,TRACK,SLEW,CONFIG,OPERATE,OK,OK,None
Configure,READY,READY,TRACK,SLEW,CONFIG,OPERATE,OK,FAILED,CONFIGURING
Configure,READY,READY,TRACK,SLEW,CONFIG,OPERATE,OK,UNKNOWN,CONFIGURING
Configure,READY,READY,TRACK,SLEW,OPERATE,CONFIG,OK,OK,None
Configure,READY,READY,TRACK,SLEW,OPERATE,CONFIG,OK,FAILED,CONFIGURING
Configure,READY,READY,TRACK,SLEW,OPERATE,CONFIG,OK,UNKNOWN,CONFIGURING
Configure,READY,READY,TRACK,SLEW,OPERATE,OPERATE,OK,OK,READY
Configure,READY,READY,TRACK,SLEW,OPERATE,OPERATE,OK,FAILED,CONFIGURING
Configure,READY,READY,TRACK,SLEW,OPERATE,OPERATE,OK,UNKNOWN,CONFIGURING
Configure,READY,READY,SLEW,READY,CONFIG,CONFIG,OK,OK,CONFIGURING
Configure,READY,READY,SLEW,READY,CONFIG,CONFIG,OK,FAILED,CONFIGURING
Configure,READY,READY,SLEW,READY,CONFIG,CONFIG,OK,UNKNOWN,CONFIGURING
Configure,READY,READY,SLEW,READY,CONFIG,OPERATE,OK,OK,CONFIGURING
Configure,READY,READY,SLEW,READY,CONFIG,OPERATE,OK,FAILED,CONFIGURING
Configure,READY,READY,SLEW,READY,CONFIG,OPERATE,OK,UNKNOWN,CONFIGURING
Configure,READY,READY,SLEW,READY,OPERATE,CONFIG,OK,OK,CONFIGURING
Configure,READY,READY,SLEW,READY,OPERATE,CONFIG,OK,FAILED,CONFIGURING
Configure,READY,READY,SLEW,READY,OPERATE,CONFIG,OK,UNKNOWN,CONFIGURING
Configure,READY,READY,SLEW,READY,OPERATE,OPERATE,OK,OK,CONFIGURING
Configure,READY,READY,SLEW,READY,OPERATE,OPERATE,OK,FAILED,CONFIGURING
Configure,READY,READY,SLEW,READY,OPERATE,OPERATE,OK,UNKNOWN,CONFIGURING
Configure,READY,READY,SLEW,TRACK,CONFIG,CONFIG,OK,OK,None
Configure,READY,READY,SLEW,TRACK,CONFIG,CONFIG,OK,FAILED,CONFIGURING
Configure,READY,READY,SLEW,TRACK,CONFIG,CONFIG,OK,UNKNOWN,CONFIGURING
Configure,READY,READY,SLEW,TRACK,CONFIG,OPERATE,OK,OK,None
Configure,READY,READY,SLEW,TRACK,CONFIG,OPERATE,OK,FAILED,CONFIGURING
Configure,READY,READY,SLEW,TRACK,CONFIG,OPERATE,OK,UNKNOWN,CONFIGURING
Configure,READY,READY,SLEW,TRACK,OPERATE,CONFIG,OK,OK,None
Configure,READY,READY,SLEW,TRACK,OPERATE,CONFIG,OK,FAILED,CONFIGURING
Configure,READY,READY,SLEW,TRACK,OPERATE,CONFIG,OK,UNKNOWN,CONFIGURING
Configure,READY,READY,SLEW,TRACK,OPERATE,OPERATE,OK,OK,READY
Configure,READY,READY,SLEW,TRACK,OPERATE,OPERATE,OK,FAILED,CONFIGURING
Configure,READY,READY,SLEW,TRACK,OPERATE,OPERATE,OK,UNKNOWN,CONFIGURING
Configure,READY,READY,SLEW,SLEW,CONFIG,CONFIG,OK,OK,None
Configure,READY,READY,SLEW,SLEW,CONFIG,CONFIG,OK,FAILED,CONFIGURING
Configure,READY,READY,SLEW,SLEW,CONFIG,CONFIG,OK,UNKNOWN,CONFIGURING
Configure,READY,READY,SLEW,SLEW,CONFIG,OPERATE,OK,OK,None
Configure,READY,READY,SLEW,SLEW,CONFIG,OPERATE,OK,FAILED,CONFIGURING
Configure,READY,READY,SLEW,SLEW,CONFIG,OPERATE,OK,UNKNOWN,CONFIGURING
Configure,READY,READY,SLEW,SLEW,OPERATE,CONFIG,OK,OK,None
Configure,READY,READY,SLEW,SLEW,OPERATE,CONFIG,OK,FAILED,CONFIGURING
Configure,READY,READY,SLEW,SLEW,OPERATE,CONFIG,OK,UNKNOWN,CONFIGURING
Configure,READY,READY,SLEW,SLEW,OPERATE,OPERATE,OK,OK,READY
Configure,READY,READY,SLEW,SLEW,OPERATE,OPERATE,OK,FAILED,CONFIGURING
Configure,READY,READY,SLEW,SLEW,OPERATE,OPERATE,OK,UNKNOWN,CONFIGURING
Scan,READY,SCANNING,TRACK,TRACK,OPERATE,OPERATE,OK,OK,SCANNING
Scan,SCANNING,READY,TRACK,TRACK,OPERATE,OPERATE,OK,OK,SCANNING
Scan,SCANNING,SCANNING,TRACK,TRACK,OPERATE,OPERATE,OK,OK,SCANNING
Abort,ABORTING,EMPTY,TRACK,TRACK,OPERATE,OPERATE,OK,OK,ABORTING
Abort,ABORTING,RESOURCING,TRACK,TRACK,OPERATE,OPERATE,OK,OK,ABORTING
Abort,ABORTING,IDLE,TRACK,TRACK,OPERATE,OPERATE,OK,OK,ABORTING
Abort,ABORTING,CONFIGURING,TRACK,TRACK,OPERATE,OPERATE,OK,OK,ABORTING
Abort,ABORTING,READY,TRACK,TRACK,OPERATE,OPERATE,OK,OK,ABORTING
Abort,ABORTING,SCANNING,TRACK,TRACK,OPERATE,OPERATE,OK,OK,ABORTING
Abort,ABORTING,ABORTING,TRACK,TRACK,OPERATE,OPERATE,OK,OK,ABORTING
Abort,ABORTING,ABORTED,TRACK,TRACK,OPERATE,OPERATE,OK,OK,ABORTING
Abort,ABORTED,EMPTY,TRACK,TRACK,OPERATE,OPERATE,OK,OK,None
Abort,ABORTED,EMPTY,READY,READY,OPERATE,OPERATE,OK,OK,ABORTED
Abort,ABORTED,EMPTY,READY,NONE,OPERATE,OPERATE,OK,OK,ABORTED
Abort,ABORTED,EMPTY,NONE,NONE,OPERATE,OPERATE,OK,OK,ABORTED
Abort,ABORTED,ABORTED,TRACK,TRACK,OPERATE,OPERATE,OK,OK,None
Restart,RESTARTING,EMPTY,TRACK,TRACK,OPERATE,OPERATE,OK,OK,RESTARTING
Restart,RESTARTING,ABORTED,TRACK,TRACK,OPERATE,OPERATE,OK,OK,RESTARTING
ReleaseAllResources,EMPTY,EMPTY,NONE,NONE,STANDBY_FP,STANDBY_FP,OK,OK,EMPTY
ReleaseAllResources,EMPTY,EMPTY,NONE,NONE,STANDBY_FP,STANDBY_FP,OK,FAILED,None
ReleaseAllResources,EMPTY,EMPTY,NONE,NONE,STANDBY_FP,STANDBY_FP,OK,UNKNOWN,None
ReleaseAllResources,EMPTY,RESOURCING,NONE,NONE,STANDBY_FP,STANDBY_FP,OK,OK,RESOURCING
ReleaseAllResources,EMPTY,RESOURCING,NONE,NONE,STANDBY_FP,STANDBY_FP,OK,FAILED,RESOURCING
ReleaseAllResources,EMPTY,RESOURCING,NONE,NONE,STANDBY_FP,STANDBY_FP,OK,UNKNOWN,RESOURCING
