{
    "test-0.host.name": {
        "hw_md": {
            "cpu": {
                "Architecture": "x86_64",
                "BogoMIPS": 4799.96,
                "CPU_Family": "6",
                "CPU_MHz": 2947.633,
                "CPU_Max_Speed_MHz": 3200.0,
                "CPU_Min_Speed_MHz": 1200.0,
                "CPU_Model": "Intel(R) Xeon(R) CPU E5-2630 v3 @ 2.40GHz",
                "CPU_num": 32,
                "Cores_per_socket": 8,
                "L1d_cache": "32K",
                "L1i_cache": "32K",
                "L2_cache": "256K",
                "L3_cache": "20480K",
                "Microcode": "0x46",
                "NUMA_node0_CPUs": "0,2,4,6,8,10,12,14,16,18,20,22,24,26,28,30",
                "NUMA_node1_CPUs": "1,3,5,7,9,11,13,15,17,19,21,23,25,27,29,31",
                "NUMA_nodes": 2,
                "Online_CPUs_list": "0-31",
                "Power_Driver": "intel_pstate",
                "Power_Policy": "performance",
                "SMT_Enabled?": true,
                "Sockets": 2,
                "Stepping": 2,
                "Threads_per_core": 2,
                "Vendor_ID": "GenuineIntel"
            },
            "memory": {
                "Mem_Available": 130011808,
                "Mem_Swap": 3905532,
                "Mem_Total": 131801064
            }
        }
    },
    "test-1.host.name": {
        "hw_md": {
            "cpu": {
                "Architecture": "x86_64",
                "BogoMIPS": 4800.14,
                "CPU_Family": "6",
                "CPU_MHz": 2921.072,
                "CPU_Max_Speed_MHz": 3200.0,
                "CPU_Min_Speed_MHz": 1200.0,
                "CPU_Model": "Intel(R) Xeon(R) CPU E5-2630 v3 @ 2.40GHz",
                "CPU_num": 32,
                "Cores_per_socket": 8,
                "L1d_cache": "32K",
                "L1i_cache": "32K",
                "L2_cache": "256K",
                "L3_cache": "20480K",
                "Microcode": "0x46",
                "NUMA_node0_CPUs": "0,2,4,6,8,10,12,14,16,18,20,22,24,26,28,30",
                "NUMA_node1_CPUs": "1,3,5,7,9,11,13,15,17,19,21,23,25,27,29,31",
                "NUMA_nodes": 2,
                "Online_CPUs_list": "0-31",
                "Power_Driver": "intel_pstate",
                "Power_Policy": "performance",
                "SMT_Enabled?": true,
                "Sockets": 2,
                "Stepping": 2,
                "Threads_per_core": 2,
                "Vendor_ID": "GenuineIntel"
            },
            "memory": {
                "Mem_Available": 130082880,
                "Mem_Swap": 3905532,
                "Mem_Total": 131801064
            }
        }
    },
    "host_names": [
        "grisou-48.nancy.grid5000.fr",
        "grisou-31.nancy.grid5000.fr"
    ]
}
