{
    "test-0.host.name": {
        "FLOPS_DP": {
            "AVX_INSTS_CALC_DP": [
                0,
                0,
                0,
                0,
                150,
                0,
                0,
                0,
                0,
                0
            ],
            "derv_total_DP_FLOPS": [
                0.0,
                0.0,
                0.0,
                0.0,
                0.00011999999999999999,
                0.0,
                0.0,
                0.0,
                0.0,
                0.0
            ]
        },
        "FLOPS_SP": {
            "AVX_INSTS_CALC_SP": [
                0,
                0,
                0,
                0,
                150,
                0,
                150,
                0,
                0,
                0
            ],
            "derv_total_SP_FLOPS": [
                0.0,
                0.0,
                0.0,
                0.0,
                0.00023999999999999998,
                0.0,
                0.00023999999999999998,
                0.0,
                0.0,
                0.0
            ]
        },
        "L2": {
            "L1D_REPLACEMENT": [
                2896229059,
                2943460599,
                2940168282,
                2898619729,
                2938359510,
                2946212155,
                2895098920,
                2946309783,
                2942339447,
                1850299615
            ],
            "L2_ICACHE_MISSES": [
                3188,
                4785,
                4844,
                5502,
                3099,
                3535,
                3246,
                2271,
                2380,
                5197
            ],
            "L2_TRANS_L1D_WB": [
                2158322,
                2150363,
                2129293,
                2325826,
                2110050,
                2116584,
                2116522,
                2115528,
                2115901,
                1636816
            ],
            "derv_total_L2_BW": [
                37099.39928319999,
                37703.8815616,
                37661.470963199994,
                37132.1735296,
                37638.0500352,
                37738.6531072,
                37084.3992064,
                37739.8730496,
                37689.0589184,
                23704.8528384
            ]
        },
        "L2cache": {
            "L2_RQSTS_MISS": [
                336502244,
                340280685,
                341504936,
                337497961,
                341117171,
                341706226,
                337263789,
                341931436,
                342116438,
                213978574
            ],
            "L2_TRANS_ALL": [
                3259450829,
                3301041984,
                3307593912,
                3265795451,
                3303185724,
                3309312478,
                3268330422,
                3312318615,
                3310901071,
                2081974115
            ],
            "derv_total_L2_cache_miss_rate": [
                0.0206477877197024,
                0.020616562082477287,
                0.020649749944273085,
                0.02066865277166436,
                0.02065382933339415,
                0.020651191343919986,
                0.0206382920606673,
                0.020646047421377066,
                0.020666062238861742,
                0.02055535392667454
            ]
        },
        "L3": {
            "L2_LINES_IN_ALL": [
                336888039,
                339929540,
                341578444,
                336823427,
                341374329,
                341643967,
                337036056,
                341708454,
                342229494,
                213352418
            ],
            "L2_TRANS_L2_WB": [
                659254,
                678135,
                664090,
                728796,
                662447,
                665913,
                840236,
                667776,
                667220,
                527179
            ],
            "derv_total_L3_BW": [
                4320.605350399999,
                4359.77824,
                4380.704435199999,
                4320.6684544,
                4378.0707328,
                4381.5664639999995,
                4324.8165376,
                4382.415744,
                4389.0779391999995,
                2737.6588416
            ]
        },
        "L3cache": {
            "MEM_LOAD_UOPS_RETIRED_L3_ALL": [
                333709414,
                336643758,
                338133504,
                331958733,
                337968478,
                337896101,
                331625049,
                337618349,
                338633484,
                211417261
            ],
            "MEM_LOAD_UOPS_RETIRED_L3_MISS": [
                19107078,
                18108952,
                17155467,
                21330772,
                17029243,
                17710085,
                18310360,
                17531324,
                16685774,
                17135703
            ],
            "derv_total_L3_cache_miss_rate": [
                0.011451326931999586,
                0.010758525337041896,
                0.010147155958848728,
                0.012851460063862818,
                0.010077414971226991,
                0.010482562508171705,
                0.011042808771661878,
                0.010385290996135995,
                0.009854769116689003,
                0.016210315959017178
            ]
        },
        "hardware_events": {
            "branch-misses:u": [
                1712919,
                1742660,
                1741750,
                1719755,
                1740786,
                1744851,
                1712088,
                1744840,
                1742533,
                1095654
            ],
            "branches:u": [
                2566299327,
                2615506086,
                2613598733,
                2580445683,
                2612337440,
                2620330239,
                2569135726,
                2618608737,
                2617085469,
                1641709604
            ],
            "cache-misses:u": [
                20684285,
                17416520,
                17550317,
                19629620,
                17619755,
                17093834,
                20239304,
                17122097,
                17207963,
                16148772
            ],
            "cache-references:u": [
                334639783,
                341085728,
                340862450,
                337293962,
                340732795,
                341786701,
                335440636,
                341753526,
                341484100,
                213651392
            ],
            "cycles:u": [
                31610052971,
                31846712253,
                31858890036,
                31732081631,
                31861904703,
                31869182987,
                31684309581,
                31866885111,
                31865789135,
                20751011101
            ],
            "instructions:u": [
                71597118730,
                73082307662,
                73100526212,
                72268214250,
                73083645356,
                73270284413,
                72007277048,
                73236096678,
                73271540429,
                45858481951
            ]
        },
        "software_events": {
            "context-switches:u": [
                0,
                0,
                0,
                0,
                0,
                0,
                0,
                0,
                0,
                0
            ],
            "cpu-migrations:u": [
                0,
                0,
                0,
                0,
                0,
                0,
                0,
                0,
                0,
                0
            ]
        },
        "time_stamps": [
            1631394258,
            1631394263,
            1631394268,
            1631394273,
            1631394278,
            1631394283,
            1631394288,
            1631394293,
            1631394298,
            1631394303
        ]
    },
    "test-1.host.name": {
        "FLOPS_DP": {
            "AVX_INSTS_CALC_DP": [
                0,
                152,
                0,
                0,
                0,
                0,
                0,
                0,
                0,
                0
            ],
            "derv_total_DP_FLOPS": [
                0.0,
                0.00012159999999999999,
                0.0,
                0.0,
                0.0,
                0.0,
                0.0,
                0.0,
                0.0,
                0.0
            ]
        },
        "FLOPS_SP": {
            "AVX_INSTS_CALC_SP": [
                0,
                0,
                0,
                0,
                0,
                0,
                0,
                0,
                0,
                0
            ],
            "derv_total_SP_FLOPS": [
                0.0,
                0.0,
                0.0,
                0.0,
                0.0,
                0.0,
                0.0,
                0.0,
                0.0,
                0.0
            ]
        },
        "L2": {
            "L1D_REPLACEMENT": [
                3153777218,
                3217728762,
                3218430587,
                3174837650,
                3222737563,
                3226810950,
                3177234090,
                3215298199,
                2691579727,
                119766610
            ],
            "L2_ICACHE_MISSES": [
                3299,
                2773,
                3402,
                4050,
                3099,
                2632,
                4340,
                3006,
                3352,
                203
            ],
            "L2_TRANS_L1D_WB": [
                2420366,
                2383670,
                2279061,
                2377813,
                2280922,
                2281520,
                2458184,
                2286179,
                1920537,
                85339
            ],
            "derv_total_L2_BW": [
                40399.3713024,
                41217.474624,
                41225.12704,
                40668.4097664,
                41280.2762752,
                41332.4173056,
                40700.1166592,
                41185.118515199996,
                34476.8462848,
                1534.1075455999999
            ]
        },
        "L2cache": {
            "L2_RQSTS_MISS": [
                370566626,
                377632793,
                377730562,
                373606089,
                378777064,
                377960743,
                374263462,
                376365868,
                315034029,
                14190452
            ],
            "L2_TRANS_ALL": [
                3537259364,
                3602383241,
                3603840818,
                3560547905,
                3613533428,
                3605983496,
                3567725898,
                3593414031,
                3004046289,
                134167920
            ],
            "derv_total_L2_cache_miss_rate": [
                0.02095218856561065,
                0.020965720065651394,
                0.02096266628167149,
                0.02098587627344393,
                0.020964359209464604,
                0.020962976864384406,
                0.020980505380741556,
                0.020947537063813505,
                0.02097397967225531,
                0.02115327121416207
            ]
        },
        "L3": {
            "L2_LINES_IN_ALL": [
                370803036,
                377509680,
                377762940,
                373972684,
                378584980,
                377923281,
                374478143,
                376187146,
                314425049,
                14094628
            ],
            "L2_TRANS_L2_WB": [
                715294,
                716155,
                668700,
                776738,
                669711,
                673329,
                771992,
                674564,
                571978,
                26070
            ],
            "derv_total_L3_BW": [
                4755.4346239999995,
                4841.290687999999,
                4843.924991999999,
                4796.7926016,
                4854.4600448,
                4846.036608,
                4803.201728,
                4823.829887999999,
                4031.9619456,
                180.74493439999998
            ]
        },
        "L3cache": {
            "MEM_LOAD_UOPS_RETIRED_L3_ALL": [
                368118945,
                374144026,
                374124563,
                370267012,
                374661185,
                374617860,
                370459586,
                373074432,
                312459974,
                13843073
            ],
            "MEM_LOAD_UOPS_RETIRED_L3_MISS": [
                4019590,
                1582257,
                1944904,
                3544580,
                1464801,
                1732714,
                2975934,
                1405724,
                597374,
                142674
            ],
            "derv_total_L3_cache_miss_rate": [
                0.0021838539171082326,
                0.0008458010231599956,
                0.0010397093333858434,
                0.0019146075049213402,
                0.0007819336822948447,
                0.0009250568032180848,
                0.0016066173544770953,
                0.0007535890317994238,
                0.0003823683349599203,
                0.002061305318551741
            ]
        },
        "hardware_events": {
            "branch-misses:u": [
                1865666,
                1907510,
                1905142,
                1881860,
                1906469,
                1911128,
                1880577,
                1903968,
                1593091,
                73802
            ],
            "branches:u": [
                2796910746,
                2863843787,
                2857481453,
                2824475927,
                2858690456,
                2867787087,
                2821128951,
                2857970559,
                2388732788,
                104754526
            ],
            "cache-misses:u": [
                5818168,
                1466617,
                2489269,
                4723055,
                2235306,
                1413619,
                4895619,
                1695225,
                668593,
                56759
            ],
            "cache-references:u": [
                370134917,
                378359487,
                376660732,
                373084120,
                377319755,
                378651054,
                372623857,
                377415558,
                315831601,
                13989541
            ],
            "cycles:u": [
                31613798965,
                31882663129,
                31831968896,
                31702839412,
                31892382326,
                31904205172,
                31742414491,
                31863987101,
                26478126490,
                1160954642
            ],
            "instructions:u": [
                78432479604,
                80182432472,
                79763931610,
                78942380221,
                80031467350,
                80267685329,
                78977016332,
                80041875834,
                66750124446,
                2913252214
            ]
        },
        "software_events": {
            "context-switches:u": [
                0,
                0,
                0,
                0,
                0,
                0,
                0,
                0,
                0,
                0
            ],
            "cpu-migrations:u": [
                0,
                0,
                0,
                0,
                0,
                0,
                0,
                0,
                0,
                0
            ]
        },
        "time_stamps": [
            1631394259,
            1631394264,
            1631394269,
            1631394274,
            1631394279,
            1631394284,
            1631394289,
            1631394294,
            1631394299,
            1631394304
        ]
    },
    "host_names": [
        "test-0.host.name",
        "test-1.host.name"
    ],
    "sampling_frequency": 5
}
