{
    "annotations": {
      "list": [
        {
          "builtIn": 1,
          "datasource": {
            "type": "grafana",
            "uid": "-- Grafana --"
          },
          "enable": true,
          "hide": true,
          "iconColor": "rgba(0, 211, 255, 1)",
          "name": "Annotations & Alerts",
          "type": "dashboard"
        }
      ]
    },
    "editable": true,
    "fiscalYearStartMonth": 0,
    "graphTooltip": 0,
    "id": 156,
    "links": [],
    "panels": [
      {
        "datasource": {
          "type": "prometheus",
          "uid": "${DS_PROMETHEUS}"
        },
        "description": "",
        "fieldConfig": {
          "defaults": {
            "custom": {
              "align": "auto",
              "cellOptions": {
                "type": "auto"
              },
              "filterable": true,
              "inspect": false
            },
            "mappings": [],
            "thresholds": {
              "mode": "absolute",
              "steps": [
                {
                  "color": "green",
                  "value": null
                },
                {
                  "color": "red",
                  "value": 80
                }
              ]
            }
          },
          "overrides": [
            {
              "matcher": {
                "id": "byName",
                "options": "name"
              },
              "properties": [
                {
                  "id": "custom.width",
                  "value": 292
                }
              ]
            },
            {
              "matcher": {
                "id": "byName",
                "options": "Make Target"
              },
              "properties": [
                {
                  "id": "custom.width",
                  "value": 219
                }
              ]
            },
            {
              "matcher": {
                "id": "byName",
                "options": "Pipeline ID"
              },
              "properties": [
                {
                  "id": "custom.width",
                  "value": 173
                }
              ]
            },
            {
              "matcher": {
                "id": "byName",
                "options": "Project"
              },
              "properties": [
                {
                  "id": "custom.width",
                  "value": 202
                }
              ]
            },
            {
              "matcher": {
                "id": "byName",
                "options": "Time"
              },
              "properties": [
                {
                  "id": "custom.width",
                  "value": 164
                }
              ]
            },
            {
              "matcher": {
                "id": "byName",
                "options": "__name__"
              },
              "properties": [
                {
                  "id": "custom.width",
                  "value": 195
                }
              ]
            },
            {
              "matcher": {
                "id": "byName",
                "options": "job_id"
              },
              "properties": [
                {
                  "id": "custom.width",
                  "value": 144
                }
              ]
            },
            {
              "matcher": {
                "id": "byName",
                "options": "make_target"
              },
              "properties": [
                {
                  "id": "custom.width",
                  "value": 247
                }
              ]
            },
            {
              "matcher": {
                "id": "byName",
                "options": "pipeline_id"
              },
              "properties": [
                {
                  "id": "custom.width",
                  "value": 194
                }
              ]
            },
            {
              "matcher": {
                "id": "byName",
                "options": "Project Name"
              },
              "properties": [
                {
                  "id": "custom.width",
                  "value": 234
                }
              ]
            }
          ]
        },
        "gridPos": {
          "h": 9,
          "w": 15,
          "x": 0,
          "y": 0
        },
        "id": 2,
        "options": {
          "cellHeight": "sm",
          "footer": {
            "countRows": false,
            "enablePagination": true,
            "fields": "",
            "reducer": [
              "sum"
            ],
            "show": false
          },
          "frameIndex": 6,
          "showHeader": true,
          "sortBy": []
        },
        "pluginVersion": "11.1.0",
        "targets": [
          {
            "datasource": {
              "type": "prometheus",
              "uid": "${DS_PROMETHEUS}"
            },
            "disableTextWrap": false,
            "editorMode": "code",
            "expr": "make_target_runs_total{make_target=~\"$Target\", proj_name=~\"$ProjectName\"}",
            "format": "table",
            "fullMetaSearch": false,
            "includeNullMetadata": true,
            "instant": false,
            "legendFormat": "__auto",
            "range": true,
            "refId": "A",
            "useBackend": false
          }
        ],
        "title": "Detailed List of Make Target Runs",
        "transformations": [
          {
            "id": "filterFieldsByName",
            "options": {
              "byVariable": false,
              "include": {
                "names": [
                  "Time",
                  "make_target",
                  "pipeline_id",
                  "proj_name",
                  "job_id"
                ]
              }
            }
          },
          {
            "id": "organize",
            "options": {
              "excludeByName": {
                "job_id": false
              },
              "includeByName": {},
              "indexByName": {
                "Time": 0,
                "job_id": 4,
                "make_target": 1,
                "pipeline_id": 3,
                "proj_name": 2
              },
              "renameByName": {
                "Time": "Timestamp",
                "job_id": "Job ID",
                "make_target": "Make Target",
                "pipeline_id": "Pipeline ID",
                "proj_id": "Project ID",
                "proj_name": "Project Name"
              }
            }
          }
        ],
        "type": "table"
      },
      {
        "datasource": {
          "type": "prometheus",
          "uid": "${DS_PROMETHEUS}"
        },
        "fieldConfig": {
          "defaults": {
            "color": {
              "mode": "thresholds"
            },
            "mappings": [],
            "thresholds": {
              "mode": "absolute",
              "steps": [
                {
                  "color": "green",
                  "value": null
                }
              ]
            }
          },
          "overrides": []
        },
        "gridPos": {
          "h": 9,
          "w": 7,
          "x": 15,
          "y": 0
        },
        "id": 3,
        "options": {
          "minVizHeight": 75,
          "minVizWidth": 75,
          "orientation": "auto",
          "reduceOptions": {
            "calcs": [
              "lastNotNull"
            ],
            "fields": "",
            "values": false
          },
          "showThresholdLabels": false,
          "showThresholdMarkers": true,
          "sizing": "auto"
        },
        "pluginVersion": "11.1.0",
        "targets": [
          {
            "datasource": {
              "type": "prometheus",
              "uid": "${DS_PROMETHEUS}"
            },
            "disableTextWrap": false,
            "editorMode": "builder",
            "expr": "count(make_target_runs_total)",
            "fullMetaSearch": false,
            "includeNullMetadata": true,
            "instant": false,
            "legendFormat": "__auto",
            "range": true,
            "refId": "A",
            "useBackend": false
          }
        ],
        "title": "Total Make Target Runs",
        "type": "gauge"
      },
      {
        "datasource": {
          "type": "prometheus",
          "uid": "${DS_PROMETHEUS}"
        },
        "fieldConfig": {
          "defaults": {
            "color": {
              "mode": "palette-classic"
            },
            "custom": {
              "axisBorderShow": false,
              "axisCenteredZero": false,
              "axisColorMode": "text",
              "axisLabel": "",
              "axisPlacement": "auto",
              "barAlignment": 0,
              "drawStyle": "line",
              "fillOpacity": 0,
              "gradientMode": "none",
              "hideFrom": {
                "legend": false,
                "tooltip": false,
                "viz": false
              },
              "insertNulls": false,
              "lineInterpolation": "linear",
              "lineWidth": 1,
              "pointSize": 5,
              "scaleDistribution": {
                "type": "linear"
              },
              "showPoints": "auto",
              "spanNulls": false,
              "stacking": {
                "group": "A",
                "mode": "none"
              },
              "thresholdsStyle": {
                "mode": "off"
              }
            },
            "mappings": [],
            "thresholds": {
              "mode": "absolute",
              "steps": [
                {
                  "color": "green",
                  "value": null
                },
                {
                  "color": "red",
                  "value": 80
                }
              ]
            }
          },
          "overrides": []
        },
        "gridPos": {
          "h": 11,
          "w": 12,
          "x": 0,
          "y": 9
        },
        "id": 4,
        "options": {
          "legend": {
            "calcs": [],
            "displayMode": "list",
            "placement": "bottom",
            "showLegend": true
          },
          "tooltip": {
            "mode": "single",
            "sort": "none"
          }
        },
        "targets": [
          {
            "datasource": {
              "type": "prometheus",
              "uid": "${DS_PROMETHEUS}"
            },
            "disableTextWrap": false,
            "editorMode": "code",
            "expr": "sum(increase(make_target_runs_total[15m]))",
            "fullMetaSearch": false,
            "includeNullMetadata": false,
            "instant": false,
            "legendFormat": "__auto",
            "range": true,
            "refId": "A",
            "useBackend": false
          }
        ],
        "title": "Make Target Runs Over Time",
        "transformations": [
          {
            "id": "filterFieldsByName",
            "options": {
              "include": {
                "names": []
              }
            }
          }
        ],
        "type": "timeseries"
      },
      {
        "datasource": {
          "type": "prometheus",
          "uid": "${DS_PROMETHEUS}"
        },
        "fieldConfig": {
          "defaults": {
            "color": {
              "mode": "palette-classic"
            },
            "custom": {
              "hideFrom": {
                "legend": false,
                "tooltip": false,
                "viz": false
              }
            },
            "mappings": []
          },
          "overrides": []
        },
        "gridPos": {
          "h": 11,
          "w": 10,
          "x": 12,
          "y": 9
        },
        "id": 5,
        "options": {
          "legend": {
            "displayMode": "list",
            "placement": "bottom",
            "showLegend": true
          },
          "pieType": "pie",
          "reduceOptions": {
            "calcs": [
              "lastNotNull"
            ],
            "fields": "",
            "values": false
          },
          "tooltip": {
            "mode": "single",
            "sort": "none"
          }
        },
        "targets": [
          {
            "datasource": {
              "type": "prometheus",
              "uid": "${DS_PROMETHEUS}"
            },
            "editorMode": "code",
            "expr": "count(make_target_runs_total) by (proj_name)",
            "instant": false,
            "legendFormat": "__auto",
            "range": true,
            "refId": "A"
          }
        ],
        "title": "Make Target Runs by Project ID",
        "type": "piechart"
      }
    ],
    "refresh": "",
    "schemaVersion": 39,
    "tags": [],
    "templating": {
      "list": [
        {
          "current": {
            "selected": false,
            "text": "join-lint-reports",
            "value": "join-lint-reports"
          },
          "datasource": {
            "type": "prometheus",
            "uid": "${DS_PROMETHEUS}"
          },
          "definition": "label_values(make_target_runs_total,make_target)",
          "hide": 0,
          "includeAll": true,
          "multi": false,
          "name": "Target",
          "options": [],
          "query": {
            "qryType": 1,
            "query": "label_values(make_target_runs_total,make_target)",
            "refId": "PrometheusVariableQueryEditor-VariableQuery"
          },
          "refresh": 1,
          "regex": "",
          "skipUrlSync": false,
          "sort": 0,
          "type": "query"
        },
        {
          "current": {
            "selected": false,
            "text": "ska-ser-infra-machinery",
            "value": "ska-ser-infra-machinery"
          },
          "datasource": {
            "type": "prometheus",
            "uid": "${DS_PROMETHEUS}"
          },
          "definition": "label_values(make_target_runs_total,proj_name)",
          "hide": 0,
          "includeAll": true,
          "multi": false,
          "name": "ProjectName",
          "options": [],
          "query": {
            "qryType": 1,
            "query": "label_values(make_target_runs_total,proj_name)",
            "refId": "PrometheusVariableQueryEditor-VariableQuery"
          },
          "refresh": 1,
          "regex": "",
          "skipUrlSync": false,
          "sort": 0,
          "type": "query"
        },
        {
          "current": {
            "selected": false,
            "text": "All",
            "value": "$__all"
          },
          "datasource": {
            "type": "prometheus",
            "uid": "${DS_PROMETHEUS}"
          },
          "definition": "label_values(make_target_runs_total,pipeline_id)",
          "hide": 0,
          "includeAll": true,
          "multi": false,
          "name": "PipelineID",
          "options": [],
          "query": {
            "qryType": 1,
            "query": "label_values(make_target_runs_total,pipeline_id)",
            "refId": "PrometheusVariableQueryEditor-VariableQuery"
          },
          "refresh": 1,
          "regex": "",
          "skipUrlSync": false,
          "sort": 0,
          "type": "query"
        },
        {
          "current": {
            "selected": false,
            "text": "All",
            "value": "$__all"
          },
          "datasource": {
            "type": "prometheus",
            "uid": "${DS_PROMETHEUS}"
          },
          "definition": "label_values(make_target_runs_total,job_id)",
          "hide": 0,
          "includeAll": true,
          "multi": false,
          "name": "JobID",
          "options": [],
          "query": {
            "qryType": 1,
            "query": "label_values(make_target_runs_total,job_id)",
            "refId": "PrometheusVariableQueryEditor-VariableQuery"
          },
          "refresh": 1,
          "regex": "",
          "skipUrlSync": false,
          "sort": 0,
          "type": "query"
        }
      ]
    },
    "time": {
      "from": "now-24h",
      "to": "now"
    },
    "timepicker": {},
    "timezone": "browser",
    "title": "Pipeline Machinery Usage",
    "uid": "pipeline_machinery_usage",
    "version": 16,
    "weekStart": ""
}