<mxfile host="app.diagrams.net" modified="2023-08-24T11:29:05.415Z" agent="Mozilla/5.0 (Windows NT 10.0; Win64; x64) AppleWebKit/537.36 (KHTML, like Gecko) Chrome/116.0.0.0 Safari/537.36" etag="X9IKO1A1vHjyLXTDp0Oq" version="21.6.9" type="device">
  <diagram name="Page-1" id="2N6VTxNt-_J72hKKb8YH">
    <mxGraphModel dx="1050" dy="574" grid="1" gridSize="10" guides="1" tooltips="1" connect="1" arrows="1" fold="1" page="1" pageScale="1" pageWidth="850" pageHeight="1100" math="0" shadow="0">
      <root>
        <mxCell id="0" />
        <mxCell id="1" parent="0" />
        <mxCell id="Sh1RJuYrqoGtl_4VcRud-2" value="" style="shape=cube;whiteSpace=wrap;html=1;boundedLbl=1;backgroundOutline=1;darkOpacity=0.05;darkOpacity2=0.1;" parent="1" vertex="1">
          <mxGeometry x="50" y="179.5" width="260" height="190" as="geometry" />
        </mxCell>
        <mxCell id="Sh1RJuYrqoGtl_4VcRud-3" value="" style="shape=cylinder3;whiteSpace=wrap;html=1;boundedLbl=1;backgroundOutline=1;size=15;" parent="1" vertex="1">
          <mxGeometry x="260" y="20" width="180" height="120" as="geometry" />
        </mxCell>
        <mxCell id="Sh1RJuYrqoGtl_4VcRud-5" value="ska-pss-ci-systems repo" style="text;html=1;strokeColor=none;fillColor=none;align=center;verticalAlign=middle;whiteSpace=wrap;rounded=0;" parent="1" vertex="1">
          <mxGeometry x="275" y="25" width="160" height="20" as="geometry" />
        </mxCell>
        <mxCell id="Sh1RJuYrqoGtl_4VcRud-6" value="" style="shape=cube;whiteSpace=wrap;html=1;boundedLbl=1;backgroundOutline=1;darkOpacity=0.05;darkOpacity2=0.1;" parent="1" vertex="1">
          <mxGeometry x="480" y="270" width="160" height="100" as="geometry" />
        </mxCell>
        <mxCell id="Sh1RJuYrqoGtl_4VcRud-7" value="" style="shape=cube;whiteSpace=wrap;html=1;boundedLbl=1;backgroundOutline=1;darkOpacity=0.05;darkOpacity2=0.1;" parent="1" vertex="1">
          <mxGeometry x="160" y="210" width="130" height="80" as="geometry" />
        </mxCell>
        <mxCell id="Sh1RJuYrqoGtl_4VcRud-10" value="Python Virtual Environment" style="text;html=1;strokeColor=none;fillColor=none;align=center;verticalAlign=middle;whiteSpace=wrap;rounded=0;" parent="1" vertex="1">
          <mxGeometry x="190" y="235" width="90" height="20" as="geometry" />
        </mxCell>
        <mxCell id="Sh1RJuYrqoGtl_4VcRud-11" value="- Ansible (installed)&amp;nbsp;" style="text;html=1;strokeColor=none;fillColor=none;align=center;verticalAlign=middle;whiteSpace=wrap;rounded=0;" parent="1" vertex="1">
          <mxGeometry x="190" y="259" width="100" height="30" as="geometry" />
        </mxCell>
        <mxCell id="Sh1RJuYrqoGtl_4VcRud-12" value="local host" style="text;html=1;strokeColor=none;fillColor=none;align=center;verticalAlign=middle;whiteSpace=wrap;rounded=0;" parent="1" vertex="1">
          <mxGeometry x="80" y="200" width="60" height="30" as="geometry" />
        </mxCell>
        <mxCell id="Sh1RJuYrqoGtl_4VcRud-14" value="" style="endArrow=classic;html=1;rounded=0;exitX=0;exitY=0.5;exitDx=0;exitDy=0;exitPerimeter=0;" parent="1" source="Sh1RJuYrqoGtl_4VcRud-3" target="Sh1RJuYrqoGtl_4VcRud-37" edge="1">
          <mxGeometry width="50" height="50" relative="1" as="geometry">
            <mxPoint x="280" y="80" as="sourcePoint" />
            <mxPoint x="320" y="200" as="targetPoint" />
          </mxGeometry>
        </mxCell>
        <mxCell id="Sh1RJuYrqoGtl_4VcRud-15" value="1) A user downloads the repo to local host using git" style="text;html=1;strokeColor=none;fillColor=none;align=center;verticalAlign=middle;whiteSpace=wrap;rounded=0;" parent="1" vertex="1">
          <mxGeometry x="60" y="92.5" width="130" as="geometry" />
        </mxCell>
        <mxCell id="Sh1RJuYrqoGtl_4VcRud-21" value="Target Machine/s" style="text;html=1;strokeColor=none;fillColor=none;align=center;verticalAlign=middle;whiteSpace=wrap;rounded=0;" parent="1" vertex="1">
          <mxGeometry x="540" y="315" width="60" height="30" as="geometry" />
        </mxCell>
        <mxCell id="Sh1RJuYrqoGtl_4VcRud-22" value="" style="shape=cube;whiteSpace=wrap;html=1;boundedLbl=1;backgroundOutline=1;darkOpacity=0.05;darkOpacity2=0.1;" parent="1" vertex="1">
          <mxGeometry x="285" y="52.5" width="130" height="37.5" as="geometry" />
        </mxCell>
        <mxCell id="Sh1RJuYrqoGtl_4VcRud-23" value="iac_deployer" style="text;html=1;strokeColor=none;fillColor=none;align=center;verticalAlign=middle;whiteSpace=wrap;rounded=0;" parent="1" vertex="1">
          <mxGeometry x="320" y="60" width="70" height="40" as="geometry" />
        </mxCell>
        <mxCell id="Sh1RJuYrqoGtl_4VcRud-24" value="User" style="shape=umlActor;verticalLabelPosition=bottom;verticalAlign=top;html=1;outlineConnect=0;" parent="1" vertex="1">
          <mxGeometry x="20" y="60" width="30" height="50" as="geometry" />
        </mxCell>
        <mxCell id="Sh1RJuYrqoGtl_4VcRud-28" value="2) A user runs the iac_deployer in &#39;deploy&#39; mode" style="text;html=1;strokeColor=none;fillColor=none;align=center;verticalAlign=middle;whiteSpace=wrap;rounded=0;" parent="1" vertex="1">
          <mxGeometry x="50" y="130" width="160" height="30" as="geometry" />
        </mxCell>
        <mxCell id="Sh1RJuYrqoGtl_4VcRud-30" value="3) The iac_deployer creates the python virtual environment and installs Ansible inside the environment" style="text;html=1;strokeColor=none;fillColor=none;align=center;verticalAlign=middle;whiteSpace=wrap;rounded=0;" parent="1" vertex="1">
          <mxGeometry x="80" y="380" width="210" height="40" as="geometry" />
        </mxCell>
        <mxCell id="Sh1RJuYrqoGtl_4VcRud-31" value="&lt;font style=&quot;font-size: 14px;&quot;&gt;&lt;b&gt;Scenario (2):&amp;nbsp; A Deployment&lt;/b&gt;&lt;/font&gt;" style="text;html=1;strokeColor=none;fillColor=none;align=center;verticalAlign=middle;whiteSpace=wrap;rounded=0;" parent="1" vertex="1">
          <mxGeometry x="40" y="10" width="200" height="35" as="geometry" />
        </mxCell>
        <mxCell id="Sh1RJuYrqoGtl_4VcRud-32" value="4) The iac_deployer uses Ansible to install all instructions in the specified playbook/s on the a target machine/s using ssh" style="text;html=1;strokeColor=none;fillColor=none;align=center;verticalAlign=middle;whiteSpace=wrap;rounded=0;" parent="1" vertex="1">
          <mxGeometry x="320" y="359" width="150" height="60.5" as="geometry" />
        </mxCell>
        <mxCell id="Sh1RJuYrqoGtl_4VcRud-35" value="Ansible playbooks etc" style="shape=cube;whiteSpace=wrap;html=1;boundedLbl=1;backgroundOutline=1;darkOpacity=0.05;darkOpacity2=0.1;" parent="1" vertex="1">
          <mxGeometry x="280" y="92.5" width="150" height="37.5" as="geometry" />
        </mxCell>
        <mxCell id="Sh1RJuYrqoGtl_4VcRud-37" value="" style="shape=cylinder3;whiteSpace=wrap;html=1;boundedLbl=1;backgroundOutline=1;size=15;opacity=50;" parent="1" vertex="1">
          <mxGeometry x="80" y="289" width="100" height="70" as="geometry" />
        </mxCell>
        <mxCell id="Sh1RJuYrqoGtl_4VcRud-44" value="" style="shape=cube;whiteSpace=wrap;html=1;boundedLbl=1;backgroundOutline=1;darkOpacity=0.05;darkOpacity2=0.1;opacity=50;" parent="1" vertex="1">
          <mxGeometry x="100" y="324.5" width="60" height="30" as="geometry" />
        </mxCell>
        <mxCell id="Sh1RJuYrqoGtl_4VcRud-45" value="" style="shape=cube;whiteSpace=wrap;html=1;boundedLbl=1;backgroundOutline=1;darkOpacity=0.05;darkOpacity2=0.1;opacity=50;" parent="1" vertex="1">
          <mxGeometry x="100" y="309" width="60" height="30" as="geometry" />
        </mxCell>
        <mxCell id="Sh1RJuYrqoGtl_4VcRud-46" value="" style="endArrow=classic;html=1;rounded=0;exitX=0.906;exitY=0.946;exitDx=0;exitDy=0;exitPerimeter=0;" parent="1" source="Sh1RJuYrqoGtl_4VcRud-44" target="Sh1RJuYrqoGtl_4VcRud-6" edge="1">
          <mxGeometry width="50" height="50" relative="1" as="geometry">
            <mxPoint x="320" y="220" as="sourcePoint" />
            <mxPoint x="370" y="170" as="targetPoint" />
          </mxGeometry>
        </mxCell>
        <mxCell id="Sh1RJuYrqoGtl_4VcRud-47" value="" style="endArrow=classic;html=1;rounded=0;entryX=0.25;entryY=1;entryDx=0;entryDy=0;exitX=0.851;exitY=0.954;exitDx=0;exitDy=0;exitPerimeter=0;" parent="1" source="Sh1RJuYrqoGtl_4VcRud-45" target="Sh1RJuYrqoGtl_4VcRud-11" edge="1">
          <mxGeometry width="50" height="50" relative="1" as="geometry">
            <mxPoint x="320" y="280" as="sourcePoint" />
            <mxPoint x="370" y="230" as="targetPoint" />
          </mxGeometry>
        </mxCell>
        <mxCell id="_SSfEg4gcAtUHzoewyVL-2" value="The target machine is typically clean with nothing already installed except an OS and python" style="text;html=1;strokeColor=none;fillColor=none;align=center;verticalAlign=middle;whiteSpace=wrap;rounded=0;" parent="1" vertex="1">
          <mxGeometry x="500" y="389" width="150" height="31" as="geometry" />
        </mxCell>
        <mxCell id="_SSfEg4gcAtUHzoewyVL-5" value="1" style="text;html=1;strokeColor=none;fillColor=none;align=center;verticalAlign=middle;whiteSpace=wrap;rounded=0;" parent="1" vertex="1">
          <mxGeometry x="160" y="324.5" width="60" height="30" as="geometry" />
        </mxCell>
        <mxCell id="_SSfEg4gcAtUHzoewyVL-6" value="n" style="text;html=1;strokeColor=none;fillColor=none;align=center;verticalAlign=middle;whiteSpace=wrap;rounded=0;" parent="1" vertex="1">
          <mxGeometry x="430" y="309" width="60" height="30" as="geometry" />
        </mxCell>
      </root>
    </mxGraphModel>
  </diagram>
</mxfile>
