{
    "ids": [
        0,
        1,
        2,
        3,
        4,
        5,
        6,
        7,
        8,
        9,
        10,
        11,
        12,
        13,
        14,
        15,
        16,
        17,
        18,
        19,
        20,
        21,
        22,
        23,
        24,
        25,
        26,
        27,
        28,
        29,
        30,
        31,
        32,
        33,
        34,
        35,
        36,
        37,
        38,
        39,
        40,
        41,
        42,
        43,
        44,
        45,
        47,
        51,
        52,
        53,
        54,
        55,
        56,
        64,
        91,
        93,
        96,
        98,
        99,
        100,
        101,
        102,
        103,
        104,
        105,
        106,
        108,
        109,
        111,
        112,
        113,
        114,
        118,
        124,
        126,
        130,
        131,
        133,
        138,
        140,
        142,
        144,
        145,
        146,
        152,
        154,
        155,
        158,
        159,
        160,
        161,
        162,
        163,
        164,
        165,
        166,
        167,
        169,
        171,
        172
    ],
    "name": "MID_inner_r2km_aastar",
    "label": "AA* (MID_inner_r2km)",
    "configuration": "ska1mid.cfg",
    "md5_checksum": "d41d8cd98f00b204e9800998ecf8427e"
}