{
  "$schema": "https://arkit.js.org/schema.json",
  "excludePatterns": [
    "test/**",
    "tests/**",
    "**/*.test.*",
    "**/*.spec.*",
    "**/*.cy.*"
  ],
  "components": [
    {
      "type": "Dependency",
      "patterns": ["node_modules/*"]
    },
    {
      "type": "Component",
      "patterns": ["**/*.ts", "**/*.tsx"]
    }
  ],
  "output": [
    {
      "path": "docs/src/_static/img/react_structure_class.svg",
      "groups": [
        {
          "first": true,
          "components": ["Component", "React"]
        },
        {
          "type": "Dependencies",
          "components": ["Dependency"]
        }
      ]
    }
  ]
}
