{
  "ska_mid": {
    "frequency_band": [
      {
        "max_frequency_hz": 1050000000,
        "min_frequency_hz": 350000000,
        "rx_id": "Band_1"
      },
      {
        "max_frequency_hz": 1760000000,
        "min_frequency_hz": 950000000,
        "rx_id": "Band_2"
      },
      {
        "max_frequency_hz": 3050000000,
        "min_frequency_hz": 1650000000,
        "rx_id": "Band_3"
      },
      {
        "max_frequency_hz": 5180000000,
        "min_frequency_hz": 2800000000,
        "rx_id": "Band_4"
      },
      {
        "max_frequency_hz": 8500000000,
        "min_frequency_hz": 4600000000,
        "rx_id": "Band_5a"
      },
      {
        "max_frequency_hz": 15400000000,
        "min_frequency_hz": 8300000000,
        "rx_id": "Band_5b"
      }
    ]
  },
  "ska_low": {
    "frequency_band": {
      "max_frequency_hz": 350000000,
      "min_frequency_hz": 50000000,
      "rx_id": null
    }
  }
}