FC11B
FC0BE
FC067
FC015
FBFC8
FBF80
FBF3D
FBEFF
FBEC6
FBE92
FBE63
FBE39
FBE14
FBDF3
FBDD8
FBDC1
FBDAF
FBDA2
FBD99
FBD96
FBD96
FBD9B
FBDA5
FBDB3
FBDC6
FBDDD
FBDF8
FBE18
FBE3C
FBE64
FBE90
FBEC1
FBEF5
FBF2E
FBF6A
FBFAA
FBFEF
FC037
FC083
FC0D2
FC126
FC17D
FC1D7
FC235
FC297
FC2FC
FC364
FC3D0
FC43F
FC4B1
FC526
FC59E
FC61A
FC698
FC719
FC79D
FC824
FC8AE
FC93B
FC9CA
FCA5B
FCAF0
FCB86
FCC1F
FCCBB
FCD59
FCDF9
FCE9B
FCF3F
FCFE5
FD08E
FD138
FD1E4
FD292
FD342
FD3F4
FD4A7
FD55C
FD612
FD6CA
FD783
FD83E
FD8FA
FD9B7
FDA75
FDB34
FDBF5
FDCB7
FDD79
FDE3C
FDF01
FDFC6
FE08C
FE152
FE219
FE2E1
FE3A9
FE471
FE53A
FE604
FE6CD
FE797
FE861
FE92B
FE9F6
FEAC0
FEB8A
FEC54
FED1E
FEDE8
FEEB2
FEF7B
FF044
FF10C
FF1D4
FF29C
FF363
FF42A
FF4EF
FF5B5
FF679
FF73D
FF800
FF8C2
FF983
FFA43
FFB02
FFBC0
FFC7D
FFD39
FFDF4
FFEAE
FFF66
0001D
000D3
00187
0023A
002EC
0039C
0044A
004F8
005A3
0064D
006F5
0079C
00841
008E4
00985
00A25
00AC3
00B5F
00BF9
00C91
00D27
00DBB
00E4D
00EDE
00F6C
00FF8
01082
0110A
01190
01214
01295
01315
01392
0140D
01485
014FC
01570
015E2
01652
016BF
0172A
01793
017F9
0185D
018BF
0191E
0197B
019D5
01A2D
01A83
01AD6
01B27
01B75
01BC1
01C0B
01C52
01C96
01CD9
01D18
01D56
01D90
01DC9
01DFF
01E32
01E64
01E92
01EBF
01EE8
01F10
01F35
01F58
01F78
01F96
01FB1
01FCA
01FE1
01FF5
02007
02017
02024
02030
02038
0203F
02043
02045
02045
02042
0203E
02037
0202E
02022
02015
02006
01FF4
01FE0
01FCB
01FB3
01F99
01F7D
01F5F
01F3F
01F1E
01EFA
01ED4
01EAD
01E84
01E59
01E2C
01DFD
01DCC
01D9A
01D66
01D31
01CF9
01CC1
01C86
01C4A
01C0C
01BCD
01B8C
01B4A
01B07
01AC2
