FC11B
FC17D
FC1E4
FC250
FC2C2
FC339
FC3B5
FC436
FC4BD
FC549
FC5DB
FC672
FC70E
FC7B0
FC857
FC904
FC9B6
FCA6E
FCB2B
FCBEE
FCCB6
FCD84
FCE57
FCF2F
FD00D
FD0F1
FD1DA
FD2C9
FD3BD
FD4B7
FD5B6
FD6BB
FD7C5
FD8D5
FD9EA
FDB04
FDC24
FDD4A
FDE75
FDFA5
FE0DB
FE216
FE357
FE49C
FE5E8
FE738
FE88E
FE9E9
FEB49
FECAF
FEE19
FEF89
FF0FE
FF278
FF3F7
FF57C
FF705
FF893
FFA26
FFBBE
FFD5B
FFEFD
000A4
0024F
003FF
005B4
0076D
0092B
00AEE
00CB5
00E80
01050
01224
013FD
015D9
017BA
0199F
01B89
01D76
01F67
0215C
02355
02552
02753
02957
02B5F
02D6B
02F7A
0318C
033A2
035BB
037D7
039F7
03C1A
03E3F
04068
04294
044C2
046F3
04927
04B5E
04D97
04FD2
05210
05450
05693
058D8
05B1E
05D67
05FB2
061FE
0644C
0669C
068EE
06B41
06D95
06FEB
07242
0749B
076F4
0794E
07BAA
07E06
08063
082C0
0851F
0877D
089DC
08C3C
08E9C
090FB
0935B
095BB
0981B
09A7A
09CDA
09F38
0A197
0A3F4
0A652
0A8AE
0AB09
0AD64
0AFBE
0B216
0B46D
0B6C3
0B918
0BB6B
0BDBC
0C00C
0C25A
0C4A6
0C6F1
0C939
0CB7F
0CDC3
0D005
0D244
0D481
0D6BB
0D8F3
0DB27
0DD5A
0DF89
0E1B5
0E3DE
0E604
0E826
0EA45
0EC61
0EE79
0F08E
0F29F
0F4AC
0F6B5
0F8BB
0FABC
0FCB9
0FEB2
100A7
10298
10484
1066B
1084E
10A2C
10C06
10DDA
10FAA
11175
1133B
114FB
116B7
1186D
11A1E
11BC9
11D6F
11F10
120AA
1223F
123CF
12558
126DC
1285A
129D1
12B43
12CAF
12E14
12F73
130CC
1321E
1336A
134B0
135EF
13727
13859
13984
13AA9
13BC7
13CDD
13DED
13EF6
13FF8
140F4
141E8
142D5
143BA
14499
14571
14641
1470A
147CB
14886
14939
149E4
14A89
14B25
14BBA
14C48
14CCE
14D4D
14DC4
14E34
14E9C
14EFC
14F54
14FA5
14FEF
15030
1506A
1509C
150C7
150EA
15105
15118
15124
