{
  "table_0": [
    221054065,
    4294905163,
    2609314694,
    4294965647,
    4076995668,
    1831713,
    493518186,
    74174,
    4236051540,
    4127899,
    441416271,
    167927,
    355927153,
    2233685,
    4262288909,
    92045,
    3771008098,
    1171683,
    4005580480,
    45694,
    427557984,
    1776026,
    37118518,
    72038
  ],
  "table_1": [
    221054065,
    4294905163,
    2587818558,
    4294965655,
    4077716564,
    1831723,
    1461958435,
    74168,
    4237689940,
    4127924,
    2633825532,
    167924,
    356779121,
    2233699,
    1169139119,
    92055,
    3771466850,
    1171690,
    307196495,
    45695,
    428213344,
    1776037,
    977640005,
    72039
  ]
}
