    {
      "current_status": "Created",
      "eb_ref": "eb-mvp01-20220923-00001",
      "eb_version": 1,
      "metadata": {
        "created_by": "DefaultUser",
        "created_on": "2024-04-14T11:51:16.367278+05:30",
        "last_modified_by": "DefaultUser",
        "last_modified_on": "2024-04-14T11:51:16.367278+05:30"
      },
      "previous_status": "Created"
    }
  