// Jest Snapshot v1, https://goo.gl/fbAQLP

exports[`PublicationForm should render 1`] = `
<PublicationForm
  classes={
    Object {
      "captcha": "PublicationForm-captcha-3",
      "dialog": "PublicationForm-dialog-1",
      "exitBtn": "PublicationForm-exitBtn-5",
      "hr": "PublicationForm-hr-6",
      "msg": "PublicationForm-msg-4",
      "textField": "PublicationForm-textField-2",
    }
  }
  endPublication={[MockFunction]}
  error={false}
  isDone={false}
  onClick={[MockFunction]}
  open={false}
/>
`;
