{
  "cells": {
    "": {
      "": {
        "0:0:0:0": [
          {
            "flags": [],
            "intValue": -154.582,
            "value": "-154.582",
            "sideProps": { "coordinates": "0:0:0:0" }
          }
        ],
        "0:0:0:1": [
          {
            "flags": [],
            "intValue": 10149.461,
            "value": "10 149.461",
            "sideProps": { "coordinates": "0:0:0:1" }
          }
        ],
        "0:0:0:2": [
          {
            "flags": [],
            "intValue": -10142.834,
            "value": "-10 142.834",
            "sideProps": { "coordinates": "0:0:0:2" }
          }
        ],
        "1:1:1:0": [
          {
            "flags": [],
            "intValue": 150.457,
            "value": "150.457",
            "sideProps": { "coordinates": "1:1:1:0" }
          }
        ],
        "1:1:1:1": [
          {
            "flags": [],
            "intValue": 155.441,
            "value": "155.441",
            "sideProps": { "coordinates": "1:1:1:1" }
          }
        ],
        "1:1:1:2": [
          {
            "flags": [],
            "intValue": 144.316,
            "value": "144.316"
          }
        ],
        "1:0:0:0": [
          {
            "flags": [],
            "intValue": 2540.814,
            "value": "2,540.814"
          }
        ],
        "1:0:0:1": [
          {
            "flags": [],
            "intValue": 2596.175,
            "value": "2,596.175"
          }
        ],
        "1:0:0:2": [
          {
            "flags": [],
            "intValue": 2665.386,
            "value": "2,665.386"
          }
        ],
        "1:1:0:0": [
          {
            "flags": [],
            "intValue": 2385.87,
            "value": "2,385.87"
          }
        ],
        "1:1:0:1": [
          {
            "flags": [],
            "intValue": 2464.911,
            "value": "2,464.911"
          }
        ],
        "1:1:0:2": [
          {
            "flags": [],
            "intValue": 2288.491,
            "value": "2,288.491"
          }
        ],
        "0:0:1:0": [
          {
            "flags": [],
            "intValue": 70.751,
            "value": "70.751"
          }
        ],
        "0:0:1:1": [
          {
            "flags": [],
            "intValue": 68.407,
            "value": "68.407"
          }
        ],
        "0:0:1:2": [
          {
            "flags": [],
            "intValue": 65.374,
            "value": "65.374"
          }
        ],
        "0:1:1:0": [
          {
            "flags": [],
            "intValue": 18.804,
            "value": "18.804"
          }
        ],
        "0:1:1:1": [
          {
            "flags": [],
            "intValue": 18.223,
            "value": "18.223"
          }
        ],
        "0:1:1:2": [
          {
            "flags": [],
            "intValue": 17.25,
            "value": "17.25"
          }
        ],
        "0:1:0:0": [
          {
            "flags": [],
            "intValue": 13.858,
            "value": "13.858"
          }
        ],
        "0:1:0:1": [
          {
            "flags": [],
            "intValue": 13.43,
            "value": "13.43"
          }
        ],
        "0:1:0:2": [
          {
            "flags": [],
            "intValue": 12.713,
            "value": "12.713"
          }
        ],
        "1:0:1:0": [
          {
            "flags": [],
            "intValue": 156.768,
            "value": "156.768"
          }
        ],
        "1:0:1:1": [
          {
            "flags": [],
            "intValue": 160.184,
            "value": "160.184"
          }
        ],
        "1:0:1:2": [
          {
            "flags": [],
            "intValue": 164.454,
            "value": "164.454"
          }
        ]
      }
    }
  },
  "headerData": [
    {
      "data": [],
      "key": "",
      "flags": []
    }
  ],
  "sectionsData": [
    [
      {
        "data": [],
        "key": "",
        "flags": []
      },
      [
        {
          "data": [
            {
              "dimension": {
                "label": "Country",
                "flags": []
              },
              "value": {
                "label": "Australia",
                "flags": []
              }
            },
            {
              "dimension": {
                "label": "Pollutant",
                "flags": []
              },
              "value": {
                "label": "Sulphur Oxides",
                "flags": []
              }
            },
            {
              "dimension": {
                "label": "Variable",
                "flags": []
              },
              "value": {
                "label": "Total man-made emissions",
                "flags": []
              }
            },
            {
              "dimension": {
                "label": "Year",
                "flags": []
              },
              "value": {
                "label": "2015",
                "flags": [],
                "parents": []
              }
            }
          ],
          "key": "1:1:0:0",
          "flags": []
        },
        {
          "data": [
            {
              "dimension": {
                "label": "Country",
                "flags": []
              },
              "value": {
                "label": "Australia",
                "flags": []
              }
            },
            {
              "dimension": {
                "label": "Pollutant",
                "flags": []
              },
              "value": {
                "label": "Sulphur Oxides",
                "flags": []
              }
            },
            {
              "dimension": {
                "label": "Variable",
                "flags": []
              },
              "value": {
                "label": "Total man-made emissions",
                "flags": []
              }
            },
            {
              "dimension": {
                "label": "Year",
                "flags": []
              },
              "value": {
                "label": "2016",
                "flags": [],
                "parents": []
              }
            }
          ],
          "key": "1:1:0:1",
          "flags": []
        },
        {
          "data": [
            {
              "dimension": {
                "label": "Country",
                "flags": []
              },
              "value": {
                "label": "Australia",
                "flags": []
              }
            },
            {
              "dimension": {
                "label": "Pollutant",
                "flags": []
              },
              "value": {
                "label": "Sulphur Oxides",
                "flags": []
              }
            },
            {
              "dimension": {
                "label": "Variable",
                "flags": []
              },
              "value": {
                "label": "Total man-made emissions",
                "flags": []
              }
            },
            {
              "dimension": {
                "label": "Year",
                "flags": []
              },
              "value": {
                "label": "2017",
                "flags": [],
                "parents": []
              }
            }
          ],
          "key": "1:1:0:2",
          "flags": []
        },
        {
          "data": [
            {
              "dimension": {
                "label": "Country",
                "flags": []
              },
              "value": {
                "label": "Australia",
                "flags": []
              }
            },
            {
              "dimension": {
                "label": "Pollutant",
                "flags": []
              },
              "value": {
                "label": "Sulphur Oxides",
                "flags": []
              }
            },
            {
              "dimension": {
                "label": "Variable",
                "flags": []
              },
              "value": {
                "label": "Total emissions, Index 1990 = 100",
                "flags": []
              }
            },
            {
              "dimension": {
                "label": "Year",
                "flags": []
              },
              "value": {
                "label": "2015",
                "flags": [],
                "parents": []
              }
            }
          ],
          "key": "1:1:1:0",
          "flags": []
        },
        {
          "data": [
            {
              "dimension": {
                "label": "Country",
                "flags": []
              },
              "value": {
                "label": "Australia",
                "flags": []
              }
            },
            {
              "dimension": {
                "label": "Pollutant",
                "flags": []
              },
              "value": {
                "label": "Sulphur Oxides",
                "flags": []
              }
            },
            {
              "dimension": {
                "label": "Variable",
                "flags": []
              },
              "value": {
                "label": "Total emissions, Index 1990 = 100",
                "flags": []
              }
            },
            {
              "dimension": {
                "label": "Year",
                "flags": []
              },
              "value": {
                "label": "2016",
                "flags": [],
                "parents": []
              }
            }
          ],
          "key": "1:1:1:1",
          "flags": []
        },
        {
          "data": [
            {
              "dimension": {
                "label": "Country",
                "flags": []
              },
              "value": {
                "label": "Australia",
                "flags": []
              }
            },
            {
              "dimension": {
                "label": "Pollutant",
                "flags": []
              },
              "value": {
                "label": "Sulphur Oxides",
                "flags": []
              }
            },
            {
              "dimension": {
                "label": "Variable",
                "flags": []
              },
              "value": {
                "label": "Total emissions, Index 1990 = 100",
                "flags": []
              }
            },
            {
              "dimension": {
                "label": "Year",
                "flags": []
              },
              "value": {
                "label": "2017",
                "flags": [],
                "parents": []
              }
            }
          ],
          "key": "1:1:1:2",
          "flags": []
        },
        {
          "data": [
            {
              "dimension": {
                "label": "Country",
                "flags": []
              },
              "value": {
                "label": "Australia",
                "flags": []
              }
            },
            {
              "dimension": {
                "label": "Pollutant",
                "flags": []
              },
              "value": {
                "label": "Nitrogen Oxides",
                "flags": []
              }
            },
            {
              "dimension": {
                "label": "Variable",
                "flags": []
              },
              "value": {
                "label": "Total man-made emissions",
                "flags": []
              }
            },
            {
              "dimension": {
                "label": "Year",
                "flags": []
              },
              "value": {
                "label": "2015",
                "flags": [],
                "parents": []
              }
            }
          ],
          "key": "1:0:0:0",
          "flags": []
        },
        {
          "data": [
            {
              "dimension": {
                "label": "Country",
                "flags": []
              },
              "value": {
                "label": "Australia",
                "flags": []
              }
            },
            {
              "dimension": {
                "label": "Pollutant",
                "flags": []
              },
              "value": {
                "label": "Nitrogen Oxides",
                "flags": []
              }
            },
            {
              "dimension": {
                "label": "Variable",
                "flags": []
              },
              "value": {
                "label": "Total man-made emissions",
                "flags": []
              }
            },
            {
              "dimension": {
                "label": "Year",
                "flags": []
              },
              "value": {
                "label": "2016",
                "flags": [],
                "parents": []
              }
            }
          ],
          "key": "1:0:0:1",
          "flags": []
        },
        {
          "data": [
            {
              "dimension": {
                "label": "Country",
                "flags": []
              },
              "value": {
                "label": "Australia",
                "flags": []
              }
            },
            {
              "dimension": {
                "label": "Pollutant",
                "flags": []
              },
              "value": {
                "label": "Nitrogen Oxides",
                "flags": []
              }
            },
            {
              "dimension": {
                "label": "Variable",
                "flags": []
              },
              "value": {
                "label": "Total man-made emissions",
                "flags": []
              }
            },
            {
              "dimension": {
                "label": "Year",
                "flags": []
              },
              "value": {
                "label": "2017",
                "flags": [],
                "parents": []
              }
            }
          ],
          "key": "1:0:0:2",
          "flags": []
        },
        {
          "data": [
            {
              "dimension": {
                "label": "Country",
                "flags": []
              },
              "value": {
                "label": "Australia",
                "flags": []
              }
            },
            {
              "dimension": {
                "label": "Pollutant",
                "flags": []
              },
              "value": {
                "label": "Nitrogen Oxides",
                "flags": []
              }
            },
            {
              "dimension": {
                "label": "Variable",
                "flags": []
              },
              "value": {
                "label": "Total emissions, Index 1990 = 100",
                "flags": []
              }
            },
            {
              "dimension": {
                "label": "Year",
                "flags": []
              },
              "value": {
                "label": "2015",
                "flags": [],
                "parents": []
              }
            }
          ],
          "key": "1:0:1:0",
          "flags": []
        },
        {
          "data": [
            {
              "dimension": {
                "label": "Country",
                "flags": []
              },
              "value": {
                "label": "Australia",
                "flags": []
              }
            },
            {
              "dimension": {
                "label": "Pollutant",
                "flags": []
              },
              "value": {
                "label": "Nitrogen Oxides",
                "flags": []
              }
            },
            {
              "dimension": {
                "label": "Variable",
                "flags": []
              },
              "value": {
                "label": "Total emissions, Index 1990 = 100",
                "flags": []
              }
            },
            {
              "dimension": {
                "label": "Year",
                "flags": []
              },
              "value": {
                "label": "2016",
                "flags": [],
                "parents": []
              }
            }
          ],
          "key": "1:0:1:1",
          "flags": []
        },
        {
          "data": [
            {
              "dimension": {
                "label": "Country",
                "flags": []
              },
              "value": {
                "label": "Australia",
                "flags": []
              }
            },
            {
              "dimension": {
                "label": "Pollutant",
                "flags": []
              },
              "value": {
                "label": "Nitrogen Oxides",
                "flags": []
              }
            },
            {
              "dimension": {
                "label": "Variable",
                "flags": []
              },
              "value": {
                "label": "Total emissions, Index 1990 = 100",
                "flags": []
              }
            },
            {
              "dimension": {
                "label": "Year",
                "flags": []
              },
              "value": {
                "label": "2017",
                "flags": [],
                "parents": []
              }
            }
          ],
          "key": "1:0:1:2",
          "flags": []
        },
        {
          "data": [
            {
              "dimension": {
                "label": "Country",
                "flags": []
              },
              "value": {
                "label": "Austria",
                "flags": []
              }
            },
            {
              "dimension": {
                "label": "Pollutant",
                "flags": []
              },
              "value": {
                "label": "Sulphur Oxides",
                "flags": []
              }
            },
            {
              "dimension": {
                "label": "Variable",
                "flags": []
              },
              "value": {
                "label": "Total man-made emissions",
                "flags": []
              }
            },
            {
              "dimension": {
                "label": "Year",
                "flags": []
              },
              "value": {
                "label": "2015",
                "flags": [],
                "parents": []
              }
            }
          ],
          "key": "0:1:0:0",
          "flags": []
        },
        {
          "data": [
            {
              "dimension": {
                "label": "Country",
                "flags": []
              },
              "value": {
                "label": "Austria",
                "flags": []
              }
            },
            {
              "dimension": {
                "label": "Pollutant",
                "flags": []
              },
              "value": {
                "label": "Sulphur Oxides",
                "flags": []
              }
            },
            {
              "dimension": {
                "label": "Variable",
                "flags": []
              },
              "value": {
                "label": "Total man-made emissions",
                "flags": []
              }
            },
            {
              "dimension": {
                "label": "Year",
                "flags": []
              },
              "value": {
                "label": "2016",
                "flags": [],
                "parents": []
              }
            }
          ],
          "key": "0:1:0:1",
          "flags": []
        },
        {
          "data": [
            {
              "dimension": {
                "label": "Country",
                "flags": []
              },
              "value": {
                "label": "Austria",
                "flags": []
              }
            },
            {
              "dimension": {
                "label": "Pollutant",
                "flags": []
              },
              "value": {
                "label": "Sulphur Oxides",
                "flags": []
              }
            },
            {
              "dimension": {
                "label": "Variable",
                "flags": []
              },
              "value": {
                "label": "Total man-made emissions",
                "flags": []
              }
            },
            {
              "dimension": {
                "label": "Year",
                "flags": []
              },
              "value": {
                "label": "2017",
                "flags": [],
                "parents": []
              }
            }
          ],
          "key": "0:1:0:2",
          "flags": []
        },
        {
          "data": [
            {
              "dimension": {
                "label": "Country",
                "flags": []
              },
              "value": {
                "label": "Austria",
                "flags": []
              }
            },
            {
              "dimension": {
                "label": "Pollutant",
                "flags": []
              },
              "value": {
                "label": "Sulphur Oxides",
                "flags": []
              }
            },
            {
              "dimension": {
                "label": "Variable",
                "flags": []
              },
              "value": {
                "label": "Total emissions, Index 1990 = 100",
                "flags": []
              }
            },
            {
              "dimension": {
                "label": "Year",
                "flags": []
              },
              "value": {
                "label": "2015",
                "flags": [],
                "parents": []
              }
            }
          ],
          "key": "0:1:1:0",
          "flags": []
        },
        {
          "data": [
            {
              "dimension": {
                "label": "Country",
                "flags": []
              },
              "value": {
                "label": "Austria",
                "flags": []
              }
            },
            {
              "dimension": {
                "label": "Pollutant",
                "flags": []
              },
              "value": {
                "label": "Sulphur Oxides",
                "flags": []
              }
            },
            {
              "dimension": {
                "label": "Variable",
                "flags": []
              },
              "value": {
                "label": "Total emissions, Index 1990 = 100",
                "flags": []
              }
            },
            {
              "dimension": {
                "label": "Year",
                "flags": []
              },
              "value": {
                "label": "2016",
                "flags": [],
                "parents": []
              }
            }
          ],
          "key": "0:1:1:1",
          "flags": []
        },
        {
          "data": [
            {
              "dimension": {
                "label": "Country",
                "flags": []
              },
              "value": {
                "label": "Austria",
                "flags": []
              }
            },
            {
              "dimension": {
                "label": "Pollutant",
                "flags": []
              },
              "value": {
                "label": "Sulphur Oxides",
                "flags": []
              }
            },
            {
              "dimension": {
                "label": "Variable",
                "flags": []
              },
              "value": {
                "label": "Total emissions, Index 1990 = 100",
                "flags": []
              }
            },
            {
              "dimension": {
                "label": "Year",
                "flags": []
              },
              "value": {
                "label": "2017",
                "flags": [],
                "parents": []
              }
            }
          ],
          "key": "0:1:1:2",
          "flags": []
        },
        {
          "data": [
            {
              "dimension": {
                "label": "Country",
                "flags": []
              },
              "value": {
                "label": "Austria",
                "flags": []
              }
            },
            {
              "dimension": {
                "label": "Pollutant",
                "flags": []
              },
              "value": {
                "label": "Nitrogen Oxides",
                "flags": []
              }
            },
            {
              "dimension": {
                "label": "Variable",
                "flags": []
              },
              "value": {
                "label": "Total man-made emissions",
                "flags": []
              }
            },
            {
              "dimension": {
                "label": "Year",
                "flags": []
              },
              "value": {
                "label": "2015",
                "flags": [],
                "parents": []
              }
            }
          ],
          "key": "0:0:0:0",
          "flags": []
        },
        {
          "data": [
            {
              "dimension": {
                "label": "Country",
                "flags": []
              },
              "value": {
                "label": "Austria",
                "flags": []
              }
            },
            {
              "dimension": {
                "label": "Pollutant",
                "flags": []
              },
              "value": {
                "label": "Nitrogen Oxides",
                "flags": []
              }
            },
            {
              "dimension": {
                "label": "Variable",
                "flags": []
              },
              "value": {
                "label": "Total man-made emissions",
                "flags": []
              }
            },
            {
              "dimension": {
                "label": "Year",
                "flags": []
              },
              "value": {
                "label": "2016",
                "flags": [],
                "parents": []
              }
            }
          ],
          "key": "0:0:0:1",
          "flags": []
        },
        {
          "data": [
            {
              "dimension": {
                "label": "Country",
                "flags": []
              },
              "value": {
                "label": "Austria",
                "flags": []
              }
            },
            {
              "dimension": {
                "label": "Pollutant",
                "flags": []
              },
              "value": {
                "label": "Nitrogen Oxides",
                "flags": []
              }
            },
            {
              "dimension": {
                "label": "Variable",
                "flags": []
              },
              "value": {
                "label": "Total man-made emissions",
                "flags": []
              }
            },
            {
              "dimension": {
                "label": "Year",
                "flags": []
              },
              "value": {
                "label": "2017",
                "flags": [],
                "parents": []
              }
            }
          ],
          "key": "0:0:0:2",
          "flags": []
        },
        {
          "data": [
            {
              "dimension": {
                "label": "Country",
                "flags": []
              },
              "value": {
                "label": "Austria",
                "flags": []
              }
            },
            {
              "dimension": {
                "label": "Pollutant",
                "flags": []
              },
              "value": {
                "label": "Nitrogen Oxides",
                "flags": []
              }
            },
            {
              "dimension": {
                "label": "Variable",
                "flags": []
              },
              "value": {
                "label": "Total emissions, Index 1990 = 100",
                "flags": []
              }
            },
            {
              "dimension": {
                "label": "Year",
                "flags": []
              },
              "value": {
                "label": "2015",
                "flags": [],
                "parents": []
              }
            }
          ],
          "key": "0:0:1:0",
          "flags": []
        },
        {
          "data": [
            {
              "dimension": {
                "label": "Country",
                "flags": []
              },
              "value": {
                "label": "Austria",
                "flags": []
              }
            },
            {
              "dimension": {
                "label": "Pollutant",
                "flags": []
              },
              "value": {
                "label": "Nitrogen Oxides",
                "flags": []
              }
            },
            {
              "dimension": {
                "label": "Variable",
                "flags": []
              },
              "value": {
                "label": "Total emissions, Index 1990 = 100",
                "flags": []
              }
            },
            {
              "dimension": {
                "label": "Year",
                "flags": []
              },
              "value": {
                "label": "2016",
                "flags": [],
                "parents": []
              }
            }
          ],
          "key": "0:0:1:1",
          "flags": []
        },
        {
          "data": [
            {
              "dimension": {
                "label": "Country",
                "flags": []
              },
              "value": {
                "label": "Austria",
                "flags": []
              }
            },
            {
              "dimension": {
                "label": "Pollutant",
                "flags": []
              },
              "value": {
                "label": "Nitrogen Oxides",
                "flags": []
              }
            },
            {
              "dimension": {
                "label": "Variable",
                "flags": []
              },
              "value": {
                "label": "Total emissions, Index 1990 = 100",
                "flags": []
              }
            },
            {
              "dimension": {
                "label": "Year",
                "flags": []
              },
              "value": {
                "label": "2017",
                "flags": [],
                "parents": []
              }
            }
          ],
          "key": "0:0:1:2",
          "flags": []
        }
      ]
    ]
  ]
}
