{
  "cells": {
    "0": {
      "0": {
        "0": [
          {
            "flags": [
              {
                "label": "<ul><li>Regulation covers three of the areas listed</li><li>A maximum blood alcohol content (BAC) at 0.05 g or less per 100 ml (or breath alcohol equivalent)</li><li>Drink drive legislation sets a lower BAC for young drivers, compared with older drivers</li><li>Random blood/breath alcohol testing is in place</li></ul>"
              },
              {
                "code": "y",
                "label": "Observation status: Provisional value"
              },
              {
                "label": "<ul><li>Regulation covers three of the areas listed</li><li>A maximum blood alcohol content (BAC) at 0.05 g or less per 100 ml (or breath alcohol equivalent)</li><li>Drink drive legislation sets a lower BAC for young drivers, compared with older drivers</li><li>Random blood/breath alcohol testing is in place</li></ul>"
              }
            ],
            "intValue": 1967466,
            "value": "1967466"
          }
        ],
        "1": [
          {
            "flags": [
              {
                "label": "<ul><li>Regulation covers three of the areas listed</li><li>A maximum blood alcohol content (BAC) at 0.05 g or less per 100 ml (or breath alcohol equivalent)</li><li>Drink drive legislation sets a lower BAC for young drivers, compared with older drivers</li><li>Random blood/breath alcohol testing is in place</li></ul>"
              },
              {
                "code": "P",
                "label": "Observation status: Provisional value"
              }
            ],
            "intValue": 35299,
            "value": "35299"
          }
        ]
      },
      "1": {
        "0": [
          {
            "flags": [
              {
                "label": "<ul><li>Regulation covers three of the areas listed</li><li>A maximum blood alcohol content (BAC) at 0.05 g or less per 100 ml (or breath alcohol equivalent)</li><li>Drink drive legislation sets a lower BAC for young drivers, compared with older drivers</li><li>Random blood/breath alcohol testing is in place</li></ul>"
              },
              {
                "code": "P",
                "label": "Observation status: Provisional value"
              }
            ],
            "intValue": 373301.6,
            "value": "373302"
          }
        ],
        "1": [
          {
            "flags": [
              {
                "label": "<ul><li>Regulation covers three of the areas listed</li><li>A maximum blood alcohol content (BAC) at 0.05 g or less per 100 ml (or breath alcohol equivalent)</li><li>Drink drive legislation sets a lower BAC for young drivers, compared with older drivers</li><li>Random blood/breath alcohol testing is in place</li></ul>"
              },
              {
                "code": "P",
                "label": "Observation status: Provisional value"
              }
            ],
            "intValue": 2860.3,
            "value": "2860"
          }
        ]
      }
    },
    "1": {
      "0": {
        "0": [
          {
            "flags": [
              {
                "label": "<ul><li>Regulation covers three of the areas listed</li><li>A maximum blood alcohol content (BAC) at 0.05 g or less per 100 ml (or breath alcohol equivalent)</li><li>Drink drive legislation sets a lower BAC for young drivers, compared with older drivers</li><li>Random blood/breath alcohol testing is in place</li></ul>"
              },
              {
                "code": "P",
                "label": "Observation status: Provisional value"
              }
            ],
            "intValue": 1996790,
            "value": "1996790"
          }
        ],
        "1": [
          {
            "flags": [
              {
                "label": "<ul><li>Regulation covers three of the areas listed</li><li>A maximum blood alcohol content (BAC) at 0.05 g or less per 100 ml (or breath alcohol equivalent)</li><li>Drink drive legislation sets a lower BAC for young drivers, compared with older drivers</li><li>Random blood/breath alcohol testing is in place</li></ul>"
              },
              {
                "code": "P",
                "label": "Observation status: Provisional value"
              }
            ],
            "intValue": 32107,
            "value": "32107"
          }
        ]
      },
      "1": {
        "0": [
          {
            "flags": [
              {
                "label": "<ul><li>Regulation covers three of the areas listed</li><li>A maximum blood alcohol content (BAC) at 0.05 g or less per 100 ml (or breath alcohol equivalent)</li><li>Drink drive legislation sets a lower BAC for young drivers, compared with older drivers</li><li>Random blood/breath alcohol testing is in place</li></ul>"
              },
              {
                "code": "P",
                "label": "Observation status: Provisional value"
              }
            ],
            "intValue": 384171,
            "value": "384171"
          }
        ],
        "1": [
          {
            "flags": [
              {
                "label": "<ul><li>Regulation covers three of the areas listed</li><li>A maximum blood alcohol content (BAC) at 0.05 g or less per 100 ml (or breath alcohol equivalent)</li><li>Drink drive legislation sets a lower BAC for young drivers, compared with older drivers</li><li>Random blood/breath alcohol testing is in place</li></ul>"
              },
              {
                "code": "P",
                "label": "Observation status: Provisional value"
              }
            ],
            "intValue": 2713.4,
            "value": "2713"
          }
        ]
      }
    },
    "2": {
      "0": {
        "0": [
          {
            "flags": [
              {
                "label": "<ul><li>Regulation covers three of the areas listed</li><li>A maximum blood alcohol content (BAC) at 0.05 g or less per 100 ml (or breath alcohol equivalent)</li><li>Drink drive legislation sets a lower BAC for young drivers, compared with older drivers</li><li>Random blood/breath alcohol testing is in place</li></ul>"
              },
              {
                "code": "P",
                "label": "Observation status: Provisional value"
              }
            ],
            "intValue": 2043997,
            "value": "2043997"
          }
        ],
        "1": [
          {
            "flags": [
              {
                "label": "<ul><li>Regulation covers three of the areas listed</li><li>A maximum blood alcohol content (BAC) at 0.05 g or less per 100 ml (or breath alcohol equivalent)</li><li>Drink drive legislation sets a lower BAC for young drivers, compared with older drivers</li><li>Random blood/breath alcohol testing is in place</li></ul>"
              },
              {
                "code": "P",
                "label": "Observation status: Provisional value"
              }
            ],
            "intValue": 35614,
            "value": "35614"
          }
        ]
      },
      "1": {
        "0": [
          {
            "flags": [
              {
                "label": "<ul><li>Regulation covers three of the areas listed</li><li>A maximum blood alcohol content (BAC) at 0.05 g or less per 100 ml (or breath alcohol equivalent)</li><li>Drink drive legislation sets a lower BAC for young drivers, compared with older drivers</li><li>Random blood/breath alcohol testing is in place</li></ul>"
              },
              {
                "code": "P",
                "label": "Observation status: Provisional value"
              }
            ],
            "intValue": 398134.3,
            "value": "398134"
          }
        ],
        "1": [
          {
            "flags": [
              {
                "label": "<ul><li>Regulation covers three of the areas listed</li><li>A maximum blood alcohol content (BAC) at 0.05 g or less per 100 ml (or breath alcohol equivalent)</li><li>Drink drive legislation sets a lower BAC for young drivers, compared with older drivers</li><li>Random blood/breath alcohol testing is in place</li></ul>"
              },
              {
                "code": "P",
                "label": "Observation status: Provisional value"
              }
            ],
            "intValue": 2843.6,
            "value": "2844"
          }
        ]
      }
    }
  },
  "headerData": [
    {
      "data": [
        {
          "dimension": {
            "label": "Time period",
            "flags": [
              {
                "label": "<ul><li>Regulation covers three of the areas listed</li><li>A maximum blood alcohol content (BAC) at 0.05 g or less per 100 ml (or breath alcohol equivalent)</li><li>Drink drive legislation sets a lower BAC for young drivers, compared with older drivers</li><li>Random blood/breath alcohol testing is in place</li></ul>"
              },
              {
                "code": "P",
                "label": "Observation status: Provisional value"
              }
            ]
          },
          "value": {
            "id": "0",
            "label": "2015",
            "flags": [
              {
                "label": "<ul><li>Regulation covers three of the areas listed</li><li>A maximum blood alcohol content (BAC) at 0.05 g or less per 100 ml (or breath alcohol equivalent)</li><li>Drink drive legislation sets a lower BAC for young drivers, compared with older drivers</li><li>Random blood/breath alcohol testing is in place</li></ul>"
              },
              {
                "code": "P",
                "label": "Observation status: Provisional value"
              }
            ]
          }
        }
      ],
      "key": "0",
      "flags": [
        {
                "label": "<ul><li>Regulation covers three of the areas listed</li><li>A maximum blood alcohol content (BAC) at 0.05 g or less per 100 ml (or breath alcohol equivalent)</li><li>Drink drive legislation sets a lower BAC for young drivers, compared with older drivers</li><li>Random blood/breath alcohol testing is in place</li></ul>"
              },
        {
          "code": "P",
          "label": "Observation status: Provisional value"
        }
      ]
    },
    {
      "data": [
        {
          "dimension": {
            "label": "Time period",
            "flags": [
              {
                "label": "<ul><li>Regulation covers three of the areas listed</li><li>A maximum blood alcohol content (BAC) at 0.05 g or less per 100 ml (or breath alcohol equivalent)</li><li>Drink drive legislation sets a lower BAC for young drivers, compared with older drivers</li><li>Random blood/breath alcohol testing is in place</li></ul>"
              },
              {
                "code": "P",
                "label": "Observation status: Provisional value"
              }
            ]
          },
          "value": {
            "id": "1",
            "label": "2016",
            "flags": [
              {
                "label": "<ul><li>Regulation covers three of the areas listed</li><li>A maximum blood alcohol content (BAC) at 0.05 g or less per 100 ml (or breath alcohol equivalent)</li><li>Drink drive legislation sets a lower BAC for young drivers, compared with older drivers</li><li>Random blood/breath alcohol testing is in place</li></ul>"
              },
              {
                "code": "P",
                "label": "Observation status: Provisional value"
              }
            ]
          }
        }
      ],
      "key": "1",
      "flags": [
        {
                "label": "<ul><li>Regulation covers three of the areas listed</li><li>A maximum blood alcohol content (BAC) at 0.05 g or less per 100 ml (or breath alcohol equivalent)</li><li>Drink drive legislation sets a lower BAC for young drivers, compared with older drivers</li><li>Random blood/breath alcohol testing is in place</li></ul>"
              },
        {
          "code": "P",
          "label": "Observation status: Provisional value"
        }
      ]
    },
    {
      "data": [
        {
          "dimension": {
            "label": "Time period",
            "flags": [
              {
                "label": "<ul><li>Regulation covers three of the areas listed</li><li>A maximum blood alcohol content (BAC) at 0.05 g or less per 100 ml (or breath alcohol equivalent)</li><li>Drink drive legislation sets a lower BAC for young drivers, compared with older drivers</li><li>Random blood/breath alcohol testing is in place</li></ul>"
              },
              {
                "code": "P",
                "label": "Observation status: Provisional value"
              }
            ]
          },
          "value": {
            "id": "2",
            "label": "2017",
            "flags": [
              {
                "label": "<ul><li>Regulation covers three of the areas listed</li><li>A maximum blood alcohol content (BAC) at 0.05 g or less per 100 ml (or breath alcohol equivalent)</li><li>Drink drive legislation sets a lower BAC for young drivers, compared with older drivers</li><li>Random blood/breath alcohol testing is in place</li></ul>"
              },
              {
                "code": "P",
                "label": "Observation status: Provisional value"
              }
            ]
          }
        }
      ],
      "key": "2",
      "flags": [
        {
                "label": "<ul><li>Regulation covers three of the areas listed</li><li>A maximum blood alcohol content (BAC) at 0.05 g or less per 100 ml (or breath alcohol equivalent)</li><li>Drink drive legislation sets a lower BAC for young drivers, compared with older drivers</li><li>Random blood/breath alcohol testing is in place</li></ul>"
              },
        {
          "code": "P",
          "label": "Observation status: Provisional value"
        }
      ]
    }
  ],
  "sectionsData": [
    [
      {
        "data": [
          {
            "dimension": {
              "label": "Reference area",
              "flags": [
                {
                "label": "<ul><li>Regulation covers three of the areas listed</li><li>A maximum blood alcohol content (BAC) at 0.05 g or less per 100 ml (or breath alcohol equivalent)</li><li>Drink drive legislation sets a lower BAC for young drivers, compared with older drivers</li><li>Random blood/breath alcohol testing is in place</li></ul>"
              },
                {
                  "code": "P",
                  "label": "Observation status: Provisional value"
                }
              ]
            },
            "value": {
              "label": "Belgium",
              "flags": [
                {
                "label": "<ul><li>Regulation covers three of the areas listed</li><li>A maximum blood alcohol content (BAC) at 0.05 g or less per 100 ml (or breath alcohol equivalent)</li><li>Drink drive legislation sets a lower BAC for young drivers, compared with older drivers</li><li>Random blood/breath alcohol testing is in place</li></ul>"
              },
                {
                  "code": "P",
                  "label": "Observation status: Provisional value"
                }
              ]
            }
          }
        ],
        "key": "1",
        "flags": [
          {
                "label": "<ul><li>Regulation covers three of the areas listed</li><li>A maximum blood alcohol content (BAC) at 0.05 g or less per 100 ml (or breath alcohol equivalent)</li><li>Drink drive legislation sets a lower BAC for young drivers, compared with older drivers</li><li>Random blood/breath alcohol testing is in place</li></ul>"
              },
          {
            "code": "P",
            "label": "Observation status: Provisional value"
          }
        ]
      },
      [
        {
          "data": [
            {
              "dimension": {
                "label": "Activity classification",
                "flags": [
                  {
                "label": "<ul><li>Regulation covers three of the areas listed</li><li>A maximum blood alcohol content (BAC) at 0.05 g or less per 100 ml (or breath alcohol equivalent)</li><li>Drink drive legislation sets a lower BAC for young drivers, compared with older drivers</li><li>Random blood/breath alcohol testing is in place</li></ul>"
              },
                  {
                    "code": "P",
                    "label": "Observation status: Provisional value"
                  }
                ]
              },
              "value": {
                "label": "Total - All activities",
                "flags": [
                  {
                "label": "<ul><li>Regulation covers three of the areas listed</li><li>A maximum blood alcohol content (BAC) at 0.05 g or less per 100 ml (or breath alcohol equivalent)</li><li>Drink drive legislation sets a lower BAC for young drivers, compared with older drivers</li><li>Random blood/breath alcohol testing is in place</li></ul>"
              },
                  {
                    "code": "P",
                    "label": "Observation status: Provisional value"
                  }
                ],
                "parents": []
              }
            },
            {
              "dimension": {
                "label": "Units of Measure",
                "flags": [
                  {
                "label": "<ul><li>Regulation covers three of the areas listed</li><li>A maximum blood alcohol content (BAC) at 0.05 g or less per 100 ml (or breath alcohol equivalent)</li><li>Drink drive legislation sets a lower BAC for young drivers, compared with older drivers</li><li>Random blood/breath alcohol testing is in place</li></ul>"
              },
                  {
                    "code": "P",
                    "label": "Observation status: Provisional value"
                  }
                ]
              },
              "value": {
                "label": "Millions",
                "flags": [
                  {
                "label": "<ul><li>Regulation covers three of the areas listed</li><li>A maximum blood alcohol content (BAC) at 0.05 g or less per 100 ml (or breath alcohol equivalent)</li><li>Drink drive legislation sets a lower BAC for young drivers, compared with older drivers</li><li>Random blood/breath alcohol testing is in place</li></ul>"
              },
                  {
                    "code": "P",
                    "label": "Observation status: Provisional value"
                  }
                ],
                "unitsLabel": "Millions"
              }
            }
          ],
          "key": "0",
          "flags": [
            {
                "label": "<ul><li>Regulation covers three of the areas listed</li><li>A maximum blood alcohol content (BAC) at 0.05 g or less per 100 ml (or breath alcohol equivalent)</li><li>Drink drive legislation sets a lower BAC for young drivers, compared with older drivers</li><li>Random blood/breath alcohol testing is in place</li></ul>"
              },
            {
              "label":
                "Table identifier: Table 0101 - Gross value added at basic prices and gross domestic product at market prices"
            }
          ]
        },
        {
          "data": [
            {
              "dimension": {
                "label": "Activity classification",
                "flags": [
                  {
                "label": "<ul><li>Regulation covers three of the areas listed</li><li>A maximum blood alcohol content (BAC) at 0.05 g or less per 100 ml (or breath alcohol equivalent)</li><li>Drink drive legislation sets a lower BAC for young drivers, compared with older drivers</li><li>Random blood/breath alcohol testing is in place</li></ul>"
              },
                  {
                    "code": "P",
                    "label": "Observation status: Provisional value"
                  }
                ]
              },
              "value": {
                "label": "Agriculture, forestry and fishing",
                "flags": [
                  {
                "label": "<ul><li>Regulation covers three of the areas listed</li><li>A maximum blood alcohol content (BAC) at 0.05 g or less per 100 ml (or breath alcohol equivalent)</li><li>Drink drive legislation sets a lower BAC for young drivers, compared with older drivers</li><li>Random blood/breath alcohol testing is in place</li></ul>"
              },
                  {
                    "code": "P",
                    "label": "Observation status: Provisional value"
                  }
                ],
                "parents": []
              }
            },
            {
              "dimension": {
                "label": "Units of Measure",
                "flags": [
                  {
                "label": "<ul><li>Regulation covers three of the areas listed</li><li>A maximum blood alcohol content (BAC) at 0.05 g or less per 100 ml (or breath alcohol equivalent)</li><li>Drink drive legislation sets a lower BAC for young drivers, compared with older drivers</li><li>Random blood/breath alcohol testing is in place</li></ul>"
              },
                  {
                    "code": "P",
                    "label": "Observation status: Provisional value"
                  }
                ]
              },
              "value": {
                "label": "Millions",
                "flags": [
                  {
                "label": "<ul><li>Regulation covers three of the areas listed</li><li>A maximum blood alcohol content (BAC) at 0.05 g or less per 100 ml (or breath alcohol equivalent)</li><li>Drink drive legislation sets a lower BAC for young drivers, compared with older drivers</li><li>Random blood/breath alcohol testing is in place</li></ul>"
              },
                  {
                    "code": "P",
                    "label": "Observation status: Provisional value"
                  }
                ],
                "unitsLabel": "Millions"
              }
            }
          ],
          "key": "1",
          "flags": [
            {
                "label": "<ul><li>Regulation covers three of the areas listed</li><li>A maximum blood alcohol content (BAC) at 0.05 g or less per 100 ml (or breath alcohol equivalent)</li><li>Drink drive legislation sets a lower BAC for young drivers, compared with older drivers</li><li>Random blood/breath alcohol testing is in place</li></ul>"
              },
            {
              "label":
                "Table identifier: Table 0101 - Gross value added at basic prices and gross domestic product at market prices"
            }
          ]
        }
      ]
    ],
    [
      {
        "data": [
          {
            "dimension": {
              "label": "Reference area",
              "flags": [
                {
                "label": "<ul><li>Regulation covers three of the areas listed</li><li>A maximum blood alcohol content (BAC) at 0.05 g or less per 100 ml (or breath alcohol equivalent)</li><li>Drink drive legislation sets a lower BAC for young drivers, compared with older drivers</li><li>Random blood/breath alcohol testing is in place</li></ul>"
              },
                {
                  "code": "P",
                  "label": "Observation status: Provisional value"
                }
              ]
            },
            "value": {
              "label": "France",
              "flags": [
                {
                "label": "<ul><li>Regulation covers three of the areas listed</li><li>A maximum blood alcohol content (BAC) at 0.05 g or less per 100 ml (or breath alcohol equivalent)</li><li>Drink drive legislation sets a lower BAC for young drivers, compared with older drivers</li><li>Random blood/breath alcohol testing is in place</li></ul>"
              },
                {
                  "code": "P",
                  "label": "Observation status: Provisional value"
                }
              ]
            }
          }
        ],
        "key": "0",
        "flags": [
          {
                "label": "<ul><li>Regulation covers three of the areas listed</li><li>A maximum blood alcohol content (BAC) at 0.05 g or less per 100 ml (or breath alcohol equivalent)</li><li>Drink drive legislation sets a lower BAC for young drivers, compared with older drivers</li><li>Random blood/breath alcohol testing is in place</li></ul>"
              },
          {
            "code": "P",
            "label": "Observation status: Provisional value"
          }
        ]
      },
      [
        {
          "data": [
            {
              "dimension": {
                "label": "Activity classification",
                "flags": [
                  {
                "label": "<ul><li>Regulation covers three of the areas listed</li><li>A maximum blood alcohol content (BAC) at 0.05 g or less per 100 ml (or breath alcohol equivalent)</li><li>Drink drive legislation sets a lower BAC for young drivers, compared with older drivers</li><li>Random blood/breath alcohol testing is in place</li></ul>"
              },
                  {
                    "code": "P",
                    "label": "Observation status: Provisional value"
                  }
                ]
              },
              "value": {
                "label": "Total - All activities",
                "flags": [
                  {
                "label": "<ul><li>Regulation covers three of the areas listed</li><li>A maximum blood alcohol content (BAC) at 0.05 g or less per 100 ml (or breath alcohol equivalent)</li><li>Drink drive legislation sets a lower BAC for young drivers, compared with older drivers</li><li>Random blood/breath alcohol testing is in place</li></ul>"
              },
                  {
                    "code": "P",
                    "label": "Observation status: Provisional value"
                  }
                ],
                "parents": []
              }
            },
            {
              "dimension": {
                "label": "Units of Measure",
                "flags": [
                  {
                "label": "<ul><li>Regulation covers three of the areas listed</li><li>A maximum blood alcohol content (BAC) at 0.05 g or less per 100 ml (or breath alcohol equivalent)</li><li>Drink drive legislation sets a lower BAC for young drivers, compared with older drivers</li><li>Random blood/breath alcohol testing is in place</li></ul>"
              },
                  {
                    "code": "P",
                    "label": "Observation status: Provisional value"
                  }
                ]
              },
              "value": {
                "label": "Millions",
                "flags": [
                  {
                "label": "<ul><li>Regulation covers three of the areas listed</li><li>A maximum blood alcohol content (BAC) at 0.05 g or less per 100 ml (or breath alcohol equivalent)</li><li>Drink drive legislation sets a lower BAC for young drivers, compared with older drivers</li><li>Random blood/breath alcohol testing is in place</li></ul>"
              },
                  {
                    "code": "P",
                    "label": "Observation status: Provisional value"
                  }
                ],
                "unitsLabel": "Millions"
              }
            }
          ],
          "key": "0",
          "flags": [
            {
                "label": "<ul><li>Regulation covers three of the areas listed</li><li>A maximum blood alcohol content (BAC) at 0.05 g or less per 100 ml (or breath alcohol equivalent)</li><li>Drink drive legislation sets a lower BAC for young drivers, compared with older drivers</li><li>Random blood/breath alcohol testing is in place</li></ul>"
              },
            {
              "label":
                "Table identifier: Table 0101 - Gross value added at basic prices and gross domestic product at market prices"
            }
          ]
        },
        {
          "data": [
            {
              "dimension": {
                "label": "Activity classification",
                "flags": [
                  {
                "label": "<ul><li>Regulation covers three of the areas listed</li><li>A maximum blood alcohol content (BAC) at 0.05 g or less per 100 ml (or breath alcohol equivalent)</li><li>Drink drive legislation sets a lower BAC for young drivers, compared with older drivers</li><li>Random blood/breath alcohol testing is in place</li></ul>"
              },
                  {
                    "code": "P",
                    "label": "Observation status: Provisional value"
                  }
                ]
              },
              "value": {
                "label": "Agriculture, forestry and fishing",
                "flags": [
                  {
                "label": "<ul><li>Regulation covers three of the areas listed</li><li>A maximum blood alcohol content (BAC) at 0.05 g or less per 100 ml (or breath alcohol equivalent)</li><li>Drink drive legislation sets a lower BAC for young drivers, compared with older drivers</li><li>Random blood/breath alcohol testing is in place</li></ul>"
              },
                  {
                    "code": "P",
                    "label": "Observation status: Provisional value"
                  }
                ],
                "parents": []
              }
            },
            {
              "dimension": {
                "label": "Units of Measure",
                "flags": [
                  {
                "label": "<ul><li>Regulation covers three of the areas listed</li><li>A maximum blood alcohol content (BAC) at 0.05 g or less per 100 ml (or breath alcohol equivalent)</li><li>Drink drive legislation sets a lower BAC for young drivers, compared with older drivers</li><li>Random blood/breath alcohol testing is in place</li></ul>"
              },
                  {
                    "code": "P",
                    "label": "Observation status: Provisional value"
                  }
                ]
              },
              "value": {
                "label": "Millions",
                "flags": [
                  {
                "label": "<ul><li>Regulation covers three of the areas listed</li><li>A maximum blood alcohol content (BAC) at 0.05 g or less per 100 ml (or breath alcohol equivalent)</li><li>Drink drive legislation sets a lower BAC for young drivers, compared with older drivers</li><li>Random blood/breath alcohol testing is in place</li></ul>"
              },
                  {
                    "code": "P",
                    "label": "Observation status: Provisional value"
                  }
                ],
                "unitsLabel": "Millions"
              }
            }
          ],
          "key": "1",
          "flags": [
            {
                "label": "<ul><li>Regulation covers three of the areas listed</li><li>A maximum blood alcohol content (BAC) at 0.05 g or less per 100 ml (or breath alcohol equivalent)</li><li>Drink drive legislation sets a lower BAC for young drivers, compared with older drivers</li><li>Random blood/breath alcohol testing is in place</li></ul>"
              },
            {
              "label":
                "Table identifier: Table 0101 - Gross value added at basic prices and gross domestic product at market prices"
            }
          ]
        }
      ]
    ]
  ]
}
