// Jest Snapshot v1, https://goo.gl/fbAQLP

exports[`NoData component should render 1`] = `
<div
  class="makeStyles-root-1"
>
  <div
    class="makeStyles-circularProgress-2 makeStyles-primaryColor-5"
  />
  <h6
    class="MuiTypography-root MuiTypography-subtitle1 MuiTypography-alignCenter MuiTypography-noWrap css-hj73b5-MuiTypography-root"
  />
</div>
`;
