STRUCTURE,STRUCTURE_ID,ACTION,PO_LOCATION,PO_SUBJECT,FREQ,TIME_PERIOD,COMMENT,REF_META_NUMERIC
dataflow,OECD.SDD.SDPS:PO_REFMETADATA3(1.0),M,~,~,~,~,(Dataset level) This is the comment at dataflow level,10
dataflow,OECD.SDD.SDPS:PO_REFMETADATA3(1.0),M,FRA,~,~,~,(Dimension level) This is the comment metadata value for FRA,20
dataflow,OECD.SDD.SDPS:PO_REFMETADATA3(1.0),M,DEU,~,~,~,(Dimension level)This is the comment metadata value for DEU,this is an incorrect value
dataflow,OECD.SDD.SDPS:PO_REFMETADATA3(1.0),M,DEU,S1,~,~,(2 Dimensions level)This is the comment metadata value for DEU.S1,50
dataflow,OECD.SDD.SDPS:PO_REFMETADATA3(1.0),M,DEU,S1,A,~,(Series level) This is the comment metadata value for DEU.S1.A,60
dataflow,OECD.SDD.SDPS:PO_REFMETADATA3(1.0),M,DEU,S1,A,2000,(Observation level) This is the comment metadata value for DEU.S1.A.2000,kk
dataflow,OECD.SDD.SDPS:PO_REFMETADATA3(1.0),M,~,~,A,~,(Dimension level) This is the comment metadata value for A,
dataflow,OECD.SDD.SDPS:PO_REFMETADATA3(1.0),M,~,S1,~,~,(Dimension level) This is the comment metadata value for S1,
dataflow,OECD.SDD.SDPS:PO_REFMETADATA3(1.0),M,~,S2,~,~,"en:""english comment"",fr:""Commentaire français""",
