DATAFLOW,REF_AREA,MEASURE,UNIT_MEASURE,INST_TYPE_EDU,EDUCATION_LEV,PERS_TYPE,OBS_VALUE,OBS_STATUS,UNIT_MULT,STATISTICAL_OPERATION,REF_PERIOD,DECIMALS
OECD.SDD.SDPS:DSD_EAG_WT@DF_EAG_WT_ACT_TCH(1.0),ARG,WKT_ACT_TCH,H_Y,INST_EDU_PUB,ISCED11_02,TE,,L,1,OBS,2020,0
OECD.SDD.SDPS:DSD_EAG_WT@DF_EAG_WT_ACT_TCH(1.0),ARG,WKT_ACT_TCH,H_Y,INST_EDU_PUB,ISCED11_1,TE,,L,1,OBS,2020,0
OECD.SDD.SDPS:DSD_EAG_WT@DF_EAG_WT_ACT_TCH(1.0),ARG,WKT_ACT_TCH,H_Y,INST_EDU_PUB,ISCED11_24,TE,,L,1,OBS,2020,0
OECD.SDD.SDPS:DSD_EAG_WT@DF_EAG_WT_ACT_TCH(1.0),ARG,WKT_ACT_TCH,H_Y,INST_EDU_PUB,ISCED11_25,TE,,L,1,OBS,2020,0
OECD.SDD.SDPS:DSD_EAG_WT@DF_EAG_WT_ACT_TCH(1.0),ARG,WKT_ACT_TCH,H_Y,INST_EDU_PUB,ISCED11_34,TE,,L,1,OBS,2020,0
OECD.SDD.SDPS:DSD_EAG_WT@DF_EAG_WT_ACT_TCH(1.0),ARG,WKT_ACT_TCH,H_Y,INST_EDU_PUB,ISCED11_35,TE,,L,1,OBS,2020,0
OECD.SDD.SDPS:DSD_EAG_WT@DF_EAG_WT_ACT_TCH(1.0),AUS,WKT_ACT_TCH,H_Y,INST_EDU_PUB,ISCED11_02,TE,892.06252,A,1,OBS,2020,0
OECD.SDD.SDPS:DSD_EAG_WT@DF_EAG_WT_ACT_TCH(1.0),AUS,WKT_ACT_TCH,H_Y,INST_EDU_PUB,ISCED11_1,TE,882.31218,A,1,OBS,2020,0
OECD.SDD.SDPS:DSD_EAG_WT@DF_EAG_WT_ACT_TCH(1.0),AUS,WKT_ACT_TCH,H_Y,INST_EDU_PUB,ISCED11_24,TE,832.10661,A,1,OBS,2020,0
OECD.SDD.SDPS:DSD_EAG_WT@DF_EAG_WT_ACT_TCH(1.0),AUS,WKT_ACT_TCH,H_Y,INST_EDU_PUB,ISCED11_25,TE,,O,1,OBS,2020,0
OECD.SDD.SDPS:DSD_EAG_WT@DF_EAG_WT_ACT_TCH(1.0),AUS,WKT_ACT_TCH,H_Y,INST_EDU_PUB,ISCED11_34,TE,832.33326,A,1,OBS,2020,0
