[
	{"time": "11:00:00.0000000",	"method": "GET",	"url": "/rest/availableconstraint/OECD.DCD.FSD,DSD_CRS@DF_CRS_CPA,1.1/...11.......?endPeriod=2006-05&mode=exact&startPeriod=1998-08",	"headers":{"Accept": "application/vnd.sdmx.structure+json;version=1.0;urn=true"},	"type": "availableconstraint"},
	{"time": "11:00:02.0000000",	"method": "GET",	"url": "/rest/availableconstraint/OECD.DCD.FSD,DSD_CRS@DF_CRS,1.3/...14+13+13+14+100.......?endPeriod=2020-07&mode=exact&startPeriod=1976-06",	"headers":{"Accept": "application/vnd.sdmx.structure+json;version=1.0;urn=true"},	"type": "availableconstraint"},
	{"time": "11:00:02.0000000",	"method": "GET",	"url": "/rest/availableconstraint/OECD.DCD.FSD,DSD_OTHMRKR@DF_OTHERMARKERS,1.3?endPeriod=1993-04&mode=exact&startPeriod=1979-12",	"headers":{"Accept": "application/vnd.sdmx.structure+json;version=1.0;urn=true"},	"type": "availableconstraint"},
	{"time": "11:00:02.0000000",	"method": "GET",	"url": "/rest/availableconstraint/OECD.DCD.FSD,DSD_GNDR@DF_GENDER,1.3/..........?endPeriod=1991-07&mode=exact&startPeriod=1974-05",	"headers":{"Accept": "application/vnd.sdmx.structure+json;version=1.0;urn=true"},	"type": "availableconstraint"},
	{"time": "11:00:02.0000000",	"method": "GET",	"url": "/rest/availableconstraint/OECD.DCD.FSD,DSD_GNDR@DF_GENDER,1.3?endPeriod=1991-07&mode=exact&startPeriod=1974-05",	"headers":{"Accept": "application/vnd.sdmx.structure+json;version=1.0;urn=true"},	"type": "availableconstraint"},
	{"time": "11:00:05.0000000",	"method": "GET",	"url": "/rest/availableconstraint/OECD.DCD.FSD,DSD_OTHMRKR@DF_OTHERMARKERS,1.3/..........?endPeriod=1993-04&mode=exact&startPeriod=1979-12",	"headers":{"Accept": "application/vnd.sdmx.structure+json;version=1.0;urn=true"},	"type": "availableconstraint"},
	{"time": "11:00:05.0000000",	"method": "GET",	"url": "/rest/availableconstraint/OECD.SDD.SDPS,DSD_DD_HCL@DF_DD_HCL_TEST,1.0?endPeriod=2024-10&mode=exact&startPeriod=2023-12",	"headers":{"Accept": "application/vnd.sdmx.structure+json;version=1.0;urn=true"},	"type": "availableconstraint"},
	{"time": "11:00:05.0000000",	"method": "GET",	"url": "/rest/availableconstraint/OECD.DCD.FSD,DSD_CRS@DF_CRS_CPA,1.1?endPeriod=2003-08&mode=exact&startPeriod=2003-11",	"headers":{"Accept": "application/vnd.sdmx.structure+json;version=1.0;urn=true"},	"type": "availableconstraint"},
	{"time": "11:00:06.0000000",	"method": "GET",	"url": "/rest/availableconstraint/OECD.SDD.SDPS,DSD_DD_HCL@DF_DD_HCL_TEST,1.0/....A_F_HTU+A_F_HTU...?endPeriod=2024-10&mode=exact&startPeriod=2023-12",	"headers":{"Accept": "application/vnd.sdmx.structure+json;version=1.0;urn=true"},	"type": "availableconstraint"},
	{"time": "11:00:06.0000000",	"method": "GET",	"url": "/rest/availableconstraint/OECD.SDD.SDPS,DSD_DD_HCL@DF_DD_HCL_TEST,1.0?endPeriod=2013-09&mode=exact&startPeriod=2005-06",	"headers":{"Accept": "application/vnd.sdmx.structure+json;version=1.0;urn=true"},	"type": "availableconstraint"},
	{"time": "11:00:06.0000000",	"method": "GET",	"url": "/rest/availableconstraint/OECD.SDD.SDPS,DF_TEST_MEI,1.0/...?endPeriod=1975-09&mode=exact&startPeriod=1972-04",	"headers":{"Accept": "application/vnd.sdmx.structure+json;version=1.0;urn=true"},	"type": "availableconstraint"},
	{"time": "11:00:07.0000000",	"method": "GET",	"url": "/rest/availableconstraint/OECD.SDD.SDPS,DSD_DD_HCL@DF_DD_HCL_TEST,1.0/AUS.......?endPeriod=2013-09&mode=exact&startPeriod=2005-06",	"headers":{"Accept": "application/vnd.sdmx.structure+json;version=1.0;urn=true"},	"type": "availableconstraint"},
	{"time": "11:00:07.0000000",	"method": "GET",	"url": "/rest/availableconstraint/OECD.SDD.SDPS,DF_TEST_MEI,1.0/...?endPeriod=2006-03&mode=exact&startPeriod=2002-01",	"headers":{"Accept": "application/vnd.sdmx.structure+json;version=1.0;urn=true"},	"type": "availableconstraint"}
]

