[
  {
    "requestId": 6,
    "action": "Import",
    "userEmail": "sandrinesouflis@gmail.com",
    "artefact": "TN1:MILLED_RICE(1.1)",
    "sourceDataspace": null,
    "destinationDataspace": "qa:reset",
    "sourceData": "TN1-MILLED_RICE-1.1-data.csv",
    "submissionTime": "2022-07-04T15:36:19.463",
    "executionStart": "2022-07-04T15:36:19.813",
    "executionEnd": "2022-07-04T15:36:21.067",
    "executionStatus": "Completed",
    "outcome": "Success",
    "logs": [
      {
        "id": 6,
        "userEmail": null,
        "date": "2022-07-04T15:36:19.43",
        "level": "NOTICE",
        "server": "transfer-689669cb74-cm2jg",
        "logger": "DotStatServices.Transfer.Controllers.ImportController+<Import>d__22`1.MoveNext",
        "message": "The request with ID 6 was successfully registered.",
        "exception": ""
      },
      {
        "id": 6,
        "userEmail": null,
        "date": "2022-07-04T15:36:20.033",
        "level": "NOTICE",
        "server": "transfer-689669cb74-cm2jg",
        "logger": "DotStat.Transfer.Consumer.SqlConsumer+<SaveData>d__14.MoveNext",
        "message": "Processing... Reading & validating data",
        "exception": ""
      },
      {
        "id": 6,
        "userEmail": null,
        "date": "2022-07-04T15:36:20.06",
        "level": "NOTICE",
        "server": "transfer-689669cb74-cm2jg",
        "logger": "DotStat.Db.Repository.SqlServer.SqlDataStoreRepository+<BulkInsertData>d__1.MoveNext",
        "message": "Reading the data source successfully finished. 162 row(s) was/were read from the data source.",
        "exception": ""
      },
      {
        "id": 6,
        "userEmail": null,
        "date": "2022-07-04T15:36:20.063",
        "level": "NOTICE",
        "server": "transfer-689669cb74-cm2jg",
        "logger": "DotStat.Transfer.Consumer.SqlConsumer+<SaveData>d__14.MoveNext",
        "message": "Processing... Writing data",
        "exception": ""
      },
      {
        "id": 6,
        "userEmail": null,
        "date": "2022-07-04T15:36:20.193",
        "level": "NOTICE",
        "server": "transfer-689669cb74-cm2jg",
        "logger": "DotStat.Transfer.Consumer.SqlConsumer+<SaveData>d__14.MoveNext",
        "message": "A total of 162 observation(s) has been processed.",
        "exception": ""
      },
      {
        "id": 6,
        "userEmail": null,
        "date": "2022-07-04T15:36:20.197",
        "level": "NOTICE",
        "server": "transfer-689669cb74-cm2jg",
        "logger": "DotStat.Transfer.Consumer.SqlConsumer+<Save>d__10.MoveNext",
        "message": "Processing... Calculating the new data availability",
        "exception": ""
      },
      {
        "id": 6,
        "userEmail": null,
        "date": "2022-07-04T15:36:21.073",
        "level": "NOTICE",
        "server": "transfer-689669cb74-cm2jg",
        "logger": "DotStat.Db.Service.DotStatDbService+<CloseTransaction>d__7.MoveNext",
        "message": "The request was successfully processed.",
        "exception": ""
      },
      {
        "id": 6,
        "userEmail": null,
        "date": "2022-07-04T15:36:21.077",
        "level": "NOTICE",
        "server": "transfer-689669cb74-cm2jg",
        "logger": "DotStat.Transfer.Manager.FileTransferManager`1+<Transfer>d__1.MoveNext",
        "message": "Streaming data from the source finished.",
        "exception": ""
      }
    ],
    "lastUpdated": "2022-07-04T15:36:21.067"
  },
  {
    "requestId": 7,
    "action": "CleanupMappingSets",
    "userEmail": "sandrinesouflis@gmail.com",
    "artefact": "TN2:MILLED_RICE(1.1)",
    "sourceDataspace": null,
    "destinationDataspace": "qa:reset",
    "sourceData": null,
    "submissionTime": "2022-07-04T15:43:18.823",
    "executionStart": "2022-07-04T15:43:18.847",
    "executionEnd": "2022-07-04T15:43:19.613",
    "executionStatus": "Completed",
    "outcome": "Success",
    "logs": [
      {
        "id": 7,
        "userEmail": null,
        "date": "2022-07-04T15:43:18.813",
        "level": "NOTICE",
        "server": "transfer-689669cb74-cm2jg",
        "logger": "DotStat.Transfer.Manager.CommonManager.GetDataflow",
        "message": "The structure information of dataflow TN1:MILLED_RICE(1.1) was successfully loaded from dataspace qa:reset.",
        "exception": ""
      }
    ],
    "lastUpdated": "2022-07-04T15:43:19.613"
  },
  {
    "requestId": 8,
    "action": "CleanupMappingSets",
    "userEmail": "sandrinesouflis@gmail.com",
    "artefact": "LUA1:MILLED_RICE(1.1)",
    "sourceDataspace": null,
    "destinationDataspace": "qa:reset",
    "sourceData": null,
    "submissionTime": "2022-07-04T15:43:44.92",
    "executionStart": "2022-07-04T15:43:44.933",
    "executionEnd": "2022-07-04T15:43:45.28",
    "executionStatus": "Completed",
    "outcome": "Success",
    "logs": [
      {
        "id": 8,
        "userEmail": null,
        "date": "2022-07-04T15:43:44.897",
        "level": "NOTICE",
        "server": "transfer-689669cb74-cm2jg",
        "logger": "DotStat.Transfer.Manager.CommonManager.GetDataflow",
        "message": "The structure information of dataflow TN1:MILLED_RICE(1.1) was successfully loaded from dataspace qa:reset.",
        "exception": ""
      }
    ],
    "lastUpdated": "2022-07-04T15:43:45.28"
  },
  {
    "requestId": 9,
    "action": "CleanupDsd",
    "userEmail": "sandrinesouflis@gmail.com",
    "artefact": "TN1:MILLED_OAT(1.1)",
    "sourceDataspace": null,
    "destinationDataspace": "qa:reset",
    "sourceData": null,
    "submissionTime": "2022-07-04T15:43:46.4",
    "executionStart": "2022-07-04T15:43:46.41",
    "executionEnd": "2022-07-04T15:43:46.66",
    "executionStatus": "Completed",
    "outcome": "None",
    "logs": [],
    "lastUpdated": "2022-07-04T15:43:46.66"
  },
  {
    "requestId": 10,
    "action": "Import",
    "userEmail": "sandrinesouflis@gmail.com",
    "artefact": "TN1:MILLED_RICE(1.1)",
    "sourceDataspace": null,
    "destinationDataspace": "qa:reset",
    "sourceData": "TN1-MILLED_RICE-1.1-metadata.csv",
    "submissionTime": "2022-07-04T15:50:03.37",
    "executionStart": "2022-07-04T15:50:03.407",
    "executionEnd": "2022-07-04T15:50:05.363",
    "executionStatus": "Completed",
    "outcome": "Success",
    "logs": [
      {
        "id": 10,
        "userEmail": null,
        "date": "2022-07-04T15:50:03.367",
        "level": "NOTICE",
        "server": "transfer-689669cb74-cm2jg",
        "logger": "DotStatServices.Transfer.Controllers.ImportController+<Import>d__22`1.MoveNext",
        "message": "The request with ID 10 was successfully registered.",
        "exception": ""
      },
      {
        "id": 10,
        "userEmail": null,
        "date": "2022-07-04T15:50:03.6",
        "level": "NOTICE",
        "server": "transfer-689669cb74-cm2jg",
        "logger": "DotStat.Db.Service.DotStatDbService+<VerifyAndUpdateDsdMsd>d__29.MoveNext",
        "message": "Referential metadata defined by the metadata structure TN1:MSD_MILLED_RICE(1.0) are being accepted for the underlying data structure TN1:MILLED_RICE(1.1).",
        "exception": ""
      },
      {
        "id": 10,
        "userEmail": null,
        "date": "2022-07-04T15:50:03.777",
        "level": "NOTICE",
        "server": "transfer-689669cb74-cm2jg",
        "logger": "DotStat.Transfer.Consumer.SqlConsumer+<SaveMetadata>d__13.MoveNext",
        "message": "Processing... Reading & validating referential metadata",
        "exception": ""
      },
      {
        "id": 10,
        "userEmail": null,
        "date": "2022-07-04T15:50:03.837",
        "level": "NOTICE",
        "server": "transfer-689669cb74-cm2jg",
        "logger": "DotStat.Db.Repository.SqlServer.SqlMetadataStoreRepository+<BulkInsertMetadata>d__1.MoveNext",
        "message": "Reading the referential metadata source successfully finished. 9 row(s) was/were read from the source.",
        "exception": ""
      },
      {
        "id": 10,
        "userEmail": null,
        "date": "2022-07-04T15:50:03.84",
        "level": "NOTICE",
        "server": "transfer-689669cb74-cm2jg",
        "logger": "DotStat.Transfer.Consumer.SqlConsumer+<SaveMetadata>d__13.MoveNext",
        "message": "Processing... Writing referential metadata",
        "exception": ""
      },
      {
        "id": 10,
        "userEmail": null,
        "date": "2022-07-04T15:50:03.91",
        "level": "NOTICE",
        "server": "transfer-689669cb74-cm2jg",
        "logger": "DotStat.Transfer.Consumer.SqlConsumer+<SaveMetadata>d__13.MoveNext",
        "message": "A total of 9 referential metadata key(s) has been processed.",
        "exception": ""
      },
      {
        "id": 10,
        "userEmail": null,
        "date": "2022-07-04T15:50:03.913",
        "level": "NOTICE",
        "server": "transfer-689669cb74-cm2jg",
        "logger": "DotStat.Transfer.Consumer.SqlConsumer+<Save>d__10.MoveNext",
        "message": "Processing... Calculating the new data availability",
        "exception": ""
      },
      {
        "id": 10,
        "userEmail": null,
        "date": "2022-07-04T15:50:05.37",
        "level": "NOTICE",
        "server": "transfer-689669cb74-cm2jg",
        "logger": "DotStat.Db.Service.DotStatDbService+<CloseTransaction>d__7.MoveNext",
        "message": "The request was successfully processed.",
        "exception": ""
      },
      {
        "id": 10,
        "userEmail": null,
        "date": "2022-07-04T15:50:05.373",
        "level": "NOTICE",
        "server": "transfer-689669cb74-cm2jg",
        "logger": "DotStat.Transfer.Manager.FileTransferManager`1+<Transfer>d__1.MoveNext",
        "message": "Streaming data from the source finished.",
        "exception": ""
      }
    ],
    "lastUpdated": "2022-07-04T15:50:05.363"
  },
  {
    "requestId": 11,
    "action": "Import",
    "userEmail": "sandrinesouflis@gmail.com",
    "artefact": "TN1:MILLED_RICE(1.1)",
    "sourceDataspace": null,
    "destinationDataspace": "qa:reset",
    "sourceData": "TN1-MILLED_RICE-1.1-data.csv",
    "submissionTime": "2022-07-04T15:51:35.443",
    "executionStart": "2022-07-04T15:51:35.483",
    "executionEnd": "2022-07-04T15:51:36.773",
    "executionStatus": "Completed",
    "outcome": "Success",
    "logs": [
      {
        "id": 11,
        "userEmail": null,
        "date": "2022-07-04T15:51:35.407",
        "level": "NOTICE",
        "server": "transfer-689669cb74-cm2jg",
        "logger": "DotStatServices.Transfer.Controllers.ImportController+<Import>d__22`1.MoveNext",
        "message": "The request with ID 11 was successfully registered.",
        "exception": ""
      },
      {
        "id": 11,
        "userEmail": null,
        "date": "2022-07-04T15:51:35.587",
        "level": "NOTICE",
        "server": "transfer-689669cb74-cm2jg",
        "logger": "DotStat.Transfer.Consumer.SqlConsumer+<SaveData>d__14.MoveNext",
        "message": "Processing... Reading & validating data",
        "exception": ""
      },
      {
        "id": 11,
        "userEmail": null,
        "date": "2022-07-04T15:51:35.627",
        "level": "NOTICE",
        "server": "transfer-689669cb74-cm2jg",
        "logger": "DotStat.Db.Repository.SqlServer.SqlDataStoreRepository+<BulkInsertData>d__1.MoveNext",
        "message": "Reading the data source successfully finished. 162 row(s) was/were read from the data source.",
        "exception": ""
      },
      {
        "id": 11,
        "userEmail": null,
        "date": "2022-07-04T15:51:35.63",
        "level": "NOTICE",
        "server": "transfer-689669cb74-cm2jg",
        "logger": "DotStat.Transfer.Consumer.SqlConsumer+<SaveData>d__14.MoveNext",
        "message": "Processing... Writing data",
        "exception": ""
      },
      {
        "id": 11,
        "userEmail": null,
        "date": "2022-07-04T15:51:35.747",
        "level": "NOTICE",
        "server": "transfer-689669cb74-cm2jg",
        "logger": "DotStat.Transfer.Consumer.SqlConsumer+<SaveData>d__14.MoveNext",
        "message": "A total of 162 observation(s) has been processed.",
        "exception": ""
      },
      {
        "id": 11,
        "userEmail": null,
        "date": "2022-07-04T15:51:35.753",
        "level": "NOTICE",
        "server": "transfer-689669cb74-cm2jg",
        "logger": "DotStat.Transfer.Consumer.SqlConsumer+<Save>d__10.MoveNext",
        "message": "Processing... Calculating the new data availability",
        "exception": ""
      },
      {
        "id": 11,
        "userEmail": null,
        "date": "2022-07-04T15:51:36.783",
        "level": "NOTICE",
        "server": "transfer-689669cb74-cm2jg",
        "logger": "DotStat.Db.Service.DotStatDbService+<CloseTransaction>d__7.MoveNext",
        "message": "The request was successfully processed.",
        "exception": ""
      },
      {
        "id": 11,
        "userEmail": null,
        "date": "2022-07-04T15:51:36.787",
        "level": "NOTICE",
        "server": "transfer-689669cb74-cm2jg",
        "logger": "DotStat.Transfer.Manager.FileTransferManager`1+<Transfer>d__1.MoveNext",
        "message": "Streaming data from the source finished.",
        "exception": ""
      }
    ],
    "lastUpdated": "2022-07-04T15:51:36.773"
  },
  {
    "requestId": 14,
    "action": "CleanupMappingSets",
    "userEmail": "sandrinesouflis@gmail.com",
    "artefact": "TN1:MILLED_RICE(1.1)",
    "sourceDataspace": null,
    "destinationDataspace": "qa:reset",
    "sourceData": null,
    "submissionTime": "2022-07-05T09:04:26.91",
    "executionStart": "2022-07-05T09:04:26.92",
    "executionEnd": "2022-07-05T09:04:28.057",
    "executionStatus": "Completed",
    "outcome": "Success",
    "logs": [
      {
        "id": 14,
        "userEmail": null,
        "date": "2022-07-05T09:04:26.9",
        "level": "NOTICE",
        "server": "transfer-689669cb74-cm2jg",
        "logger": "DotStat.Transfer.Manager.CommonManager.GetDataflow",
        "message": "The structure information of dataflow TN1:MILLED_RICE(1.1) was successfully loaded from dataspace qa:reset.",
        "exception": ""
      }
    ],
    "lastUpdated": "2022-07-05T09:04:28.057"
  },
  {
    "requestId": 15,
    "action": "CleanupDsd",
    "userEmail": "sandrinesouflis@gmail.com",
    "artefact": "TN1:MILLED_RICE(1.1)",
    "sourceDataspace": null,
    "destinationDataspace": "qa:reset",
    "sourceData": null,
    "submissionTime": "2022-07-05T09:04:29.28",
    "executionStart": "2022-07-05T09:04:29.297",
    "executionEnd": "2022-07-05T09:04:29.633",
    "executionStatus": "Completed",
    "outcome": "None",
    "logs": [],
    "lastUpdated": "2022-07-05T09:04:29.633"
  },
  {
    "requestId": 16,
    "action": "Import",
    "userEmail": "sandrinesouflis@gmail.com",
    "artefact": "TN1:MILLED_RICE(1.1)",
    "sourceDataspace": null,
    "destinationDataspace": "qa:reset",
    "sourceData": "TN1-MILLED_RICE-1.1-metadata.csv",
    "submissionTime": "2022-07-05T09:05:44.61",
    "executionStart": "2022-07-05T09:05:45.063",
    "executionEnd": "2022-07-05T09:05:46.927",
    "executionStatus": "Completed",
    "outcome": "Success",
    "logs": [
      {
        "id": 16,
        "userEmail": null,
        "date": "2022-07-05T09:05:44.58",
        "level": "NOTICE",
        "server": "transfer-689669cb74-cm2jg",
        "logger": "DotStatServices.Transfer.Controllers.ImportController+<Import>d__22`1.MoveNext",
        "message": "The request with ID 16 was successfully registered.",
        "exception": ""
      },
      {
        "id": 16,
        "userEmail": null,
        "date": "2022-07-05T09:05:45.217",
        "level": "NOTICE",
        "server": "transfer-689669cb74-cm2jg",
        "logger": "DotStat.Db.Service.DotStatDbService+<VerifyAndUpdateDsdMsd>d__29.MoveNext",
        "message": "Referential metadata defined by the metadata structure TN1:MSD_MILLED_RICE(1.0) are being accepted for the underlying data structure TN1:MILLED_RICE(1.1).",
        "exception": ""
      },
      {
        "id": 16,
        "userEmail": null,
        "date": "2022-07-05T09:05:45.347",
        "level": "NOTICE",
        "server": "transfer-689669cb74-cm2jg",
        "logger": "DotStat.Transfer.Consumer.SqlConsumer+<SaveMetadata>d__13.MoveNext",
        "message": "Processing... Reading & validating referential metadata",
        "exception": ""
      },
      {
        "id": 16,
        "userEmail": null,
        "date": "2022-07-05T09:05:45.37",
        "level": "NOTICE",
        "server": "transfer-689669cb74-cm2jg",
        "logger": "DotStat.Db.Repository.SqlServer.SqlMetadataStoreRepository+<BulkInsertMetadata>d__1.MoveNext",
        "message": "Reading the referential metadata source successfully finished. 9 row(s) was/were read from the source.",
        "exception": ""
      },
      {
        "id": 16,
        "userEmail": null,
        "date": "2022-07-05T09:05:45.373",
        "level": "NOTICE",
        "server": "transfer-689669cb74-cm2jg",
        "logger": "DotStat.Transfer.Consumer.SqlConsumer+<SaveMetadata>d__13.MoveNext",
        "message": "Processing... Writing referential metadata",
        "exception": ""
      },
      {
        "id": 16,
        "userEmail": null,
        "date": "2022-07-05T09:05:45.447",
        "level": "NOTICE",
        "server": "transfer-689669cb74-cm2jg",
        "logger": "DotStat.Transfer.Consumer.SqlConsumer+<SaveMetadata>d__13.MoveNext",
        "message": "A total of 9 referential metadata key(s) has been processed.",
        "exception": ""
      },
      {
        "id": 16,
        "userEmail": null,
        "date": "2022-07-05T09:05:45.45",
        "level": "NOTICE",
        "server": "transfer-689669cb74-cm2jg",
        "logger": "DotStat.Transfer.Consumer.SqlConsumer+<Save>d__10.MoveNext",
        "message": "Processing... Calculating the new data availability",
        "exception": ""
      },
      {
        "id": 16,
        "userEmail": null,
        "date": "2022-07-05T09:05:46.933",
        "level": "NOTICE",
        "server": "transfer-689669cb74-cm2jg",
        "logger": "DotStat.Db.Service.DotStatDbService+<CloseTransaction>d__7.MoveNext",
        "message": "The request was successfully processed.",
        "exception": ""
      },
      {
        "id": 16,
        "userEmail": null,
        "date": "2022-07-05T09:05:46.937",
        "level": "NOTICE",
        "server": "transfer-689669cb74-cm2jg",
        "logger": "DotStat.Transfer.Manager.FileTransferManager`1+<Transfer>d__1.MoveNext",
        "message": "Streaming data from the source finished.",
        "exception": ""
      }
    ],
    "lastUpdated": "2022-07-05T09:05:46.927"
  },
  {
    "requestId": 17,
    "action": "Import",
    "userEmail": "sandrinesouflis@gmail.com",
    "artefact": "TN1:MILLED_RICE(1.1)",
    "sourceDataspace": null,
    "destinationDataspace": "qa:reset",
    "sourceData": "TN1-MILLED_RICE-1.1-data.csv",
    "submissionTime": "2022-07-05T09:06:18.907",
    "executionStart": "2022-07-05T09:06:19.087",
    "executionEnd": "2022-07-05T09:06:20.367",
    "executionStatus": "Completed",
    "outcome": "Success",
    "logs": [
      {
        "id": 17,
        "userEmail": null,
        "date": "2022-07-05T09:06:18.903",
        "level": "NOTICE",
        "server": "transfer-689669cb74-cm2jg",
        "logger": "DotStatServices.Transfer.Controllers.ImportController+<Import>d__22`1.MoveNext",
        "message": "The request with ID 17 was successfully registered.",
        "exception": ""
      },
      {
        "id": 17,
        "userEmail": null,
        "date": "2022-07-05T09:06:19.167",
        "level": "NOTICE",
        "server": "transfer-689669cb74-cm2jg",
        "logger": "DotStat.Transfer.Consumer.SqlConsumer+<SaveData>d__14.MoveNext",
        "message": "Processing... Reading & validating data",
        "exception": ""
      },
      {
        "id": 17,
        "userEmail": null,
        "date": "2022-07-05T09:06:19.2",
        "level": "NOTICE",
        "server": "transfer-689669cb74-cm2jg",
        "logger": "DotStat.Db.Repository.SqlServer.SqlDataStoreRepository+<BulkInsertData>d__1.MoveNext",
        "message": "Reading the data source successfully finished. 162 row(s) was/were read from the data source.",
        "exception": ""
      },
      {
        "id": 17,
        "userEmail": null,
        "date": "2022-07-05T09:06:19.203",
        "level": "NOTICE",
        "server": "transfer-689669cb74-cm2jg",
        "logger": "DotStat.Transfer.Consumer.SqlConsumer+<SaveData>d__14.MoveNext",
        "message": "Processing... Writing data",
        "exception": ""
      },
      {
        "id": 17,
        "userEmail": null,
        "date": "2022-07-05T09:06:19.33",
        "level": "NOTICE",
        "server": "transfer-689669cb74-cm2jg",
        "logger": "DotStat.Transfer.Consumer.SqlConsumer+<SaveData>d__14.MoveNext",
        "message": "A total of 162 observation(s) has been processed.",
        "exception": ""
      },
      {
        "id": 17,
        "userEmail": null,
        "date": "2022-07-05T09:06:19.337",
        "level": "NOTICE",
        "server": "transfer-689669cb74-cm2jg",
        "logger": "DotStat.Transfer.Consumer.SqlConsumer+<Save>d__10.MoveNext",
        "message": "Processing... Calculating the new data availability",
        "exception": ""
      },
      {
        "id": 17,
        "userEmail": null,
        "date": "2022-07-05T09:06:20.373",
        "level": "NOTICE",
        "server": "transfer-689669cb74-cm2jg",
        "logger": "DotStat.Db.Service.DotStatDbService+<CloseTransaction>d__7.MoveNext",
        "message": "The request was successfully processed.",
        "exception": ""
      },
      {
        "id": 17,
        "userEmail": null,
        "date": "2022-07-05T09:06:20.38",
        "level": "NOTICE",
        "server": "transfer-689669cb74-cm2jg",
        "logger": "DotStat.Transfer.Manager.FileTransferManager`1+<Transfer>d__1.MoveNext",
        "message": "Streaming data from the source finished.",
        "exception": ""
      }
    ],
    "lastUpdated": "2022-07-05T09:06:20.367"
  },
  {
    "requestId": 18,
    "action": "CleanupMappingSets",
    "userEmail": "sandrinesouflis@gmail.com",
    "artefact": "TN1:MILLED_RICE(1.1)",
    "sourceDataspace": null,
    "destinationDataspace": "qa:reset",
    "sourceData": null,
    "submissionTime": "2022-07-05T09:07:37.07",
    "executionStart": "2022-07-05T09:07:37.083",
    "executionEnd": "2022-07-05T09:07:38.3",
    "executionStatus": "Completed",
    "outcome": "Success",
    "logs": [
      {
        "id": 18,
        "userEmail": null,
        "date": "2022-07-05T09:07:37.067",
        "level": "NOTICE",
        "server": "transfer-689669cb74-cm2jg",
        "logger": "DotStat.Transfer.Manager.CommonManager.GetDataflow",
        "message": "The structure information of dataflow TN1:MILLED_RICE(1.1) was successfully loaded from dataspace qa:reset.",
        "exception": ""
      }
    ],
    "lastUpdated": "2022-07-05T09:07:38.3"
  },
  {
    "requestId": 19,
    "action": "CleanupDsd",
    "userEmail": "sandrinesouflis@gmail.com",
    "artefact": "TN1:MILLED_RICE(1.1)",
    "sourceDataspace": null,
    "destinationDataspace": "qa:reset",
    "sourceData": null,
    "submissionTime": "2022-07-05T09:07:39.553",
    "executionStart": "2022-07-05T09:07:39.563",
    "executionEnd": "2022-07-05T09:07:39.873",
    "executionStatus": "Completed",
    "outcome": "None",
    "logs": [],
    "lastUpdated": "2022-07-05T09:07:39.873"
  },
  {
    "requestId": 20,
    "action": "Import",
    "userEmail": "sandrinesouflis@gmail.com",
    "artefact": "TN1:MILLED_RICE(1.1)",
    "sourceDataspace": null,
    "destinationDataspace": "qa:reset",
    "sourceData": "TN1-MILLED_RICE-1.1-data.csv",
    "submissionTime": "2022-07-05T09:11:23.077",
    "executionStart": "2022-07-05T09:11:23.313",
    "executionEnd": "2022-07-05T09:11:24.61",
    "executionStatus": "Completed",
    "outcome": "Success",
    "logs": [
      {
        "id": 20,
        "userEmail": null,
        "date": "2022-07-05T09:11:23.053",
        "level": "NOTICE",
        "server": "transfer-689669cb74-cm2jg",
        "logger": "DotStatServices.Transfer.Controllers.ImportController+<Import>d__22`1.MoveNext",
        "message": "The request with ID 20 was successfully registered.",
        "exception": ""
      },
      {
        "id": 20,
        "userEmail": null,
        "date": "2022-07-05T09:11:23.543",
        "level": "NOTICE",
        "server": "transfer-689669cb74-cm2jg",
        "logger": "DotStat.Transfer.Consumer.SqlConsumer+<SaveData>d__14.MoveNext",
        "message": "Processing... Reading & validating data",
        "exception": ""
      },
      {
        "id": 20,
        "userEmail": null,
        "date": "2022-07-05T09:11:23.607",
        "level": "NOTICE",
        "server": "transfer-689669cb74-cm2jg",
        "logger": "DotStat.Db.Repository.SqlServer.SqlDataStoreRepository+<BulkInsertData>d__1.MoveNext",
        "message": "Reading the data source successfully finished. 162 row(s) was/were read from the data source.",
        "exception": ""
      },
      {
        "id": 20,
        "userEmail": null,
        "date": "2022-07-05T09:11:23.61",
        "level": "NOTICE",
        "server": "transfer-689669cb74-cm2jg",
        "logger": "DotStat.Transfer.Consumer.SqlConsumer+<SaveData>d__14.MoveNext",
        "message": "Processing... Writing data",
        "exception": ""
      },
      {
        "id": 20,
        "userEmail": null,
        "date": "2022-07-05T09:11:23.74",
        "level": "NOTICE",
        "server": "transfer-689669cb74-cm2jg",
        "logger": "DotStat.Transfer.Consumer.SqlConsumer+<SaveData>d__14.MoveNext",
        "message": "A total of 162 observation(s) has been processed.",
        "exception": ""
      },
      {
        "id": 20,
        "userEmail": null,
        "date": "2022-07-05T09:11:23.747",
        "level": "NOTICE",
        "server": "transfer-689669cb74-cm2jg",
        "logger": "DotStat.Transfer.Consumer.SqlConsumer+<Save>d__10.MoveNext",
        "message": "Processing... Calculating the new data availability",
        "exception": ""
      },
      {
        "id": 20,
        "userEmail": null,
        "date": "2022-07-05T09:11:24.617",
        "level": "NOTICE",
        "server": "transfer-689669cb74-cm2jg",
        "logger": "DotStat.Db.Service.DotStatDbService+<CloseTransaction>d__7.MoveNext",
        "message": "The request was successfully processed.",
        "exception": ""
      },
      {
        "id": 20,
        "userEmail": null,
        "date": "2022-07-05T09:11:24.62",
        "level": "NOTICE",
        "server": "transfer-689669cb74-cm2jg",
        "logger": "DotStat.Transfer.Manager.FileTransferManager`1+<Transfer>d__1.MoveNext",
        "message": "Streaming data from the source finished.",
        "exception": ""
      }
    ],
    "lastUpdated": "2022-07-05T09:11:24.61"
  },
  {
    "requestId": 21,
    "action": "CleanupMappingSets",
    "userEmail": "sandrinesouflis@gmail.com",
    "artefact": "TN1:MILLED_RICE(1.1)",
    "sourceDataspace": null,
    "destinationDataspace": "qa:reset",
    "sourceData": null,
    "submissionTime": "2022-07-05T09:27:47.9",
    "executionStart": "2022-07-05T09:27:47.91",
    "executionEnd": "2022-07-05T09:27:48.69",
    "executionStatus": "Completed",
    "outcome": "Success",
    "logs": [
      {
        "id": 21,
        "userEmail": null,
        "date": "2022-07-05T09:27:47.893",
        "level": "NOTICE",
        "server": "transfer-689669cb74-cm2jg",
        "logger": "DotStat.Transfer.Manager.CommonManager.GetDataflow",
        "message": "The structure information of dataflow TN1:MILLED_RICE(1.1) was successfully loaded from dataspace qa:reset.",
        "exception": ""
      }
    ],
    "lastUpdated": "2022-07-05T09:27:48.69"
  },
  {
    "requestId": 22,
    "action": "Import",
    "userEmail": "sandrinesouflis@gmail.com",
    "artefact": "TN1:MILLED_RICE(1.1)",
    "sourceDataspace": null,
    "destinationDataspace": "qa:reset",
    "sourceData": "TN1-MILLED_RICE-1.1-data.csv",
    "submissionTime": "2022-07-05T09:28:48.247",
    "executionStart": "2022-07-05T09:28:48.613",
    "executionEnd": "2022-07-05T09:28:49.83",
    "executionStatus": "Completed",
    "outcome": "Success",
    "logs": [
      {
        "id": 22,
        "userEmail": null,
        "date": "2022-07-05T09:28:48.217",
        "level": "NOTICE",
        "server": "transfer-689669cb74-cm2jg",
        "logger": "DotStatServices.Transfer.Controllers.ImportController+<Import>d__22`1.MoveNext",
        "message": "The request with ID 22 was successfully registered.",
        "exception": ""
      },
      {
        "id": 22,
        "userEmail": null,
        "date": "2022-07-05T09:28:48.747",
        "level": "NOTICE",
        "server": "transfer-689669cb74-cm2jg",
        "logger": "DotStat.Transfer.Consumer.SqlConsumer+<SaveData>d__14.MoveNext",
        "message": "Processing... Reading & validating data",
        "exception": ""
      },
      {
        "id": 22,
        "userEmail": null,
        "date": "2022-07-05T09:28:48.827",
        "level": "NOTICE",
        "server": "transfer-689669cb74-cm2jg",
        "logger": "DotStat.Db.Repository.SqlServer.SqlDataStoreRepository+<BulkInsertData>d__1.MoveNext",
        "message": "Reading the data source successfully finished. 162 row(s) was/were read from the data source.",
        "exception": ""
      },
      {
        "id": 22,
        "userEmail": null,
        "date": "2022-07-05T09:28:48.83",
        "level": "NOTICE",
        "server": "transfer-689669cb74-cm2jg",
        "logger": "DotStat.Transfer.Consumer.SqlConsumer+<SaveData>d__14.MoveNext",
        "message": "Processing... Writing data",
        "exception": ""
      },
      {
        "id": 22,
        "userEmail": null,
        "date": "2022-07-05T09:28:48.937",
        "level": "NOTICE",
        "server": "transfer-689669cb74-cm2jg",
        "logger": "DotStat.Transfer.Consumer.SqlConsumer+<SaveData>d__14.MoveNext",
        "message": "A total of 162 observation(s) has been processed.",
        "exception": ""
      },
      {
        "id": 22,
        "userEmail": null,
        "date": "2022-07-05T09:28:48.94",
        "level": "NOTICE",
        "server": "transfer-689669cb74-cm2jg",
        "logger": "DotStat.Transfer.Consumer.SqlConsumer+<Save>d__10.MoveNext",
        "message": "Processing... Calculating the new data availability",
        "exception": ""
      },
      {
        "id": 22,
        "userEmail": null,
        "date": "2022-07-05T09:28:49.84",
        "level": "NOTICE",
        "server": "transfer-689669cb74-cm2jg",
        "logger": "DotStat.Db.Service.DotStatDbService+<CloseTransaction>d__7.MoveNext",
        "message": "The request was successfully processed.",
        "exception": ""
      },
      {
        "id": 22,
        "userEmail": null,
        "date": "2022-07-05T09:28:49.843",
        "level": "NOTICE",
        "server": "transfer-689669cb74-cm2jg",
        "logger": "DotStat.Transfer.Manager.FileTransferManager`1+<Transfer>d__1.MoveNext",
        "message": "Streaming data from the source finished.",
        "exception": ""
      }
    ],
    "lastUpdated": "2022-07-05T09:28:49.83"
  },
  {
    "requestId": 23,
    "action": "CleanupOrphans",
    "userEmail": "lolita.boumelit@oecd.org",
    "artefact": "*",
    "sourceDataspace": null,
    "destinationDataspace": "qa:reset",
    "sourceData": null,
    "submissionTime": "2022-07-05T09:31:01.687",
    "executionStart": "2022-07-05T09:31:02.197",
    "executionEnd": "2022-07-05T09:31:03.217",
    "executionStatus": "Completed",
    "outcome": "Success",
    "logs": [
      {
        "id": 23,
        "userEmail": null,
        "date": "2022-07-05T09:31:01.643",
        "level": "NOTICE",
        "server": "transfer-689669cb74-cm2jg",
        "logger": "DotStatServices.Transfer.Controllers.CleanUpController+<CleanUpOrphanDsdsV2>d__10.MoveNext",
        "message": "The request with ID 23 was successfully registered.",
        "exception": ""
      },
      {
        "id": 23,
        "userEmail": null,
        "date": "2022-07-05T09:31:03.217",
        "level": "NOTICE",
        "server": "transfer-689669cb74-cm2jg",
        "logger": "DotStat.Transfer.Manager.CommonManager+<CleanUpAllDsds>d__11.MoveNext",
        "message": "No orphan entries found in data database. Cleanup not necessary",
        "exception": ""
      }
    ],
    "lastUpdated": "2022-07-05T09:31:03.217"
  },
  {
    "requestId": 24,
    "action": "Import",
    "userEmail": "sandrinesouflis@gmail.com",
    "artefact": "TN1:MILLED_RICE(1.1)",
    "sourceDataspace": null,
    "destinationDataspace": "qa:reset",
    "sourceData": "TN1-MILLED_RICE-1.1-metadata.csv",
    "submissionTime": "2022-07-05T09:31:04.963",
    "executionStart": "2022-07-05T09:31:05.21",
    "executionEnd": "2022-07-05T09:31:06.65",
    "executionStatus": "Completed",
    "outcome": "Success",
    "logs": [
      {
        "id": 24,
        "userEmail": null,
        "date": "2022-07-05T09:31:04.963",
        "level": "NOTICE",
        "server": "transfer-689669cb74-cm2jg",
        "logger": "DotStatServices.Transfer.Controllers.ImportController+<Import>d__22`1.MoveNext",
        "message": "The request with ID 24 was successfully registered.",
        "exception": ""
      },
      {
        "id": 24,
        "userEmail": null,
        "date": "2022-07-05T09:31:05.247",
        "level": "NOTICE",
        "server": "transfer-689669cb74-cm2jg",
        "logger": "DotStat.Db.Service.DotStatDbService+<VerifyAndUpdateDsdMsd>d__29.MoveNext",
        "message": "Referential metadata defined by the metadata structure TN1:MSD_MILLED_RICE(1.0) are being accepted for the underlying data structure TN1:MILLED_RICE(1.1).",
        "exception": ""
      },
      {
        "id": 24,
        "userEmail": null,
        "date": "2022-07-05T09:31:05.323",
        "level": "NOTICE",
        "server": "transfer-689669cb74-cm2jg",
        "logger": "DotStat.Transfer.Consumer.SqlConsumer+<SaveMetadata>d__13.MoveNext",
        "message": "Processing... Reading & validating referential metadata",
        "exception": ""
      },
      {
        "id": 24,
        "userEmail": null,
        "date": "2022-07-05T09:31:05.343",
        "level": "NOTICE",
        "server": "transfer-689669cb74-cm2jg",
        "logger": "DotStat.Db.Repository.SqlServer.SqlMetadataStoreRepository+<BulkInsertMetadata>d__1.MoveNext",
        "message": "Reading the referential metadata source successfully finished. 9 row(s) was/were read from the source.",
        "exception": ""
      },
      {
        "id": 24,
        "userEmail": null,
        "date": "2022-07-05T09:31:05.347",
        "level": "NOTICE",
        "server": "transfer-689669cb74-cm2jg",
        "logger": "DotStat.Transfer.Consumer.SqlConsumer+<SaveMetadata>d__13.MoveNext",
        "message": "Processing... Writing referential metadata",
        "exception": ""
      },
      {
        "id": 24,
        "userEmail": null,
        "date": "2022-07-05T09:31:05.42",
        "level": "NOTICE",
        "server": "transfer-689669cb74-cm2jg",
        "logger": "DotStat.Transfer.Consumer.SqlConsumer+<SaveMetadata>d__13.MoveNext",
        "message": "A total of 9 referential metadata key(s) has been processed.",
        "exception": ""
      },
      {
        "id": 24,
        "userEmail": null,
        "date": "2022-07-05T09:31:05.423",
        "level": "NOTICE",
        "server": "transfer-689669cb74-cm2jg",
        "logger": "DotStat.Transfer.Consumer.SqlConsumer+<Save>d__10.MoveNext",
        "message": "Processing... Calculating the new data availability",
        "exception": ""
      },
      {
        "id": 24,
        "userEmail": null,
        "date": "2022-07-05T09:31:06.657",
        "level": "NOTICE",
        "server": "transfer-689669cb74-cm2jg",
        "logger": "DotStat.Db.Service.DotStatDbService+<CloseTransaction>d__7.MoveNext",
        "message": "The request was successfully processed.",
        "exception": ""
      },
      {
        "id": 24,
        "userEmail": null,
        "date": "2022-07-05T09:31:06.663",
        "level": "NOTICE",
        "server": "transfer-689669cb74-cm2jg",
        "logger": "DotStat.Transfer.Manager.FileTransferManager`1+<Transfer>d__1.MoveNext",
        "message": "Streaming data from the source finished.",
        "exception": ""
      }
    ],
    "lastUpdated": "2022-07-05T09:31:06.65"
  },
  {
    "requestId": 25,
    "action": "InitAllMappingSets",
    "userEmail": "lolita.boumelit@oecd.org",
    "artefact": "*",
    "sourceDataspace": null,
    "destinationDataspace": "qa:reset",
    "sourceData": null,
    "submissionTime": "2022-07-05T09:33:28.24",
    "executionStart": "2022-07-05T09:33:28.54",
    "executionEnd": "2022-07-05T09:33:36.217",
    "executionStatus": "Completed",
    "outcome": "Error",
    "logs": [
      {
        "id": 25,
        "userEmail": null,
        "date": "2022-07-05T09:33:28.297",
        "level": "NOTICE",
        "server": "transfer-689669cb74-cm2jg",
        "logger": "DotStatServices.Transfer.Controllers.DataManagementController+<CreateAllMappingsets>d__14`1.MoveNext",
        "message": "The request with ID 25 was successfully registered.",
        "exception": ""
      },
      {
        "id": 25,
        "userEmail": null,
        "date": "2022-07-05T09:33:29.843",
        "level": "ERROR",
        "server": "transfer-689669cb74-cm2jg",
        "logger": "DotStat.Db.Service.DotStatDbService+<InitializeAllMappingSets>d__15.MoveNext",
        "message": "An unexpected error has occured while processing dataflow EC_ECFIN:DF_BCSFEED_BUILDING(1.0): Dimension REF_AREA has no codelist representation. Note that non-coded dimensions are currently not supported. Recreate your data structure using only dimensions defined by codelists..",
        "exception": "DotStat.Common.Exceptions.DotStatException: An unexpected error has occured while processing dataflow EC_ECFIN:DF_BCSFEED_BUILDING(1.0): Dimension REF_AREA has no codelist representation. Note that non-coded dimensions are currently not supported. Recreate your data structure using only dimensions defined by codelists..\n ---> DotStat.Common.Exceptions.DotStatException: Dimension REF_AREA has no codelist representation. Note that non-coded dimensions are currently not supported. Recreate your data structure using only dimensions defined by codelists.\n   at DotStat.MappingStore.SdmxParser.BuildDimensions(IDataStructureObject sdmxDsd, ISet`1 sdmxCodelists, ConstraintResolver constraintResolver)+MoveNext()\n   at System.Collections.Generic.LargeArrayBuilder`1.AddRange(IEnumerable`1 items)\n   at System.Collections.Generic.EnumerableHelpers.ToArray[T](IEnumerable`1 source)\n   at DotStat.Domain.Dsd.SetDimensions(IEnumerable`1 dimensions)\n   at DotStat.MappingStore.SdmxParser.ParseStructure(ISdmxObjects sdmxObjects, ResolveCrossReferences resolveCrossReferences)\n   at DotStat.MappingStore.MappingStoreDataAccess.GetDataflow(String dataSpace, String agencyId, String dataflowId, String version, Boolean throwErrorIfNotFound, ResolveCrossReferences resolveCrossReferences, Boolean useCache)\n   at DotStat.Db.Service.DotStatDbService.InitializeAllMappingSets(Transaction transaction, DotStatPrincipal principal, IMappingStoreDataAccess mappingStoreDataAccess, CancellationToken cancellationToken)\n   --- End of inner exception stack trace ---"
      },
      {
        "id": 25,
        "userEmail": null,
        "date": "2022-07-05T09:33:36.21",
        "level": "NOTICE",
        "server": "transfer-689669cb74-cm2jg",
        "logger": "DotStat.Db.Service.DotStatDbService+<InitializeAllMappingSets>d__15.MoveNext",
        "message": "The creation of mapping sets in the structure database was successful for the dataflows: OECD.ECO:PO_REFMETADATA(1.0).",
        "exception": ""
      },
      {
        "id": 25,
        "userEmail": null,
        "date": "2022-07-05T09:33:36.213",
        "level": "WARN",
        "server": "transfer-689669cb74-cm2jg",
        "logger": "DotStat.Db.Service.DotStatDbService+<InitializeAllMappingSets>d__15.MoveNext",
        "message": "The creation of mapping sets in the structure database skipped the following dataflows that are external references or have mapping sets previously created: ABS:WPI(1.0.0), BE2:DS_NADET2008@DF_NADET2008(1.0), EC_ECFIN:DF_BCS(1.0), EC_ECFIN:DF_BCS_BUIL(1.0), EC_ECFIN:DF_BCS_PROD_BUIL(1.0), EC_ECFIN:DSD_ONS@DF_ONS(1.0), LU1:DF_E5301(1.0), OECD:DF_AREA_HCL(1.1), OECD:DF_NOT_DISPLAYED(4.2), OECD:DF_UOM(3.0), OECD.ECO:PO_REFMETADATA2005(1.0), OECD.SDD:DF_SPS_DAILY_BIS(1.0), OECD.SDD:NAMAIN_T0107_Q(3.0), OECD.SDD:NAMAIN_UOM3(3.0), PT:DF_CPI(1.0.0), PT:DF_WPI(1.0.0), PT:EO_LIVE(1.0), TN1:MILLED_RICE(1.1).",
        "exception": ""
      },
      {
        "id": 25,
        "userEmail": null,
        "date": "2022-07-05T09:33:36.217",
        "level": "WARN",
        "server": "transfer-689669cb74-cm2jg",
        "logger": "DotStat.Db.Service.DotStatDbService+<InitializeAllMappingSets>d__15.MoveNext",
        "message": "The creation of mapping sets in the structure database failed for the dataflows: EC_ECFIN:DF_BCSFEED_BUILDING(1.0).",
        "exception": ""
      },
      {
        "id": 25,
        "userEmail": null,
        "date": "2022-07-05T09:33:36.227",
        "level": "NOTICE",
        "server": "transfer-689669cb74-cm2jg",
        "logger": "DotStatServices.Transfer.Controllers.DataManagementController+<>c__DisplayClass14_1`1+<<CreateAllMappingsets>g__mainTask|0>d.MoveNext",
        "message": "The transaction 25 to create all mapping sets in the structure database for all dataflows has completed.",
        "exception": ""
      }
    ],
    "lastUpdated": "2022-07-05T09:33:36.217"
  },
  {
    "requestId": 28,
    "action": "Import",
    "userEmail": "lolita.boumelit@oecd.org",
    "artefact": "OECD:DF_UOM_EXAMPLE(1.0)",
    "sourceDataspace": null,
    "destinationDataspace": "qa:reset",
    "sourceData": "https://nsi-demo-oecd-staging.siscc.org/rest/data/OECD,DF_UOM_EXAMPLE,1.0/all",
    "submissionTime": "2022-07-05T09:56:43.863",
    "executionStart": "2022-07-05T09:56:44.19",
    "executionEnd": "2022-07-05T09:56:48.597",
    "executionStatus": "Completed",
    "outcome": "Success",
    "logs": [
      {
        "id": 28,
        "userEmail": null,
        "date": "2022-07-05T09:56:43.86",
        "level": "NOTICE",
        "server": "transfer-689669cb74-cm2jg",
        "logger": "DotStatServices.Transfer.Controllers.ImportController+<Import>d__22`1.MoveNext",
        "message": "The request with ID 28 was successfully registered.",
        "exception": ""
      },
      {
        "id": 28,
        "userEmail": null,
        "date": "2022-07-05T09:56:44.623",
        "level": "NOTICE",
        "server": "transfer-689669cb74-cm2jg",
        "logger": "DotStat.Db.Service.DotStatDbService+<VerifyAndUpdateDsdMsd>d__29.MoveNext",
        "message": "Referential metadata defined by the metadata structure OECD:MSD_REF_METADATA(1.0) are being accepted for the underlying data structure OECD:DSD_UOM_EXAMPLE(1.0).",
        "exception": ""
      },
      {
        "id": 28,
        "userEmail": null,
        "date": "2022-07-05T09:56:44.947",
        "level": "NOTICE",
        "server": "transfer-689669cb74-cm2jg",
        "logger": "DotStat.Transfer.Consumer.SqlConsumer+<SaveData>d__14.MoveNext",
        "message": "Processing... Reading & validating data",
        "exception": ""
      },
      {
        "id": 28,
        "userEmail": null,
        "date": "2022-07-05T09:56:45.027",
        "level": "NOTICE",
        "server": "transfer-689669cb74-cm2jg",
        "logger": "DotStat.Db.Repository.SqlServer.SqlDataStoreRepository+<BulkInsertData>d__1.MoveNext",
        "message": "Reading the data source successfully finished. 292 row(s) was/were read from the data source.",
        "exception": ""
      },
      {
        "id": 28,
        "userEmail": null,
        "date": "2022-07-05T09:56:45.033",
        "level": "NOTICE",
        "server": "transfer-689669cb74-cm2jg",
        "logger": "DotStat.Transfer.Consumer.SqlConsumer+<SaveData>d__14.MoveNext",
        "message": "Processing... Writing data",
        "exception": ""
      },
      {
        "id": 28,
        "userEmail": null,
        "date": "2022-07-05T09:56:45.297",
        "level": "NOTICE",
        "server": "transfer-689669cb74-cm2jg",
        "logger": "DotStat.Transfer.Consumer.SqlConsumer+<SaveData>d__14.MoveNext",
        "message": "A total of 292 observation(s) has been processed.",
        "exception": ""
      },
      {
        "id": 28,
        "userEmail": null,
        "date": "2022-07-05T09:56:45.303",
        "level": "NOTICE",
        "server": "transfer-689669cb74-cm2jg",
        "logger": "DotStat.Transfer.Consumer.SqlConsumer+<Save>d__10.MoveNext",
        "message": "Processing... Calculating the new data availability",
        "exception": ""
      },
      {
        "id": 28,
        "userEmail": null,
        "date": "2022-07-05T09:56:48.607",
        "level": "NOTICE",
        "server": "transfer-689669cb74-cm2jg",
        "logger": "DotStat.Db.Service.DotStatDbService+<CloseTransaction>d__7.MoveNext",
        "message": "The request was successfully processed.",
        "exception": ""
      },
      {
        "id": 28,
        "userEmail": null,
        "date": "2022-07-05T09:56:48.613",
        "level": "NOTICE",
        "server": "transfer-689669cb74-cm2jg",
        "logger": "DotStat.Transfer.Manager.UrlTransferManager`1+<Transfer>d__1.MoveNext",
        "message": "Streaming data from the source finished.",
        "exception": ""
      }
    ],
    "lastUpdated": "2022-07-05T09:56:48.597"
  },
  {
    "requestId": 33,
    "action": "CleanupMappingSets",
    "userEmail": "lolita.boumelit@oecd.org",
    "artefact": "OECD:DF_UOM_EXAMPLE(1.0)",
    "sourceDataspace": null,
    "destinationDataspace": "qa:reset",
    "sourceData": null,
    "submissionTime": "2022-07-05T10:00:03.063",
    "executionStart": "2022-07-05T10:00:03.08",
    "executionEnd": "2022-07-05T10:00:06.72",
    "executionStatus": "Completed",
    "outcome": "Success",
    "logs": [
      {
        "id": 33,
        "userEmail": null,
        "date": "2022-07-05T10:00:03.047",
        "level": "NOTICE",
        "server": "transfer-689669cb74-cm2jg",
        "logger": "DotStat.Transfer.Manager.CommonManager.GetDataflow",
        "message": "The structure information of dataflow OECD:DF_UOM_EXAMPLE(1.0) was successfully loaded from dataspace qa:reset.",
        "exception": ""
      }
    ],
    "lastUpdated": "2022-07-05T10:00:06.72"
  },
  {
    "requestId": 36,
    "action": "CleanupDsd",
    "userEmail": "lolita.boumelit@oecd.org",
    "artefact": "OECD:DSD_UOM_EXAMPLE(1.0)",
    "sourceDataspace": null,
    "destinationDataspace": "qa:reset",
    "sourceData": null,
    "submissionTime": "2022-07-05T10:00:08.403",
    "executionStart": "2022-07-05T10:00:08.417",
    "executionEnd": "2022-07-05T10:00:08.88",
    "executionStatus": "Completed",
    "outcome": "None",
    "logs": [],
    "lastUpdated": "2022-07-05T10:00:08.88"
  },
  {
    "requestId": 37,
    "action": "Import",
    "userEmail": "lolita.boumelit@oecd.org",
    "artefact": "OECD.DAF.INV:FDI_DSD@FDI_FLOW_IND(1.0)",
    "sourceDataspace": null,
    "destinationDataspace": "qa:reset",
    "sourceData": "FDI_DATA_FLOW_IND_01.07.csv",
    "submissionTime": "2022-07-05T11:44:52.32",
    "executionStart": "2022-07-05T11:44:52.673",
    "executionEnd": "2022-07-05T11:44:59.893",
    "executionStatus": "Completed",
    "outcome": "Success",
    "logs": [
      {
        "id": 37,
        "userEmail": null,
        "date": "2022-07-05T11:44:52.31",
        "level": "NOTICE",
        "server": "transfer-689669cb74-cm2jg",
        "logger": "DotStatServices.Transfer.Controllers.ImportController+<Import>d__22`1.MoveNext",
        "message": "The request with ID 37 was successfully registered.",
        "exception": ""
      },
      {
        "id": 37,
        "userEmail": null,
        "date": "2022-07-05T11:44:53.187",
        "level": "NOTICE",
        "server": "transfer-689669cb74-cm2jg",
        "logger": "DotStat.Db.Service.DotStatDbService+<VerifyAndUpdateDsdMsd>d__29.MoveNext",
        "message": "Referential metadata defined by the metadata structure OECD:MSD_REF_METADATA(1.0) are being accepted for the underlying data structure OECD.DAF.INV:FDI_DSD(1.0).",
        "exception": ""
      },
      {
        "id": 37,
        "userEmail": null,
        "date": "2022-07-05T11:44:53.377",
        "level": "NOTICE",
        "server": "transfer-689669cb74-cm2jg",
        "logger": "DotStat.Transfer.Consumer.SqlConsumer+<SaveData>d__14.MoveNext",
        "message": "Processing... Reading & validating data",
        "exception": ""
      },
      {
        "id": 37,
        "userEmail": null,
        "date": "2022-07-05T11:44:54.833",
        "level": "NOTICE",
        "server": "transfer-689669cb74-cm2jg",
        "logger": "DotStat.Db.Repository.SqlServer.SqlDataStoreRepository+<BulkInsertData>d__1.MoveNext",
        "message": "Reading the data source successfully finished. 41898 row(s) was/were read from the data source.",
        "exception": ""
      },
      {
        "id": 37,
        "userEmail": null,
        "date": "2022-07-05T11:44:54.837",
        "level": "NOTICE",
        "server": "transfer-689669cb74-cm2jg",
        "logger": "DotStat.Transfer.Consumer.SqlConsumer+<SaveData>d__14.MoveNext",
        "message": "Processing... Writing data",
        "exception": ""
      },
      {
        "id": 37,
        "userEmail": null,
        "date": "2022-07-05T11:44:56.447",
        "level": "NOTICE",
        "server": "transfer-689669cb74-cm2jg",
        "logger": "DotStat.Transfer.Consumer.SqlConsumer+<SaveData>d__14.MoveNext",
        "message": "A total of 41898 observation(s) has been processed.",
        "exception": ""
      },
      {
        "id": 37,
        "userEmail": null,
        "date": "2022-07-05T11:44:56.45",
        "level": "NOTICE",
        "server": "transfer-689669cb74-cm2jg",
        "logger": "DotStat.Transfer.Consumer.SqlConsumer+<Save>d__10.MoveNext",
        "message": "Processing... Calculating the new data availability",
        "exception": ""
      },
      {
        "id": 37,
        "userEmail": null,
        "date": "2022-07-05T11:44:59.9",
        "level": "NOTICE",
        "server": "transfer-689669cb74-cm2jg",
        "logger": "DotStat.Db.Service.DotStatDbService+<CloseTransaction>d__7.MoveNext",
        "message": "The request was successfully processed.",
        "exception": ""
      },
      {
        "id": 37,
        "userEmail": null,
        "date": "2022-07-05T11:44:59.903",
        "level": "NOTICE",
        "server": "transfer-689669cb74-cm2jg",
        "logger": "DotStat.Transfer.Manager.FileTransferManager`1+<Transfer>d__1.MoveNext",
        "message": "Streaming data from the source finished.",
        "exception": ""
      }
    ],
    "lastUpdated": "2022-07-05T11:44:59.893"
  },
  {
    "requestId": 41,
    "action": "CleanupMappingSets",
    "userEmail": "lolita.boumelit@oecd.org",
    "artefact": "OECD.DAF.INV:FDI_DSD@FDI_FLOW_IND(1.0)",
    "sourceDataspace": null,
    "destinationDataspace": "qa:reset",
    "sourceData": null,
    "submissionTime": "2022-07-05T11:47:52.553",
    "executionStart": "2022-07-05T11:47:52.573",
    "executionEnd": "2022-07-05T11:47:57.57",
    "executionStatus": "Completed",
    "outcome": "Success",
    "logs": [
      {
        "id": 41,
        "userEmail": null,
        "date": "2022-07-05T11:47:52.443",
        "level": "NOTICE",
        "server": "transfer-689669cb74-cm2jg",
        "logger": "DotStat.Transfer.Manager.CommonManager.GetDataflow",
        "message": "The structure information of dataflow OECD.DAF.INV:FDI_DSD@FDI_FLOW_IND(1.0) was successfully loaded from dataspace qa:reset.",
        "exception": ""
      }
    ],
    "lastUpdated": "2022-07-05T11:47:57.57"
  },
  {
    "requestId": 50,
    "action": "CleanupDsd",
    "userEmail": "lolita.boumelit@oecd.org",
    "artefact": "OECD.DAF.INV:FDI_DSD(1.0)",
    "sourceDataspace": null,
    "destinationDataspace": "qa:reset",
    "sourceData": null,
    "submissionTime": "2022-07-05T11:47:58.603",
    "executionStart": "2022-07-05T11:47:58.61",
    "executionEnd": "2022-07-05T11:47:59.04",
    "executionStatus": "Completed",
    "outcome": "None",
    "logs": [],
    "lastUpdated": "2022-07-05T11:47:59.04"
  },
  {
    "requestId": 51,
    "action": "Import",
    "userEmail": "lolita.boumelit@oecd.org",
    "artefact": "OECD.DAF.INV:FDI_DSD@FDI_FLOW_IND(1.0)",
    "sourceDataspace": null,
    "destinationDataspace": "qa:reset",
    "sourceData": "FDI_DATA_FLOW_IND_01.07.csv",
    "submissionTime": "2022-07-05T11:48:46.483",
    "executionStart": "2022-07-05T11:48:46.613",
    "executionEnd": "2022-07-05T11:48:53.8",
    "executionStatus": "Completed",
    "outcome": "Success",
    "logs": [
      {
        "id": 51,
        "userEmail": null,
        "date": "2022-07-05T11:48:46.45",
        "level": "NOTICE",
        "server": "transfer-689669cb74-cm2jg",
        "logger": "DotStatServices.Transfer.Controllers.ImportController+<Import>d__22`1.MoveNext",
        "message": "The request with ID 51 was successfully registered.",
        "exception": ""
      },
      {
        "id": 51,
        "userEmail": null,
        "date": "2022-07-05T11:48:47.093",
        "level": "NOTICE",
        "server": "transfer-689669cb74-cm2jg",
        "logger": "DotStat.Db.Service.DotStatDbService+<VerifyAndUpdateDsdMsd>d__29.MoveNext",
        "message": "Referential metadata defined by the metadata structure OECD:MSD_REF_METADATA(1.0) are being accepted for the underlying data structure OECD.DAF.INV:FDI_DSD(1.0).",
        "exception": ""
      },
      {
        "id": 51,
        "userEmail": null,
        "date": "2022-07-05T11:48:47.263",
        "level": "NOTICE",
        "server": "transfer-689669cb74-cm2jg",
        "logger": "DotStat.Transfer.Consumer.SqlConsumer+<SaveData>d__14.MoveNext",
        "message": "Processing... Reading & validating data",
        "exception": ""
      },
      {
        "id": 51,
        "userEmail": null,
        "date": "2022-07-05T11:48:48.61",
        "level": "NOTICE",
        "server": "transfer-689669cb74-cm2jg",
        "logger": "DotStat.Db.Repository.SqlServer.SqlDataStoreRepository+<BulkInsertData>d__1.MoveNext",
        "message": "Reading the data source successfully finished. 41898 row(s) was/were read from the data source.",
        "exception": ""
      },
      {
        "id": 51,
        "userEmail": null,
        "date": "2022-07-05T11:48:48.613",
        "level": "NOTICE",
        "server": "transfer-689669cb74-cm2jg",
        "logger": "DotStat.Transfer.Consumer.SqlConsumer+<SaveData>d__14.MoveNext",
        "message": "Processing... Writing data",
        "exception": ""
      },
      {
        "id": 51,
        "userEmail": null,
        "date": "2022-07-05T11:48:50.237",
        "level": "NOTICE",
        "server": "transfer-689669cb74-cm2jg",
        "logger": "DotStat.Transfer.Consumer.SqlConsumer+<SaveData>d__14.MoveNext",
        "message": "A total of 41898 observation(s) has been processed.",
        "exception": ""
      },
      {
        "id": 51,
        "userEmail": null,
        "date": "2022-07-05T11:48:50.24",
        "level": "NOTICE",
        "server": "transfer-689669cb74-cm2jg",
        "logger": "DotStat.Transfer.Consumer.SqlConsumer+<Save>d__10.MoveNext",
        "message": "Processing... Calculating the new data availability",
        "exception": ""
      },
      {
        "id": 51,
        "userEmail": null,
        "date": "2022-07-05T11:48:53.807",
        "level": "NOTICE",
        "server": "transfer-689669cb74-cm2jg",
        "logger": "DotStat.Db.Service.DotStatDbService+<CloseTransaction>d__7.MoveNext",
        "message": "The request was successfully processed.",
        "exception": ""
      },
      {
        "id": 51,
        "userEmail": null,
        "date": "2022-07-05T11:48:53.813",
        "level": "NOTICE",
        "server": "transfer-689669cb74-cm2jg",
        "logger": "DotStat.Transfer.Manager.FileTransferManager`1+<Transfer>d__1.MoveNext",
        "message": "Streaming data from the source finished.",
        "exception": ""
      }
    ],
    "lastUpdated": "2022-07-05T11:48:53.8"
  },
  {
    "requestId": 54,
    "action": "InitAllMappingSets",
    "userEmail": "sandrinesouflis@gmail.com",
    "artefact": "*",
    "sourceDataspace": null,
    "destinationDataspace": "qa:reset",
    "sourceData": null,
    "submissionTime": "2022-07-05T12:17:28.993",
    "executionStart": "2022-07-05T12:17:29.42",
    "executionEnd": "2022-07-05T12:18:18.113",
    "executionStatus": "Completed",
    "outcome": "Error",
    "logs": [
      {
        "id": 54,
        "userEmail": null,
        "date": "2022-07-05T12:17:29",
        "level": "NOTICE",
        "server": "transfer-689669cb74-cm2jg",
        "logger": "DotStatServices.Transfer.Controllers.DataManagementController+<CreateAllMappingsets>d__14`1.MoveNext",
        "message": "The request with ID 54 was successfully registered.",
        "exception": ""
      },
      {
        "id": 54,
        "userEmail": null,
        "date": "2022-07-05T12:17:30.71",
        "level": "ERROR",
        "server": "transfer-689669cb74-cm2jg",
        "logger": "DotStat.Db.Service.DotStatDbService+<InitializeAllMappingSets>d__15.MoveNext",
        "message": "An unexpected error has occured while processing dataflow EC_ECFIN:DF_BCSFEED_BUILDING(1.0): Dimension REF_AREA has no codelist representation. Note that non-coded dimensions are currently not supported. Recreate your data structure using only dimensions defined by codelists..",
        "exception": "DotStat.Common.Exceptions.DotStatException: An unexpected error has occured while processing dataflow EC_ECFIN:DF_BCSFEED_BUILDING(1.0): Dimension REF_AREA has no codelist representation. Note that non-coded dimensions are currently not supported. Recreate your data structure using only dimensions defined by codelists..\n ---> DotStat.Common.Exceptions.DotStatException: Dimension REF_AREA has no codelist representation. Note that non-coded dimensions are currently not supported. Recreate your data structure using only dimensions defined by codelists.\n   at DotStat.MappingStore.SdmxParser.BuildDimensions(IDataStructureObject sdmxDsd, ISet`1 sdmxCodelists, ConstraintResolver constraintResolver)+MoveNext()\n   at System.Collections.Generic.LargeArrayBuilder`1.AddRange(IEnumerable`1 items)\n   at System.Collections.Generic.EnumerableHelpers.ToArray[T](IEnumerable`1 source)\n   at DotStat.Domain.Dsd.SetDimensions(IEnumerable`1 dimensions)\n   at DotStat.MappingStore.SdmxParser.ParseStructure(ISdmxObjects sdmxObjects, ResolveCrossReferences resolveCrossReferences)\n   at DotStat.MappingStore.MappingStoreDataAccess.GetDataflow(String dataSpace, String agencyId, String dataflowId, String version, Boolean throwErrorIfNotFound, ResolveCrossReferences resolveCrossReferences, Boolean useCache)\n   at DotStat.Db.Service.DotStatDbService.InitializeAllMappingSets(Transaction transaction, DotStatPrincipal principal, IMappingStoreDataAccess mappingStoreDataAccess, CancellationToken cancellationToken)\n   --- End of inner exception stack trace ---"
      },
      {
        "id": 54,
        "userEmail": null,
        "date": "2022-07-05T12:18:18.103",
        "level": "NOTICE",
        "server": "transfer-689669cb74-cm2jg",
        "logger": "DotStat.Db.Service.DotStatDbService+<InitializeAllMappingSets>d__15.MoveNext",
        "message": "The creation of mapping sets in the structure database was successful for the dataflows: OECD:DF_UOM_EXC(1.0), OECD.DAF.INV:FDI_DSD@FDI_AGGR_SUMM(1.0), OECD.DAF.INV:FDI_DSD@FDI_CTRY_IND_HIST(1.0), OECD.DAF.INV:FDI_DSD@FDI_CTRY_IND_SUMM(1.0), OECD.DAF.INV:FDI_DSD@FDI_FLOW_AGGR(1.0), OECD.DAF.INV:FDI_DSD@FDI_FLOW_CTRY(1.0), OECD.DAF.INV:FDI_DSD@FDI_INC_AGGR(1.0), OECD.DAF.INV:FDI_DSD@FDI_INC_CTRY(1.0), OECD.DAF.INV:FDI_DSD@FDI_INC_IND(1.0), OECD.DAF.INV:FDI_DSD@FDI_POS_AGGR(1.0), OECD.DAF.INV:FDI_DSD@FDI_POS_CTRY(1.0), OECD.DAF.INV:FDI_DSD@FDI_POS_IND(1.0).",
        "exception": ""
      },
      {
        "id": 54,
        "userEmail": null,
        "date": "2022-07-05T12:18:18.107",
        "level": "WARN",
        "server": "transfer-689669cb74-cm2jg",
        "logger": "DotStat.Db.Service.DotStatDbService+<InitializeAllMappingSets>d__15.MoveNext",
        "message": "The creation of mapping sets in the structure database skipped the following dataflows that are external references or have mapping sets previously created: ABS:WPI(1.0.0), BE2:DS_NADET2008@DF_NADET2008(1.0), EC_ECFIN:DF_BCS(1.0), EC_ECFIN:DF_BCS_BUIL(1.0), EC_ECFIN:DF_BCS_PROD_BUIL(1.0), EC_ECFIN:DSD_ONS@DF_ONS(1.0), LU1:DF_E5301(1.0), OECD:DF_AREA_HCL(1.1), OECD:DF_UOM(3.0), OECD.DAF.INV:FDI_DSD@FDI_FLOW_IND(1.0), OECD.ECO:PO_REFMETADATA(1.0), OECD.ECO:PO_REFMETADATA2005(1.0), OECD.SDD:DF_SPS_DAILY_BIS(1.0), OECD.SDD:NAMAIN_T0107_Q(3.0), OECD.SDD:NAMAIN_UOM3(3.0), PT:DF_CPI(1.0.0), PT:DF_WPI(1.0.0), PT:EO_LIVE(1.0), TN1:MILLED_RICE(1.1).",
        "exception": ""
      },
      {
        "id": 54,
        "userEmail": null,
        "date": "2022-07-05T12:18:18.113",
        "level": "WARN",
        "server": "transfer-689669cb74-cm2jg",
        "logger": "DotStat.Db.Service.DotStatDbService+<InitializeAllMappingSets>d__15.MoveNext",
        "message": "The creation of mapping sets in the structure database failed for the dataflows: EC_ECFIN:DF_BCSFEED_BUILDING(1.0).",
        "exception": ""
      },
      {
        "id": 54,
        "userEmail": null,
        "date": "2022-07-05T12:18:18.12",
        "level": "NOTICE",
        "server": "transfer-689669cb74-cm2jg",
        "logger": "DotStatServices.Transfer.Controllers.DataManagementController+<>c__DisplayClass14_1`1+<<CreateAllMappingsets>g__mainTask|0>d.MoveNext",
        "message": "The transaction 54 to create all mapping sets in the structure database for all dataflows has completed.",
        "exception": ""
      }
    ],
    "lastUpdated": "2022-07-05T12:18:18.113"
  },
  {
    "requestId": 55,
    "action": "InitAllMappingSets",
    "userEmail": "sandrinesouflis@gmail.com",
    "artefact": "*",
    "sourceDataspace": null,
    "destinationDataspace": "qa:reset",
    "sourceData": null,
    "submissionTime": "2022-07-05T12:17:30.88",
    "executionStart": "2022-07-05T12:18:37.02",
    "executionEnd": "2022-07-05T12:18:51.387",
    "executionStatus": "Completed",
    "outcome": "Error",
    "logs": [
      {
        "id": 55,
        "userEmail": null,
        "date": "2022-07-05T12:17:30.893",
        "level": "NOTICE",
        "server": "transfer-689669cb74-cm2jg",
        "logger": "DotStatServices.Transfer.Controllers.DataManagementController+<CreateAllMappingsets>d__14`1.MoveNext",
        "message": "The request with ID 55 was successfully registered.",
        "exception": ""
      },
      {
        "id": 55,
        "userEmail": null,
        "date": "2022-07-05T12:18:38.223",
        "level": "ERROR",
        "server": "transfer-689669cb74-cm2jg",
        "logger": "DotStat.Db.Service.DotStatDbService+<InitializeAllMappingSets>d__15.MoveNext",
        "message": "An unexpected error has occured while processing dataflow EC_ECFIN:DF_BCSFEED_BUILDING(1.0): Dimension REF_AREA has no codelist representation. Note that non-coded dimensions are currently not supported. Recreate your data structure using only dimensions defined by codelists..",
        "exception": "DotStat.Common.Exceptions.DotStatException: An unexpected error has occured while processing dataflow EC_ECFIN:DF_BCSFEED_BUILDING(1.0): Dimension REF_AREA has no codelist representation. Note that non-coded dimensions are currently not supported. Recreate your data structure using only dimensions defined by codelists..\n ---> DotStat.Common.Exceptions.DotStatException: Dimension REF_AREA has no codelist representation. Note that non-coded dimensions are currently not supported. Recreate your data structure using only dimensions defined by codelists.\n   at DotStat.MappingStore.SdmxParser.BuildDimensions(IDataStructureObject sdmxDsd, ISet`1 sdmxCodelists, ConstraintResolver constraintResolver)+MoveNext()\n   at System.Collections.Generic.LargeArrayBuilder`1.AddRange(IEnumerable`1 items)\n   at System.Collections.Generic.EnumerableHelpers.ToArray[T](IEnumerable`1 source)\n   at DotStat.Domain.Dsd.SetDimensions(IEnumerable`1 dimensions)\n   at DotStat.MappingStore.SdmxParser.ParseStructure(ISdmxObjects sdmxObjects, ResolveCrossReferences resolveCrossReferences)\n   at DotStat.MappingStore.MappingStoreDataAccess.GetDataflow(String dataSpace, String agencyId, String dataflowId, String version, Boolean throwErrorIfNotFound, ResolveCrossReferences resolveCrossReferences, Boolean useCache)\n   at DotStat.Db.Service.DotStatDbService.InitializeAllMappingSets(Transaction transaction, DotStatPrincipal principal, IMappingStoreDataAccess mappingStoreDataAccess, CancellationToken cancellationToken)\n   --- End of inner exception stack trace ---"
      },
      {
        "id": 55,
        "userEmail": null,
        "date": "2022-07-05T12:18:51.36",
        "level": "WARN",
        "server": "transfer-689669cb74-cm2jg",
        "logger": "DotStat.Db.Service.DotStatDbService+<InitializeAllMappingSets>d__15.MoveNext",
        "message": "The creation of mapping sets in the structure database skipped the following dataflows that are external references or have mapping sets previously created: ABS:WPI(1.0.0), BE2:DS_NADET2008@DF_NADET2008(1.0), EC_ECFIN:DF_BCS(1.0), EC_ECFIN:DF_BCS_BUIL(1.0), EC_ECFIN:DF_BCS_PROD_BUIL(1.0), EC_ECFIN:DSD_ONS@DF_ONS(1.0), LU1:DF_E5301(1.0), OECD:DF_AREA_HCL(1.1), OECD:DF_UOM(3.0), OECD:DF_UOM_EXC(1.0), OECD.DAF.INV:FDI_DSD@FDI_AGGR_SUMM(1.0), OECD.DAF.INV:FDI_DSD@FDI_CTRY_IND_HIST(1.0), OECD.DAF.INV:FDI_DSD@FDI_CTRY_IND_SUMM(1.0), OECD.DAF.INV:FDI_DSD@FDI_FLOW_AGGR(1.0), OECD.DAF.INV:FDI_DSD@FDI_FLOW_CTRY(1.0), OECD.DAF.INV:FDI_DSD@FDI_FLOW_IND(1.0), OECD.DAF.INV:FDI_DSD@FDI_INC_AGGR(1.0), OECD.DAF.INV:FDI_DSD@FDI_INC_CTRY(1.0), OECD.DAF.INV:FDI_DSD@FDI_INC_IND(1.0), OECD.DAF.INV:FDI_DSD@FDI_POS_AGGR(1.0), OECD.DAF.INV:FDI_DSD@FDI_POS_CTRY(1.0), OECD.DAF.INV:FDI_DSD@FDI_POS_IND(1.0), OECD.ECO:PO_REFMETADATA(1.0), OECD.ECO:PO_REFMETADATA2005(1.0), OECD.SDD:DF_SPS_DAILY_BIS(1.0), OECD.SDD:NAMAIN_T0107_Q(3.0), OECD.SDD:NAMAIN_UOM3(3.0), PT:DF_CPI(1.0.0), PT:DF_WPI(1.0.0), PT:EO_LIVE(1.0), TN1:MILLED_RICE(1.1).",
        "exception": ""
      },
      {
        "id": 55,
        "userEmail": null,
        "date": "2022-07-05T12:18:51.387",
        "level": "WARN",
        "server": "transfer-689669cb74-cm2jg",
        "logger": "DotStat.Db.Service.DotStatDbService+<InitializeAllMappingSets>d__15.MoveNext",
        "message": "The creation of mapping sets in the structure database failed for the dataflows: EC_ECFIN:DF_BCSFEED_BUILDING(1.0).",
        "exception": ""
      },
      {
        "id": 55,
        "userEmail": null,
        "date": "2022-07-05T12:18:51.393",
        "level": "NOTICE",
        "server": "transfer-689669cb74-cm2jg",
        "logger": "DotStatServices.Transfer.Controllers.DataManagementController+<>c__DisplayClass14_1`1+<<CreateAllMappingsets>g__mainTask|0>d.MoveNext",
        "message": "The transaction 55 to create all mapping sets in the structure database for all dataflows has completed.",
        "exception": ""
      }
    ],
    "lastUpdated": "2022-07-05T12:18:51.387"
  },
  {
    "requestId": 62,
    "action": "CleanupMappingSets",
    "userEmail": "lolita.boumelit@oecd.org",
    "artefact": "OECD.DAF.INV:FDI_DSD@FDI_FLOW_IND(1.0)",
    "sourceDataspace": null,
    "destinationDataspace": "qa:reset",
    "sourceData": null,
    "submissionTime": "2022-07-05T13:06:02.073",
    "executionStart": "2022-07-05T13:06:02.09",
    "executionEnd": "2022-07-05T13:06:08.33",
    "executionStatus": "Completed",
    "outcome": "Success",
    "logs": [
      {
        "id": 62,
        "userEmail": null,
        "date": "2022-07-05T13:06:02.06",
        "level": "NOTICE",
        "server": "transfer-689669cb74-cm2jg",
        "logger": "DotStat.Transfer.Manager.CommonManager.GetDataflow",
        "message": "The structure information of dataflow OECD.DAF.INV:FDI_DSD@FDI_FLOW_IND(1.0) was successfully loaded from dataspace qa:reset.",
        "exception": ""
      }
    ],
    "lastUpdated": "2022-07-05T13:06:08.33"
  },
  {
    "requestId": 69,
    "action": "CleanupDsd",
    "userEmail": "lolita.boumelit@oecd.org",
    "artefact": "OECD.DAF.INV:FDI_DSD(1.0)",
    "sourceDataspace": null,
    "destinationDataspace": "qa:reset",
    "sourceData": null,
    "submissionTime": "2022-07-05T13:07:05.607",
    "executionStart": "2022-07-05T13:07:05.62",
    "executionEnd": "2022-07-05T13:07:06.067",
    "executionStatus": "Completed",
    "outcome": "None",
    "logs": [],
    "lastUpdated": "2022-07-05T13:07:06.067"
  },
  {
    "requestId": 70,
    "action": "Import",
    "userEmail": "lolita.boumelit@oecd.org",
    "artefact": "OECD.DAF.INV:FDI_DSD@FDI_FLOW_IND(1.0)",
    "sourceDataspace": null,
    "destinationDataspace": "qa:reset",
    "sourceData": "FDI_DATA_FLOW_IND_01.07 (1).csv",
    "submissionTime": "2022-07-05T13:20:17.667",
    "executionStart": "2022-07-05T13:20:17.947",
    "executionEnd": "2022-07-05T13:20:24.853",
    "executionStatus": "Completed",
    "outcome": "Success",
    "logs": [
      {
        "id": 70,
        "userEmail": null,
        "date": "2022-07-05T13:20:17.663",
        "level": "NOTICE",
        "server": "transfer-689669cb74-cm2jg",
        "logger": "DotStatServices.Transfer.Controllers.ImportController+<Import>d__22`1.MoveNext",
        "message": "The request with ID 70 was successfully registered.",
        "exception": ""
      },
      {
        "id": 70,
        "userEmail": null,
        "date": "2022-07-05T13:20:18.443",
        "level": "NOTICE",
        "server": "transfer-689669cb74-cm2jg",
        "logger": "DotStat.Db.Service.DotStatDbService+<VerifyAndUpdateDsdMsd>d__29.MoveNext",
        "message": "Referential metadata defined by the metadata structure OECD:MSD_REF_METADATA(1.0) are being accepted for the underlying data structure OECD.DAF.INV:FDI_DSD(1.0).",
        "exception": ""
      },
      {
        "id": 70,
        "userEmail": null,
        "date": "2022-07-05T13:20:18.653",
        "level": "NOTICE",
        "server": "transfer-689669cb74-cm2jg",
        "logger": "DotStat.Transfer.Consumer.SqlConsumer+<SaveData>d__14.MoveNext",
        "message": "Processing... Reading & validating data",
        "exception": ""
      },
      {
        "id": 70,
        "userEmail": null,
        "date": "2022-07-05T13:20:20.02",
        "level": "NOTICE",
        "server": "transfer-689669cb74-cm2jg",
        "logger": "DotStat.Db.Repository.SqlServer.SqlDataStoreRepository+<BulkInsertData>d__1.MoveNext",
        "message": "Reading the data source successfully finished. 41898 row(s) was/were read from the data source.",
        "exception": ""
      },
      {
        "id": 70,
        "userEmail": null,
        "date": "2022-07-05T13:20:20.023",
        "level": "NOTICE",
        "server": "transfer-689669cb74-cm2jg",
        "logger": "DotStat.Transfer.Consumer.SqlConsumer+<SaveData>d__14.MoveNext",
        "message": "Processing... Writing data",
        "exception": ""
      },
      {
        "id": 70,
        "userEmail": null,
        "date": "2022-07-05T13:20:21.657",
        "level": "NOTICE",
        "server": "transfer-689669cb74-cm2jg",
        "logger": "DotStat.Transfer.Consumer.SqlConsumer+<SaveData>d__14.MoveNext",
        "message": "A total of 41898 observation(s) has been processed.",
        "exception": ""
      },
      {
        "id": 70,
        "userEmail": null,
        "date": "2022-07-05T13:20:21.66",
        "level": "NOTICE",
        "server": "transfer-689669cb74-cm2jg",
        "logger": "DotStat.Transfer.Consumer.SqlConsumer+<Save>d__10.MoveNext",
        "message": "Processing... Calculating the new data availability",
        "exception": ""
      },
      {
        "id": 70,
        "userEmail": null,
        "date": "2022-07-05T13:20:24.86",
        "level": "NOTICE",
        "server": "transfer-689669cb74-cm2jg",
        "logger": "DotStat.Db.Service.DotStatDbService+<CloseTransaction>d__7.MoveNext",
        "message": "The request was successfully processed.",
        "exception": ""
      },
      {
        "id": 70,
        "userEmail": null,
        "date": "2022-07-05T13:20:24.87",
        "level": "NOTICE",
        "server": "transfer-689669cb74-cm2jg",
        "logger": "DotStat.Transfer.Manager.FileTransferManager`1+<Transfer>d__1.MoveNext",
        "message": "Streaming data from the source finished.",
        "exception": ""
      }
    ],
    "lastUpdated": "2022-07-05T13:20:24.853"
  },
  {
    "requestId": 71,
    "action": "Import",
    "userEmail": "lolita.boumelit@oecd.org",
    "artefact": "OECD:DF_NOT_DISPLAYED(4.2)",
    "sourceDataspace": null,
    "destinationDataspace": "qa:reset",
    "sourceData": "Data_for_NOT_DISPLAYED_example2.csv",
    "submissionTime": "2022-07-05T14:01:24.15",
    "executionStart": "2022-07-05T14:01:24.447",
    "executionEnd": "2022-07-05T14:01:27.753",
    "executionStatus": "Completed",
    "outcome": "Success",
    "logs": [
      {
        "id": 71,
        "userEmail": null,
        "date": "2022-07-05T14:01:24.147",
        "level": "NOTICE",
        "server": "transfer-689669cb74-cm2jg",
        "logger": "DotStatServices.Transfer.Controllers.ImportController+<Import>d__22`1.MoveNext",
        "message": "The request with ID 71 was successfully registered.",
        "exception": ""
      },
      {
        "id": 71,
        "userEmail": null,
        "date": "2022-07-05T14:01:24.72",
        "level": "NOTICE",
        "server": "transfer-689669cb74-cm2jg",
        "logger": "DotStat.Db.Service.DotStatDbService+<VerifyAndUpdateDsdMsd>d__29.MoveNext",
        "message": "Referential metadata defined by the metadata structure OECD:MSD_REF_METADATA(1.0) are being accepted for the underlying data structure OECD:DSD_NOT_DISPLAYED(4.2).",
        "exception": ""
      },
      {
        "id": 71,
        "userEmail": null,
        "date": "2022-07-05T14:01:24.893",
        "level": "NOTICE",
        "server": "transfer-689669cb74-cm2jg",
        "logger": "DotStat.Transfer.Consumer.SqlConsumer+<SaveData>d__14.MoveNext",
        "message": "Processing... Reading & validating data",
        "exception": ""
      },
      {
        "id": 71,
        "userEmail": null,
        "date": "2022-07-05T14:01:24.923",
        "level": "NOTICE",
        "server": "transfer-689669cb74-cm2jg",
        "logger": "DotStat.Db.Repository.SqlServer.SqlDataStoreRepository+<BulkInsertData>d__1.MoveNext",
        "message": "Reading the data source successfully finished. 650 row(s) was/were read from the data source.",
        "exception": ""
      },
      {
        "id": 71,
        "userEmail": null,
        "date": "2022-07-05T14:01:24.93",
        "level": "NOTICE",
        "server": "transfer-689669cb74-cm2jg",
        "logger": "DotStat.Transfer.Consumer.SqlConsumer+<SaveData>d__14.MoveNext",
        "message": "Processing... Writing data",
        "exception": ""
      },
      {
        "id": 71,
        "userEmail": null,
        "date": "2022-07-05T14:01:25.103",
        "level": "NOTICE",
        "server": "transfer-689669cb74-cm2jg",
        "logger": "DotStat.Transfer.Consumer.SqlConsumer+<SaveData>d__14.MoveNext",
        "message": "A total of 650 observation(s) has been processed.",
        "exception": ""
      },
      {
        "id": 71,
        "userEmail": null,
        "date": "2022-07-05T14:01:25.107",
        "level": "NOTICE",
        "server": "transfer-689669cb74-cm2jg",
        "logger": "DotStat.Transfer.Consumer.SqlConsumer+<Save>d__10.MoveNext",
        "message": "Processing... Calculating the new data availability",
        "exception": ""
      },
      {
        "id": 71,
        "userEmail": null,
        "date": "2022-07-05T14:01:27.76",
        "level": "NOTICE",
        "server": "transfer-689669cb74-cm2jg",
        "logger": "DotStat.Db.Service.DotStatDbService+<CloseTransaction>d__7.MoveNext",
        "message": "The request was successfully processed.",
        "exception": ""
      },
      {
        "id": 71,
        "userEmail": null,
        "date": "2022-07-05T14:01:27.763",
        "level": "NOTICE",
        "server": "transfer-689669cb74-cm2jg",
        "logger": "DotStat.Transfer.Manager.FileTransferManager`1+<Transfer>d__1.MoveNext",
        "message": "Streaming data from the source finished.",
        "exception": ""
      }
    ],
    "lastUpdated": "2022-07-05T14:01:27.753"
  },
  {
    "requestId": 73,
    "action": "CleanupMappingSets",
    "userEmail": "lolita.boumelit@oecd.org",
    "artefact": "OECD:DF_NOT_DISPLAYED(4.2)",
    "sourceDataspace": null,
    "destinationDataspace": "qa:reset",
    "sourceData": null,
    "submissionTime": "2022-07-05T14:09:24.84",
    "executionStart": "2022-07-05T14:09:24.85",
    "executionEnd": "2022-07-05T14:09:26.563",
    "executionStatus": "Completed",
    "outcome": "Success",
    "logs": [
      {
        "id": 73,
        "userEmail": null,
        "date": "2022-07-05T14:09:24.83",
        "level": "NOTICE",
        "server": "transfer-689669cb74-cm2jg",
        "logger": "DotStat.Transfer.Manager.CommonManager.GetDataflow",
        "message": "The structure information of dataflow OECD:DF_NOT_DISPLAYED(4.2) was successfully loaded from dataspace qa:reset.",
        "exception": ""
      }
    ],
    "lastUpdated": "2022-07-05T14:09:26.563"
  },
  {
    "requestId": 74,
    "action": "CleanupDsd",
    "userEmail": "lolita.boumelit@oecd.org",
    "artefact": "OECD:DSD_NOT_DISPLAYED(4.2)",
    "sourceDataspace": null,
    "destinationDataspace": "qa:reset",
    "sourceData": null,
    "submissionTime": "2022-07-05T14:09:27.793",
    "executionStart": "2022-07-05T14:09:27.81",
    "executionEnd": "2022-07-05T14:09:28.22",
    "executionStatus": "Completed",
    "outcome": "None",
    "logs": [],
    "lastUpdated": "2022-07-05T14:09:28.22"
  },
  {
    "requestId": 75,
    "action": "Import",
    "userEmail": "lolita.boumelit@oecd.org",
    "artefact": "OECD:DF_NOT_DISPLAYED(4.2)",
    "sourceDataspace": null,
    "destinationDataspace": "qa:reset",
    "sourceData": "Data_for_NOT_DISPLAYED_example2.csv",
    "submissionTime": "2022-07-05T14:15:08.19",
    "executionStart": "2022-07-05T14:15:08.63",
    "executionEnd": "2022-07-05T14:15:12.947",
    "executionStatus": "Completed",
    "outcome": "Success",
    "logs": [
      {
        "id": 75,
        "userEmail": null,
        "date": "2022-07-05T14:15:08.187",
        "level": "NOTICE",
        "server": "transfer-689669cb74-cm2jg",
        "logger": "DotStatServices.Transfer.Controllers.ImportController+<Import>d__22`1.MoveNext",
        "message": "The request with ID 75 was successfully registered.",
        "exception": ""
      },
      {
        "id": 75,
        "userEmail": null,
        "date": "2022-07-05T14:15:09.043",
        "level": "NOTICE",
        "server": "transfer-689669cb74-cm2jg",
        "logger": "DotStat.Db.Service.DotStatDbService+<VerifyAndUpdateDsdMsd>d__29.MoveNext",
        "message": "Referential metadata defined by the metadata structure OECD:MSD_REF_METADATA(1.0) are being accepted for the underlying data structure OECD:DSD_NOT_DISPLAYED(4.2).",
        "exception": ""
      },
      {
        "id": 75,
        "userEmail": null,
        "date": "2022-07-05T14:15:09.203",
        "level": "NOTICE",
        "server": "transfer-689669cb74-cm2jg",
        "logger": "DotStat.Transfer.Consumer.SqlConsumer+<SaveData>d__14.MoveNext",
        "message": "Processing... Reading & validating data",
        "exception": ""
      },
      {
        "id": 75,
        "userEmail": null,
        "date": "2022-07-05T14:15:09.237",
        "level": "NOTICE",
        "server": "transfer-689669cb74-cm2jg",
        "logger": "DotStat.Db.Repository.SqlServer.SqlDataStoreRepository+<BulkInsertData>d__1.MoveNext",
        "message": "Reading the data source successfully finished. 650 row(s) was/were read from the data source.",
        "exception": ""
      },
      {
        "id": 75,
        "userEmail": null,
        "date": "2022-07-05T14:15:09.24",
        "level": "NOTICE",
        "server": "transfer-689669cb74-cm2jg",
        "logger": "DotStat.Transfer.Consumer.SqlConsumer+<SaveData>d__14.MoveNext",
        "message": "Processing... Writing data",
        "exception": ""
      },
      {
        "id": 75,
        "userEmail": null,
        "date": "2022-07-05T14:15:09.403",
        "level": "NOTICE",
        "server": "transfer-689669cb74-cm2jg",
        "logger": "DotStat.Transfer.Consumer.SqlConsumer+<SaveData>d__14.MoveNext",
        "message": "A total of 650 observation(s) has been processed.",
        "exception": ""
      },
      {
        "id": 75,
        "userEmail": null,
        "date": "2022-07-05T14:15:09.407",
        "level": "NOTICE",
        "server": "transfer-689669cb74-cm2jg",
        "logger": "DotStat.Transfer.Consumer.SqlConsumer+<Save>d__10.MoveNext",
        "message": "Processing... Calculating the new data availability",
        "exception": ""
      },
      {
        "id": 75,
        "userEmail": null,
        "date": "2022-07-05T14:15:12.953",
        "level": "NOTICE",
        "server": "transfer-689669cb74-cm2jg",
        "logger": "DotStat.Db.Service.DotStatDbService+<CloseTransaction>d__7.MoveNext",
        "message": "The request was successfully processed.",
        "exception": ""
      },
      {
        "id": 75,
        "userEmail": null,
        "date": "2022-07-05T14:15:12.96",
        "level": "NOTICE",
        "server": "transfer-689669cb74-cm2jg",
        "logger": "DotStat.Transfer.Manager.FileTransferManager`1+<Transfer>d__1.MoveNext",
        "message": "Streaming data from the source finished.",
        "exception": ""
      }
    ],
    "lastUpdated": "2022-07-05T14:15:12.947"
  },
  {
    "requestId": 76,
    "action": "CleanupMappingSets",
    "userEmail": "lolita.boumelit@oecd.org",
    "artefact": "OECD:DF_NOT_DISPLAYED(4.2)",
    "sourceDataspace": null,
    "destinationDataspace": "qa:reset",
    "sourceData": null,
    "submissionTime": "2022-07-05T14:19:19.11",
    "executionStart": "2022-07-05T14:19:19.123",
    "executionEnd": "2022-07-05T14:19:20.797",
    "executionStatus": "Completed",
    "outcome": "Success",
    "logs": [
      {
        "id": 76,
        "userEmail": null,
        "date": "2022-07-05T14:19:19.1",
        "level": "NOTICE",
        "server": "transfer-689669cb74-cm2jg",
        "logger": "DotStat.Transfer.Manager.CommonManager.GetDataflow",
        "message": "The structure information of dataflow OECD:DF_NOT_DISPLAYED(4.2) was successfully loaded from dataspace qa:reset.",
        "exception": ""
      }
    ],
    "lastUpdated": "2022-07-05T14:19:20.797"
  },
  {
    "requestId": 77,
    "action": "CleanupDsd",
    "userEmail": "lolita.boumelit@oecd.org",
    "artefact": "OECD:DSD_NOT_DISPLAYED(4.2)",
    "sourceDataspace": null,
    "destinationDataspace": "qa:reset",
    "sourceData": null,
    "submissionTime": "2022-07-05T14:19:21.73",
    "executionStart": "2022-07-05T14:19:21.737",
    "executionEnd": "2022-07-05T14:19:22.077",
    "executionStatus": "Completed",
    "outcome": "None",
    "logs": [],
    "lastUpdated": "2022-07-05T14:19:22.077"
  },
  {
    "requestId": 79,
    "action": "Import",
    "userEmail": "lolita.boumelit@oecd.org",
    "artefact": "OECD:DF_NOT_DISPLAYED(4.2)",
    "sourceDataspace": null,
    "destinationDataspace": "qa:reset",
    "sourceData": "Data_for_NOT_DISPLAYED_example2.csv",
    "submissionTime": "2022-07-05T14:20:33.25",
    "executionStart": "2022-07-05T14:20:33.39",
    "executionEnd": "2022-07-05T14:20:36.383",
    "executionStatus": "Completed",
    "outcome": "Success",
    "logs": [
      {
        "id": 79,
        "userEmail": null,
        "date": "2022-07-05T14:20:33.25",
        "level": "NOTICE",
        "server": "transfer-689669cb74-cm2jg",
        "logger": "DotStatServices.Transfer.Controllers.ImportController+<Import>d__22`1.MoveNext",
        "message": "The request with ID 79 was successfully registered.",
        "exception": ""
      },
      {
        "id": 79,
        "userEmail": null,
        "date": "2022-07-05T14:20:33.623",
        "level": "NOTICE",
        "server": "transfer-689669cb74-cm2jg",
        "logger": "DotStat.Db.Service.DotStatDbService+<VerifyAndUpdateDsdMsd>d__29.MoveNext",
        "message": "Referential metadata defined by the metadata structure OECD:MSD_REF_METADATA(1.0) are being accepted for the underlying data structure OECD:DSD_NOT_DISPLAYED(4.2).",
        "exception": ""
      },
      {
        "id": 79,
        "userEmail": null,
        "date": "2022-07-05T14:20:33.803",
        "level": "NOTICE",
        "server": "transfer-689669cb74-cm2jg",
        "logger": "DotStat.Transfer.Consumer.SqlConsumer+<SaveData>d__14.MoveNext",
        "message": "Processing... Reading & validating data",
        "exception": ""
      },
      {
        "id": 79,
        "userEmail": null,
        "date": "2022-07-05T14:20:33.867",
        "level": "NOTICE",
        "server": "transfer-689669cb74-cm2jg",
        "logger": "DotStat.Db.Repository.SqlServer.SqlDataStoreRepository+<BulkInsertData>d__1.MoveNext",
        "message": "Reading the data source successfully finished. 650 row(s) was/were read from the data source.",
        "exception": ""
      },
      {
        "id": 79,
        "userEmail": null,
        "date": "2022-07-05T14:20:33.87",
        "level": "NOTICE",
        "server": "transfer-689669cb74-cm2jg",
        "logger": "DotStat.Transfer.Consumer.SqlConsumer+<SaveData>d__14.MoveNext",
        "message": "Processing... Writing data",
        "exception": ""
      },
      {
        "id": 79,
        "userEmail": null,
        "date": "2022-07-05T14:20:34.053",
        "level": "NOTICE",
        "server": "transfer-689669cb74-cm2jg",
        "logger": "DotStat.Transfer.Consumer.SqlConsumer+<SaveData>d__14.MoveNext",
        "message": "A total of 650 observation(s) has been processed.",
        "exception": ""
      },
      {
        "id": 79,
        "userEmail": null,
        "date": "2022-07-05T14:20:34.06",
        "level": "NOTICE",
        "server": "transfer-689669cb74-cm2jg",
        "logger": "DotStat.Transfer.Consumer.SqlConsumer+<Save>d__10.MoveNext",
        "message": "Processing... Calculating the new data availability",
        "exception": ""
      },
      {
        "id": 79,
        "userEmail": null,
        "date": "2022-07-05T14:20:36.393",
        "level": "NOTICE",
        "server": "transfer-689669cb74-cm2jg",
        "logger": "DotStat.Db.Service.DotStatDbService+<CloseTransaction>d__7.MoveNext",
        "message": "The request was successfully processed.",
        "exception": ""
      },
      {
        "id": 79,
        "userEmail": null,
        "date": "2022-07-05T14:20:36.397",
        "level": "NOTICE",
        "server": "transfer-689669cb74-cm2jg",
        "logger": "DotStat.Transfer.Manager.FileTransferManager`1+<Transfer>d__1.MoveNext",
        "message": "Streaming data from the source finished.",
        "exception": ""
      }
    ],
    "lastUpdated": "2022-07-05T14:20:36.383"
  },
  {
    "requestId": 80,
    "action": "Import",
    "userEmail": "lolita.boumelit@oecd.org",
    "artefact": "OECD:TEST_DF(4.2)",
    "sourceDataspace": null,
    "destinationDataspace": "qa:reset",
    "sourceData": "OECD-TEST-4.2-AUS-data.csv",
    "submissionTime": "2022-07-05T14:30:03.813",
    "executionStart": "2022-07-05T14:30:04.34",
    "executionEnd": "2022-07-05T14:30:07.05",
    "executionStatus": "Completed",
    "outcome": "Warning",
    "logs": [
      {
        "id": 80,
        "userEmail": null,
        "date": "2022-07-05T14:30:03.81",
        "level": "NOTICE",
        "server": "transfer-689669cb74-cm2jg",
        "logger": "DotStatServices.Transfer.Controllers.ImportController+<Import>d__22`1.MoveNext",
        "message": "The request with ID 80 was successfully registered.",
        "exception": ""
      },
      {
        "id": 80,
        "userEmail": null,
        "date": "2022-07-05T14:30:04.353",
        "level": "WARN",
        "server": "transfer-689669cb74-cm2jg",
        "logger": "DotStat.Transfer.Manager.TransferManager`1.HasComponentsToProcess",
        "message": "WARN: The following data structure component(s) is/are not included in the uploaded data and will not be updated: TIME_FORMAT, UNIT, REFERENCEPERIOD, POWERCODE",
        "exception": ""
      },
      {
        "id": 80,
        "userEmail": null,
        "date": "2022-07-05T14:30:04.667",
        "level": "NOTICE",
        "server": "transfer-689669cb74-cm2jg",
        "logger": "DotStat.Db.Service.DotStatDbService+<VerifyAndUpdateDsdMsd>d__29.MoveNext",
        "message": "Referential metadata defined by the metadata structure OECD:MSD_OECD_TEST(4.2) are being accepted for the underlying data structure OECD:TEST(4.2).",
        "exception": ""
      },
      {
        "id": 80,
        "userEmail": null,
        "date": "2022-07-05T14:30:04.81",
        "level": "NOTICE",
        "server": "transfer-689669cb74-cm2jg",
        "logger": "DotStat.Transfer.Consumer.SqlConsumer+<SaveData>d__14.MoveNext",
        "message": "Processing... Reading & validating data",
        "exception": ""
      },
      {
        "id": 80,
        "userEmail": null,
        "date": "2022-07-05T14:30:04.833",
        "level": "NOTICE",
        "server": "transfer-689669cb74-cm2jg",
        "logger": "DotStat.Db.Repository.SqlServer.SqlDataStoreRepository+<BulkInsertData>d__1.MoveNext",
        "message": "Reading the data source successfully finished. 224 row(s) was/were read from the data source.",
        "exception": ""
      },
      {
        "id": 80,
        "userEmail": null,
        "date": "2022-07-05T14:30:04.837",
        "level": "NOTICE",
        "server": "transfer-689669cb74-cm2jg",
        "logger": "DotStat.Transfer.Consumer.SqlConsumer+<SaveData>d__14.MoveNext",
        "message": "Processing... Writing data",
        "exception": ""
      },
      {
        "id": 80,
        "userEmail": null,
        "date": "2022-07-05T14:30:04.967",
        "level": "NOTICE",
        "server": "transfer-689669cb74-cm2jg",
        "logger": "DotStat.Transfer.Consumer.SqlConsumer+<SaveData>d__14.MoveNext",
        "message": "A total of 224 observation(s) has been processed.",
        "exception": ""
      },
      {
        "id": 80,
        "userEmail": null,
        "date": "2022-07-05T14:30:04.97",
        "level": "NOTICE",
        "server": "transfer-689669cb74-cm2jg",
        "logger": "DotStat.Transfer.Consumer.SqlConsumer+<Save>d__10.MoveNext",
        "message": "Processing... Calculating the new data availability",
        "exception": ""
      },
      {
        "id": 80,
        "userEmail": null,
        "date": "2022-07-05T14:30:07.057",
        "level": "NOTICE",
        "server": "transfer-689669cb74-cm2jg",
        "logger": "DotStat.Db.Service.DotStatDbService+<CloseTransaction>d__7.MoveNext",
        "message": "The request was successfully processed.",
        "exception": ""
      },
      {
        "id": 80,
        "userEmail": null,
        "date": "2022-07-05T14:30:07.06",
        "level": "NOTICE",
        "server": "transfer-689669cb74-cm2jg",
        "logger": "DotStat.Transfer.Manager.FileTransferManager`1+<Transfer>d__1.MoveNext",
        "message": "Streaming data from the source finished.",
        "exception": ""
      }
    ],
    "lastUpdated": "2022-07-05T14:30:07.05"
  },
  {
    "requestId": 81,
    "action": "CleanupMappingSets",
    "userEmail": "lolita.boumelit@oecd.org",
    "artefact": "OECD:TEST_DF(4.2)",
    "sourceDataspace": null,
    "destinationDataspace": "qa:reset",
    "sourceData": null,
    "submissionTime": "2022-07-05T14:32:45.807",
    "executionStart": "2022-07-05T14:32:45.82",
    "executionEnd": "2022-07-05T14:32:47.387",
    "executionStatus": "Completed",
    "outcome": "Success",
    "logs": [
      {
        "id": 81,
        "userEmail": null,
        "date": "2022-07-05T14:32:45.8",
        "level": "NOTICE",
        "server": "transfer-689669cb74-cm2jg",
        "logger": "DotStat.Transfer.Manager.CommonManager.GetDataflow",
        "message": "The structure information of dataflow OECD:TEST_DF(4.2) was successfully loaded from dataspace qa:reset.",
        "exception": ""
      }
    ],
    "lastUpdated": "2022-07-05T14:32:47.387"
  },
  {
    "requestId": 82,
    "action": "CleanupDsd",
    "userEmail": "lolita.boumelit@oecd.org",
    "artefact": "OECD:TEST(4.2)",
    "sourceDataspace": null,
    "destinationDataspace": "qa:reset",
    "sourceData": null,
    "submissionTime": "2022-07-05T14:32:48.847",
    "executionStart": "2022-07-05T14:32:48.86",
    "executionEnd": "2022-07-05T14:32:49.22",
    "executionStatus": "Completed",
    "outcome": "None",
    "logs": [],
    "lastUpdated": "2022-07-05T14:32:49.22"
  },
  {
    "requestId": 83,
    "action": "Import",
    "userEmail": "lolita.boumelit@oecd.org",
    "artefact": "OECD:TEST_DF(4.2)",
    "sourceDataspace": null,
    "destinationDataspace": "qa:reset",
    "sourceData": "OECD-TEST-4.2-AUS-data.csv",
    "submissionTime": "2022-07-05T14:34:18.647",
    "executionStart": "2022-07-05T14:34:19.023",
    "executionEnd": "2022-07-05T14:34:21.517",
    "executionStatus": "Completed",
    "outcome": "Warning",
    "logs": [
      {
        "id": 83,
        "userEmail": null,
        "date": "2022-07-05T14:34:18.647",
        "level": "NOTICE",
        "server": "transfer-689669cb74-cm2jg",
        "logger": "DotStatServices.Transfer.Controllers.ImportController+<Import>d__22`1.MoveNext",
        "message": "The request with ID 83 was successfully registered.",
        "exception": ""
      },
      {
        "id": 83,
        "userEmail": null,
        "date": "2022-07-05T14:34:19.037",
        "level": "WARN",
        "server": "transfer-689669cb74-cm2jg",
        "logger": "DotStat.Transfer.Manager.TransferManager`1.HasComponentsToProcess",
        "message": "WARN: The following data structure component(s) is/are not included in the uploaded data and will not be updated: TIME_FORMAT, UNIT, REFERENCEPERIOD, POWERCODE",
        "exception": ""
      },
      {
        "id": 83,
        "userEmail": null,
        "date": "2022-07-05T14:34:19.277",
        "level": "NOTICE",
        "server": "transfer-689669cb74-cm2jg",
        "logger": "DotStat.Db.Service.DotStatDbService+<VerifyAndUpdateDsdMsd>d__29.MoveNext",
        "message": "Referential metadata defined by the metadata structure OECD:MSD_OECD_TEST(4.2) are being accepted for the underlying data structure OECD:TEST(4.2).",
        "exception": ""
      },
      {
        "id": 83,
        "userEmail": null,
        "date": "2022-07-05T14:34:19.427",
        "level": "NOTICE",
        "server": "transfer-689669cb74-cm2jg",
        "logger": "DotStat.Transfer.Consumer.SqlConsumer+<SaveData>d__14.MoveNext",
        "message": "Processing... Reading & validating data",
        "exception": ""
      },
      {
        "id": 83,
        "userEmail": null,
        "date": "2022-07-05T14:34:19.453",
        "level": "NOTICE",
        "server": "transfer-689669cb74-cm2jg",
        "logger": "DotStat.Db.Repository.SqlServer.SqlDataStoreRepository+<BulkInsertData>d__1.MoveNext",
        "message": "Reading the data source successfully finished. 224 row(s) was/were read from the data source.",
        "exception": ""
      },
      {
        "id": 83,
        "userEmail": null,
        "date": "2022-07-05T14:34:19.457",
        "level": "NOTICE",
        "server": "transfer-689669cb74-cm2jg",
        "logger": "DotStat.Transfer.Consumer.SqlConsumer+<SaveData>d__14.MoveNext",
        "message": "Processing... Writing data",
        "exception": ""
      },
      {
        "id": 83,
        "userEmail": null,
        "date": "2022-07-05T14:34:19.617",
        "level": "NOTICE",
        "server": "transfer-689669cb74-cm2jg",
        "logger": "DotStat.Transfer.Consumer.SqlConsumer+<SaveData>d__14.MoveNext",
        "message": "A total of 224 observation(s) has been processed.",
        "exception": ""
      },
      {
        "id": 83,
        "userEmail": null,
        "date": "2022-07-05T14:34:19.62",
        "level": "NOTICE",
        "server": "transfer-689669cb74-cm2jg",
        "logger": "DotStat.Transfer.Consumer.SqlConsumer+<Save>d__10.MoveNext",
        "message": "Processing... Calculating the new data availability",
        "exception": ""
      },
      {
        "id": 83,
        "userEmail": null,
        "date": "2022-07-05T14:34:21.523",
        "level": "NOTICE",
        "server": "transfer-689669cb74-cm2jg",
        "logger": "DotStat.Db.Service.DotStatDbService+<CloseTransaction>d__7.MoveNext",
        "message": "The request was successfully processed.",
        "exception": ""
      },
      {
        "id": 83,
        "userEmail": null,
        "date": "2022-07-05T14:34:21.527",
        "level": "NOTICE",
        "server": "transfer-689669cb74-cm2jg",
        "logger": "DotStat.Transfer.Manager.FileTransferManager`1+<Transfer>d__1.MoveNext",
        "message": "Streaming data from the source finished.",
        "exception": ""
      }
    ],
    "lastUpdated": "2022-07-05T14:34:21.517"
  }
]