{
    "meta": {
        "schema": "https://raw.githubusercontent.com/sdmx-twg/sdmx-json/master/data-message/tools/schemas/1.0/sdmx-json-data-schema.json",
        "id": "IREF476354",
        "prepared": "2023-06-23T15:51:42Z",
        "test": true,
        "contentLanguages": [
            "en"
        ],
        "sender": {
            "id": "Stable_-_DotStat_v8",
            "name": "unknown",
            "names": {
                "en": "unknown"
            }
        }
    },
    "data": {
        "dataSets": [
            {
                "structure": 0,
                "action": "Information",
                "links": [
                    {
                        "urn": "urn:sdmx:org.sdmx.infomodel.datastructure.DataStructure=OECD.DAF:DSD_DEBT_TRANS_DDOWN(1.0)",
                        "rel": "DataStructure"
                    }
                ],
                "annotations": [
                    0,
                    1,
                    2,
                    3,
                    4,
                    5,
                    6,
                    7,
                    8
                ],
                "observations": {
                    "0:0:0:0:0:0:0:0:0:0:0": [
                        500000000,
                        null,
                        null,
                        0,
                        null,
                        null,
                        0,
                        null,
                        0,
                        0,
                        0,
                        null,
                        0,
                        null,
                        null,
                        0,
                        null,
                        null,
                        null,
                        0,
                        0,
                        0,
                        0,
                        null,
                        null,
                        null
                    ],
                    "0:0:0:0:0:0:1:0:0:0:0": [
                        500000000,
                        null,
                        null,
                        0,
                        null,
                        null,
                        0,
                        null,
                        0,
                        0,
                        0,
                        null,
                        0,
                        null,
                        null,
                        0,
                        null,
                        null,
                        null,
                        0,
                        0,
                        0,
                        0,
                        null,
                        null,
                        null
                    ],
                    "0:0:0:0:0:0:2:0:0:0:0": [
                        500000000,
                        null,
                        null,
                        0,
                        null,
                        null,
                        0,
                        null,
                        0,
                        0,
                        0,
                        null,
                        0,
                        null,
                        null,
                        0,
                        null,
                        null,
                        null,
                        0,
                        0,
                        0,
                        0,
                        null,
                        null,
                        null
                    ],
                    "0:0:0:0:0:0:3:0:0:0:0": [
                        500000000,
                        null,
                        null,
                        0,
                        null,
                        null,
                        0,
                        null,
                        0,
                        0,
                        0,
                        null,
                        0,
                        null,
                        null,
                        0,
                        null,
                        null,
                        null,
                        0,
                        0,
                        0,
                        0,
                        null,
                        null,
                        null
                    ],
                    "0:0:0:0:0:0:4:0:0:0:0": [
                        500000000,
                        null,
                        null,
                        0,
                        null,
                        null,
                        0,
                        null,
                        0,
                        0,
                        0,
                        null,
                        0,
                        null,
                        null,
                        0,
                        null,
                        null,
                        null,
                        0,
                        0,
                        0,
                        0,
                        null,
                        null,
                        null
                    ],
                    "0:0:0:0:0:0:5:0:0:0:0": [
                        500000000,
                        null,
                        null,
                        0,
                        null,
                        null,
                        0,
                        null,
                        0,
                        0,
                        0,
                        null,
                        0,
                        null,
                        null,
                        0,
                        null,
                        null,
                        null,
                        0,
                        0,
                        0,
                        0,
                        null,
                        null,
                        null
                    ],
                    "0:0:0:0:0:0:6:0:0:0:0": [
                        500000000,
                        null,
                        null,
                        0,
                        null,
                        null,
                        0,
                        null,
                        0,
                        0,
                        0,
                        null,
                        0,
                        null,
                        null,
                        0,
                        null,
                        null,
                        null,
                        0,
                        0,
                        0,
                        0,
                        null,
                        null,
                        null
                    ],
                    "0:0:0:0:0:0:5:0:0:0:1": [
                        500000000,
                        null,
                        null,
                        0,
                        null,
                        null,
                        0,
                        null,
                        0,
                        0,
                        0,
                        null,
                        0,
                        null,
                        null,
                        0,
                        null,
                        null,
                        null,
                        0,
                        0,
                        0,
                        0,
                        null,
                        null,
                        null
                    ]
                }
            }
        ],
        "structures": [
            {
                "name": "Debt Transparency Drilldown",
                "names": {
                    "en": "Debt Transparency Drilldown"
                },
                "dimensions": {
                "dataset": [],
                    "series": [],
                    "observation": [
                        {
                            "id": "DD_ID",
                            "name": "DD ID",
                            "names": {
                                "en": "DD ID"
                            },
                            "keyPosition": 0,
                            "roles": [
                                "DD_ID"
                            ],
                            "values": [
                                {
                                    "id": "10",
                                    "order": 9,
                                    "name": "10",
                                    "names": {
                                        "en": "10"
                                    }
                                },
                                {
                                    "id": "16",
                                    "order": 15,
                                    "name": "16",
                                    "names": {
                                        "en": "16"
                                    }
                                }
                            ]
                        },
                        {
                            "id": "REF_AREA",
                            "name": "Reference area",
                            "names": {
                                "en": "Reference area"
                            },
                            "keyPosition": 1,
                            "roles": [
                                "REF_AREA"
                            ],
                            "values": [
                                {
                                    "id": "TUR",
                                    "order": 63,
                                    "name": "Turkey",
                                    "names": {
                                        "en": "Turkey"
                                    }
                                }
                            ]
                        },
                        {
                            "id": "RECIPIENT_TYPE",
                            "name": "Recipient type",
                            "names": {
                                "en": "Recipient type"
                            },
                            "keyPosition": 2,
                            "roles": [
                                "RECIPIENT_TYPE"
                            ],
                            "values": [
                                {
                                    "id": "STATE_ENT",
                                    "order": 4,
                                    "name": "State-Owned Enterprise",
                                    "names": {
                                        "en": "State-Owned Enterprise"
                                    },
                                "parent": "_T"
                                }
                            ]
                        },
                        {
                            "id": "FIN_TYPE",
                            "name": "Financing type",
                            "names": {
                                "en": "Financing type"
                            },
                            "keyPosition": 3,
                            "roles": [
                                "FIN_TYPE"
                            ],
                            "values": [
                                {
                                    "id": "BONDS",
                                    "order": 4,
                                    "name": "Bonds",
                                    "names": {
                                        "en": "Bonds"
                                    },
                                "parent": "_T"
                                }
                            ]
                        },
                        {
                            "id": "CURRENCY",
                            "name": "Currency",
                            "names": {
                                "en": "Currency"
                            },
                            "keyPosition": 4,
                            "roles": [
                                "CURRENCY"
                            ],
                            "values": [
                                {
                                    "id": "USD",
                                    "order": 142,
                                    "name": "United States dollar",
                                    "names": {
                                        "en": "United States dollar"
                                    }
                                }
                            ]
                        },
                        {
                            "id": "INTEREST_RATE",
                            "name": "Interest rate",
                            "names": {
                                "en": "Interest rate"
                            },
                            "keyPosition": 5,
                            "roles": [
                                "INTEREST_RATE"
                            ],
                            "values": [
                                {
                                    "id": "IRGT3T8",
                                    "order": 4,
                                    "name": "Greater than 3% and less than or equal to 8% p.a.",
                                    "names": {
                                        "en": "Greater than 3% and less than or equal to 8% p.a."
                                    }
                                }
                            ]
                        },
                        {
                            "id": "INTEREST_RATE_TYPE",
                            "name": "Interest rate type",
                            "names": {
                                "en": "Interest rate type"
                            },
                            "keyPosition": 6,
                            "roles": [
                                "INTEREST_RATE_TYPE"
                            ],
                            "values": [
                                {
                                "id": "ROOT_VALUE_1",
                                "order": 0,
                                "name": "ROOT_VALUE_1",
                                "names": {
                                    "en": "ROOT_VALUE_1"
                                }
                            },
                            {
                                "id": "ROOT_VALUE_2",
                                "order": 1,
                                "name": "ROOT_VALUE_2",
                                "names": {
                                    "en": "ROOT_VALUE_2"
                                }
                            },
                            {
                                "id": "ROOT_VALUE_3",
                                    "order": 2,
                                "name": "ROOT_VALUE_3",
                                "names": {
                                    "en": "ROOT_VALUE_3"
                                }
                            },
                            {
                                "id": "LEVEL_1_VALUE_1",
                                "order": 3,
                                "name": "LEVEL_1_VALUE_1",
                                "names": {
                                    "en": "LEVEL_1_VALUE_1"
                                },
                                "parent": "ROOT_VALUE_1"
                            },
                            {
                                "id": "LEVEL_1_VALUE_2",
                                "order": 4,
                                "name": "LEVEL_1_VALUE_2",
                                "names": {
                                    "en": "LEVEL_1_VALUE_2"
                                },
                                "parent": "ROOT_VALUE_1"
                            },
                            {
                                "id": "LEVEL_2_VALUE_1",
                                "order": 5,
                                "name": "LEVEL_2_VALUE_1",
                                    "names": {
                                    "en": "LEVEL_2_VALUE_1"
                                    },
                                "parent": "LEVEL_1_VALUE_1"
                                },
                                {
                                "id": "LEVEL_2_VALUE_2",
                                "order": 6,
                                "name": "LEVEL_2_VALUE_2",
                                    "names": {
                                    "en": "LEVEL_2_VALUE_2"
                                },
                                "parent": "LEVEL_1_VALUE_1"
                                }
                            ]
                        },
                        {
                            "id": "MEASURE",
                            "name": "Measure",
                            "names": {
                                "en": "Measure"
                            },
                            "keyPosition": 7,
                            "roles": [
                                "MEASURE"
                            ],
                            "values": [
                                {
                                    "id": "GDO",
                                    "order": 15,
                                    "name": "Gross debt outstanding (USD)",
                                    "names": {
                                        "en": "Gross debt outstanding (USD)"
                                    },
                                    "annotations": [
                                        9
                                    ]
                                }
                            ]
                        },
                        {
                            "id": "DD_DIM",
                            "name": "Drilldown technical dimension",
                            "names": {
                                "en": "Drilldown technical dimension"
                            },
                            "keyPosition": 8,
                            "roles": [
                                "DD_DIM"
                            ],
                            "values": [
                                {
                                    "id": "DD",
                                    "order": 1,
                                    "name": "Drilldown",
                                    "names": {
                                        "en": "Drilldown"
                                    }
                                }
                            ]
                        },
                        {
                            "id": "CLAIM_RANK",
                            "name": "Claim ranking",
                            "names": {
                                "en": "Claim ranking"
                            },
                            "keyPosition": 9,
                            "roles": [
                                "CLAIM_RANK"
                            ],
                            "values": [
                                {
                                    "id": "SEN_UNSEC",
                                    "order": 4,
                                    "name": "Senior Unsecured",
                                    "names": {
                                        "en": "Senior Unsecured"
                                    },
                                "parent": "_T"
                                }
                            ]
                        },
                        {
                            "id": "TIME_PERIOD",
                            "name": "Financing document datetime",
                            "names": {
                                "en": "Financing document datetime"
                            },
                            "keyPosition": 10,
                            "roles": [
                                "TIME_PERIOD"
                            ],
                            "values": [
                                {
                                    "start": "2022-01-01T00:00:00",
                                    "end": "2022-12-31T23:59:59",
                                    "id": "2022",
                                    "name": "2022",
                                    "names": {
                                        "en": "2022"
                                    }
                            },
                            {
                                "start": "2023-01-01T00:00:00",
                                "end": "2023-12-31T23:59:59",
                                "id": "2023",
                                "name": "2023",
                                "names": {
                                    "en": "2022"
                                }
                                }
                            ]
                        }
                    ]
                },
                "attributes": {
                    "dataSet": [],
                    "series": [],
                    "observation": [
                        {
                            "id": "RECIPIENT",
                            "name": "Recipient",
                            "names": {
                                "en": "Recipient"
                            },
                            "roles": [
                                "RECIPIENT"
                            ],
                            "relationship": {
                            "primaryMeasure": "OBS_VALUE"
                            },
                            "values": []
                        },
                        {
                            "id": "CREDIT_PROV",
                            "name": "Credit provider",
                            "names": {
                                "en": "Credit provider"
                            },
                            "roles": [
                                "CREDIT_PROV"
                            ],
                            "relationship": {
                            "primaryMeasure": "OBS_VALUE"
                            },
                            "values": []
                        },
                        {
                            "id": "LEAD_PROV",
                            "name": "Lead provider",
                            "names": {
                                "en": "Lead provider"
                            },
                            "roles": [
                                "LEAD_PROV"
                            ],
                            "relationship": {
                            "primaryMeasure": "OBS_VALUE"
                            },
                            "values": [
                                {
                                "id": "Bookrunner: Citi, Erste, ICBC, JPM, MUFG, QNB, Societe Generale",
                                "name": "Bookrunner: Citi, Erste, ICBC, JPM, MUFG, QNB, Societe Generale",
                                "names": {
                                    "en": "Bookrunner: Citi, Erste, ICBC, JPM, MUFG, QNB, Societe Generale"
                                }
                                },
                                {
                                "id": "Bookrunner: Citi, ICBC, ING, Mizuho, MUFG, Societe Generale, SMFG, Standard Chartered",
                                "name": "Bookrunner: Citi, ICBC, ING, Mizuho, MUFG, Societe Generale, SMFG, Standard Chartered",
                                "names": {
                                    "en": "Bookrunner: Citi, ICBC, ING, Mizuho, MUFG, Societe Generale, SMFG, Standard Chartered"
                                }
                                }
                            ]
                        },
                        {
                            "id": "CURRENCY_MULTI",
                            "name": "Multiple currencies",
                            "names": {
                                "en": "Multiple currencies"
                            },
                            "roles": [
                                "CURRENCY_MULTI"
                            ],
                            "relationship": {
                            "primaryMeasure": "OBS_VALUE"
                            },
                            "values": []
                        },
                        {
                            "id": "REF_RATE_BENCHMARK",
                            "name": "Reference rate benchmark",
                            "names": {
                                "en": "Reference rate benchmark"
                            },
                            "roles": [
                                "REF_RATE_BENCHMARK"
                            ],
                            "relationship": {
                            "primaryMeasure": "OBS_VALUE"
                            },
                            "values": []
                        },
                        {
                            "id": "ORIG_CURR_VALUE",
                            "name": "Gross amount in financing document's currency",
                            "names": {
                                "en": "Gross amount in financing document's currency"
                            },
                            "roles": [
                                "ORIG_CURR_VALUE"
                            ],
                            "relationship": {
                            "primaryMeasure": "OBS_VALUE"
                            },
                            "values": [
                                {
                                "id": "500000000",
                                "name": "500000000",
                                "names": {
                                    "en": "500000000"
                                }
                                },
                                {
                                "id": "750000000",
                                "name": "750000000",
                                "names": {
                                    "en": "750000000"
                                }
                                }
                            ]
                        },
                        {
                            "id": "GRACE_PERIOD",
                            "name": "Grace period",
                            "names": {
                                "en": "Grace period"
                            },
                            "roles": [
                                "GRACE_PERIOD"
                            ],
                            "relationship": {
                            "primaryMeasure": "OBS_VALUE"
                            },
                            "values": []
                        },
                        {
                            "id": "TRANS_REPAY",
                            "name": "Transaction repayment",
                            "names": {
                                "en": "Transaction repayment"
                            },
                            "roles": [
                                "TRANS_REPAY"
                            ],
                            "relationship": {
                            "primaryMeasure": "OBS_VALUE"
                            },
                            "values": [
                                {
                                    "id": "M",
                                    "order": 0,
                                    "name": "At maturity",
                                    "names": {
                                        "en": "At maturity"
                                    }
                                }
                            ]
                        },
                        {
                            "id": "FREQ",
                            "name": "Frequency of observation",
                            "names": {
                                "en": "Frequency of observation"
                            },
                            "roles": [
                                "FREQ"
                            ],
                            "relationship": {
                            "primaryMeasure": "OBS_VALUE"
                            },
                            "values": [
                                {
                                    "id": "S",
                                    "order": 1,
                                    "name": "Half-yearly, semester",
                                    "names": {
                                        "en": "Half-yearly, semester"
                                    }
                                }
                            ]
                        },
                        {
                            "id": "REPAY_PROFILE_TIME",
                            "name": "Repayment profile",
                            "names": {
                                "en": "Repayment profile"
                            },
                            "roles": [
                                "REPAY_PROFILE_TIME"
                            ],
                            "relationship": {
                            "primaryMeasure": "OBS_VALUE"
                            },
                            "values": [
                                {
                                "id": "2026-10-01",
                                "name": "2026-10-01",
                                "names": {
                                    "en": "2026-10-01"
                                }
                                },
                                {
                                "id": "2026-07-06",
                                "name": "2026-07-06",
                                "names": {
                                    "en": "2026-07-06"
                                }
                                }
                            ]
                        },
                        {
                            "id": "REPO_COLL",
                            "name": "Repo collateral",
                            "names": {
                                "en": "Repo collateral"
                            },
                            "roles": [
                                "REPO_COLL"
                            ],
                            "relationship": {
                            "primaryMeasure": "OBS_VALUE"
                            },
                            "values": []
                        },
                        {
                            "id": "FIN_PURPOSE",
                            "name": "Financing purpose",
                            "names": {
                                "en": "Financing purpose"
                            },
                            "roles": [
                                "FIN_PURPOSE"
                            ],
                            "relationship": {
                            "primaryMeasure": "OBS_VALUE"
                            },
                            "values": [
                                {
                                "id": "General corporate purposes",
                                "name": "General corporate purposes",
                                "names": {
                                    "en": "General corporate purposes"
                                }
                                }
                            ]
                        },
                        {
                            "id": "GUARANTOR_NAME",
                            "name": "Guarantor name",
                            "names": {
                                "en": "Guarantor name"
                            },
                            "roles": [
                                "GUARANTOR_NAME"
                            ],
                            "relationship": {
                            "primaryMeasure": "OBS_VALUE"
                            },
                            "values": []
                        },
                        {
                            "id": "GUARANTOR_BENEF",
                            "name": "Guarantee beneficiaries",
                            "names": {
                                "en": "Guarantee beneficiaries"
                            },
                            "roles": [
                                "GUARANTOR_BENEF"
                            ],
                            "relationship": {
                            "primaryMeasure": "OBS_VALUE"
                            },
                            "values": []
                        },
                        {
                            "id": "FIN_DOC_LAW",
                            "name": "Financing document law",
                            "names": {
                                "en": "Financing document law"
                            },
                            "roles": [
                                "FIN_DOC_LAW"
                            ],
                            "relationship": {
                            "primaryMeasure": "OBS_VALUE"
                            },
                            "values": [
                                {
                                "id": "England",
                                "name": "England",
                                "names": {
                                    "en": "England"
                                }
                                }
                            ]
                        },
                        {
                            "id": "WAIVER_IMMUN",
                            "name": "Waiver of immunity",
                            "names": {
                                "en": "Waiver of immunity"
                            },
                            "roles": [
                                "WAIVER_IMMUN"
                            ],
                            "relationship": {
                            "primaryMeasure": "OBS_VALUE"
                            },
                            "values": []
                        },
                        {
                            "id": "DISPUTE_RES_MECH",
                            "name": "Dispute resolution mechanism",
                            "names": {
                                "en": "Dispute resolution mechanism"
                            },
                            "roles": [
                                "DISPUTE_RES_MECH"
                            ],
                            "relationship": {
                            "primaryMeasure": "OBS_VALUE"
                            },
                            "values": []
                        },
                        {
                            "id": "EMBARGO_TIME",
                            "name": "Embargo time",
                            "names": {
                                "en": "Embargo time"
                            },
                            "roles": [
                                "EMBARGO_TIME"
                            ],
                            "relationship": {
                            "primaryMeasure": "OBS_VALUE"
                            },
                            "values": []
                        },
                        {
                            "id": "DATA_AVAIL",
                            "name": "Data availability",
                            "names": {
                                "en": "Data availability"
                            },
                            "roles": [
                                "DATA_AVAIL"
                            ],
                            "relationship": {
                            "primaryMeasure": "OBS_VALUE"
                            },
                            "values": [
                                {
                                    "id": "DLGC",
                                    "order": 1,
                                    "name": "Yes, it is available in Dealogic",
                                    "names": {
                                        "en": "Yes, it is available in Dealogic"
                                    }
                                }
                            ]
                        },
                        {
                            "id": "ISIN",
                            "name": "ISIN",
                            "names": {
                                "en": "ISIN"
                            },
                            "roles": [
                                "ISIN"
                            ],
                            "relationship": {
                            "primaryMeasure": "OBS_VALUE"
                            },
                            "values": [
                                {
                                "id": "XS2386558113",
                                "name": "XS2386558113",
                                "names": {
                                    "en": "XS2386558113"
                                }
                                },
                                {
                                "id": "XS2332876106",
                                "name": "XS2332876106",
                                "names": {
                                    "en": "XS2332876106"
                                }
                                }
                            ]
                        },
                        {
                            "id": "YIELD_MATURITY",
                            "name": "Yield to Maturity at issuance",
                            "names": {
                                "en": "Yield to Maturity at issuance"
                            },
                            "roles": [
                                "YIELD_MATURITY"
                            ],
                            "relationship": {
                            "primaryMeasure": "OBS_VALUE"
                            },
                            "values": [
                                {
                                "id": "0.05625",
                                "name": "0.05625",
                                "names": {
                                    "en": "0.05625"
                                }
                                },
                                {
                                "id": "0.05834",
                                "name": "0.05834",
                                "names": {
                                    "en": "0.05834"
                                }
                                }
                            ]
                        },
                        {
                            "id": "PRICE_ISSUANCE",
                            "name": "Price at issuance",
                            "names": {
                                "en": "Price at issuance"
                            },
                            "roles": [
                                "PRICE_ISSUANCE"
                            ],
                            "relationship": {
                            "primaryMeasure": "OBS_VALUE"
                            },
                            "values": [
                                {
                                "id": "99.454",
                                "name": "99.454",
                                "names": {
                                    "en": "99.454"
                                }
                                },
                                {
                                "id": "99.642",
                                "name": "99.642",
                                "names": {
                                    "en": "99.642"
                                }
                                }
                            ]
                        },
                        {
                            "id": "DEF_EVENT_COND",
                            "name": "Default event conditions",
                            "names": {
                                "en": "Default event conditions"
                            },
                            "roles": [
                                "DEF_EVENT_COND"
                            ],
                            "relationship": {
                            "primaryMeasure": "OBS_VALUE"
                            },
                            "values": []
                        },
                        {
                            "id": "TRANS_INSUR",
                            "name": "Transaction insurance",
                            "names": {
                                "en": "Transaction insurance"
                            },
                            "roles": [
                                "TRANS_INSUR"
                            ],
                            "relationship": {
                            "primaryMeasure": "OBS_VALUE"
                            },
                            "values": []
                        },
                        {
                            "id": "SUSTAINABILITY",
                            "name": "Sustainability",
                            "names": {
                                "en": "Sustainability"
                            },
                            "roles": [
                                "SUSTAINABILITY"
                            ],
                            "relationship": {
                            "primaryMeasure": "OBS_VALUE"
                            },
                            "values": []
                        }
                    ]
                },
                "annotations": [
                    {
                        "type": "NonProductionDataflow",
                        "text": "true",
                        "texts": {
                            "en": "true"
                        }
                    },
                    {
                        "id": "@SDMX",
                        "title": "CURRENCY",
                        "type": "LAYOUT_ROW"
                    },
                    {
                        "id": "@SDMX",
                        "title": "TIME_PERIOD,FREQ",
                        "type": "LAYOUT_COLUMN"
                    },
                    {
                        "id": "@SDMX",
                        "title": "REF_AREA",
                        "type": "LAYOUT_ROW_SECTION"
                    },
                    {
                        "id": "@SDMX",
                        "title": "DD_DIM",
                        "type": "DRILLDOWN"
                    },
                    {
                        "id": "@SDMX",
                        "title": "TIME_PERIOD,FIN_TYPE,CURRENCY,INTEREST_RATE,INTEREST_RATE_TYPE,FREQ,TRANS_REPAY,GRACE_PERIOD,REPAY_PROFILE_TIME,RECIPIENT,GUARANTOR_NAME,GUARANTOR_BENEF,TRANS_INSUR,CREDIT_PROV,LEAD_PROV,AMORT_FREQ",
                        "type": "DRILLDOWN_CONCEPTS"
                    },
                    {
                        "id": "@SDMX",
                        "title": "DD_ID,DD_DIM",
                        "type": "NOT_DISPLAYED"
                    },
                    {
                        "id": "@SDMX",
                        "title": "TIME_PERIOD_START=2000,FREQ=M,DD_DIM=_T",
                        "type": "DEFAULT"
                    },
                    {
                        "title": "4000",
                        "type": "MAXTEXTATTRIBUTELENGTH"
                    },
                    {
                        "id": "@SDMX",
                        "type": "ORDER",
                        "text": "10",
                        "texts": {
                            "en": "10"
                        }
                    }
                ]
            }
        ]
    },
    "errors": []
}