{
    "meta": {
        "schema": "https://raw.githubusercontent.com/sdmx-twg/sdmx-json/master/data-message/tools/schemas/2.0.0/sdmx-json-data-schema.json",
        "id": "IREF004680",
        "prepared": "2023-07-31T14:31:33Z",
        "test": true,
        "contentLanguages": [
            "en"
        ],
        "sender": {
            "id": "Reset_-_DotStat_v8",
            "name": "unknown",
            "names": {
                "en": "unknown"
            }
        }
    },
    "data": {
        "dataSets": [
            {
                "structure": 0,
                "action": "Information",
                "links": [
                    {
                        "urn": "urn:sdmx:org.sdmx.infomodel.datastructure.DataStructure=STATSNZ:CEN18_HOU_001(1.0)",
                        "rel": "DataStructure"
                    }
                ],
                "annotations": [
                    0,
                    1,
                    2,
                    3,
                    4
                ],
                "dimensionGroupAttributes": {
                    "~:~:~": [
                        0
                    ]
                }
            }
        ],
        "structures": [
            {
                "name": "Access to basic amenities (total responses) by sector of landlord, for households in rented occupied private dwellings, 2018 Census (RC, TA, SA2, DHB)",
                "names": {
                    "en": "Access to basic amenities (total responses) by sector of landlord, for households in rented occupied private dwellings, 2018 Census (RC, TA, SA2, DHB)"
                },
                "description": "<h4>Description</h4><p>Access to basic amenities (total responses) by sector of landlord, for households in rented occupied private dwellings, 2018 Census (RC, TA, SA2, DHB)</p><p><p>Access to basic amenities variable is rated as moderate quality. <a href=\"http://datainfoplus.stats.govt.nz/Item/nz.govt.stats/ab8db4ff-c5b2-4a4f-bd2e-f2c71555d31f\" target=\"blank\">Housing quality: dwelling dampness, mould, and access to basic amenities information by variable</a> has more information eg definitions, and data quality</p></p><p><p>The quality rating of a variable provides an overall evaluation of 2018 Census data quality for that single variable, at the highest level of its classification. There is variability in the quality of data at smaller geographies. Data quality may also vary for subpopulations, or when cross tabulated with other variables or at lower levels of the classification.<br> </p><p><p>For more information on quality ratings by variable, please see <a href=\"https://www.stats.govt.nz/methods/data-quality-ratings-for-2018-census-variables\"target=\"blank\">Data quality ratings for 2018 census variables</a>.</p></p><h4>About the 2018 Census dataset</h4><p>We combined data from the census forms with administrative data to create the 2018 Census dataset, which meets Stats NZ’s quality criteria for population structure information.</p><p>We added real data about real people to the dataset where we were confident the people should be counted but hadn’t completed a census form. We also used data from the 2013 Census and administrative sources and statistical imputation methods to fill in some missing characteristics of people and dwellings.</p> </p><p><p>An independent panel of experts has assessed the quality of the 2018 Census dataset. The panel has endorsed Stats NZ’s overall methods and concluded that the use of government administrative records has improved the coverage of key variables such as age, sex, ethnicity, and place. The panel's <a href=\"https://www.stats.govt.nz/reports/initial-report-of-the-2018-census-external-data-quality-panel\" target=\"_blank\">&nbsp;Initial report of the 2018 External Data Quality Panel</a> (September 2019) assessed the methodologies used by Stats NZ to produce the final dataset, as well as the quality of some of the key variables.</p></p><p>Its <a href=\"https://www.stats.govt.nz/reports/2018-census-external-data-quality-panel-assessment-of-variables\" target=\"_blank\">&nbsp;second report&nbsp;</a> (December 2019) assessed an additional 31 variables.</p></p><p>In its third report, <a href=\"https://www.stats.govt.nz/reports/final-report-of-the-2018-census-external-data-quality-panel\" target=\"_blank\">&nbsp;Final report of the 2018 Census External Data Quality Panel</a> (February 2020) the panel made 24 recommendations, several relating to preparations for the 2023 Census. Along with this report, the panel, supported by Stats NZ, produced a series of graphs summarising the sources of data for key 2018 Census individual variables, <a href=\"https://www.stats.govt.nz/reports/2018-census-external-data-quality-panel-data-sources-for-key-2018-census-individual-variables\" target=\"_blank\">&nbsp;2018 Census External Data Quality Panel:Data sources for key 2018 Census individual variables.</a></p></p><h4> Confidentiality</h4><p><p>The 2018 Census confidentiality rules have been applied to 2006, 2013, and 2018 data. These rules protect the confidentiality of individuals, families, households, dwellings, and undertakings in 2018 Census data. Counts are calculated using fixed random rounding to base 3 (FRR3), and suppression of ‘sensitive’ counts less than six, where tables report multiple geographic variables and/or small populations. Individual figures may not always sum to stated totals.</p></p><p><p>For more information on the most recent 2018 Census confidentiality rules, see <a href=\"https://www.stats.govt.nz/methods/applying-confidentiality-rules-to-2018-census-data-and-summary-of-changes-since-2013\" ta",
                "descriptions": {
                    "en": "<h4>Description</h4><p>Access to basic amenities (total responses) by sector of landlord, for households in rented occupied private dwellings, 2018 Census (RC, TA, SA2, DHB)</p><p><p>Access to basic amenities variable is rated as moderate quality. <a href=\"http://datainfoplus.stats.govt.nz/Item/nz.govt.stats/ab8db4ff-c5b2-4a4f-bd2e-f2c71555d31f\" target=\"blank\">Housing quality: dwelling dampness, mould, and access to basic amenities information by variable</a> has more information eg definitions, and data quality</p></p><p><p>The quality rating of a variable provides an overall evaluation of 2018 Census data quality for that single variable, at the highest level of its classification. There is variability in the quality of data at smaller geographies. Data quality may also vary for subpopulations, or when cross tabulated with other variables or at lower levels of the classification.<br> </p><p><p>For more information on quality ratings by variable, please see <a href=\"https://www.stats.govt.nz/methods/data-quality-ratings-for-2018-census-variables\"target=\"blank\">Data quality ratings for 2018 census variables</a>.</p></p><h4>About the 2018 Census dataset</h4><p>We combined data from the census forms with administrative data to create the 2018 Census dataset, which meets Stats NZ’s quality criteria for population structure information.</p><p>We added real data about real people to the dataset where we were confident the people should be counted but hadn’t completed a census form. We also used data from the 2013 Census and administrative sources and statistical imputation methods to fill in some missing characteristics of people and dwellings.</p> </p><p><p>An independent panel of experts has assessed the quality of the 2018 Census dataset. The panel has endorsed Stats NZ’s overall methods and concluded that the use of government administrative records has improved the coverage of key variables such as age, sex, ethnicity, and place. The panel's <a href=\"https://www.stats.govt.nz/reports/initial-report-of-the-2018-census-external-data-quality-panel\" target=\"_blank\">&nbsp;Initial report of the 2018 External Data Quality Panel</a> (September 2019) assessed the methodologies used by Stats NZ to produce the final dataset, as well as the quality of some of the key variables.</p></p><p>Its <a href=\"https://www.stats.govt.nz/reports/2018-census-external-data-quality-panel-assessment-of-variables\" target=\"_blank\">&nbsp;second report&nbsp;</a> (December 2019) assessed an additional 31 variables.</p></p><p>In its third report, <a href=\"https://www.stats.govt.nz/reports/final-report-of-the-2018-census-external-data-quality-panel\" target=\"_blank\">&nbsp;Final report of the 2018 Census External Data Quality Panel</a> (February 2020) the panel made 24 recommendations, several relating to preparations for the 2023 Census. Along with this report, the panel, supported by Stats NZ, produced a series of graphs summarising the sources of data for key 2018 Census individual variables, <a href=\"https://www.stats.govt.nz/reports/2018-census-external-data-quality-panel-data-sources-for-key-2018-census-individual-variables\" target=\"_blank\">&nbsp;2018 Census External Data Quality Panel:Data sources for key 2018 Census individual variables.</a></p></p><h4> Confidentiality</h4><p><p>The 2018 Census confidentiality rules have been applied to 2006, 2013, and 2018 data. These rules protect the confidentiality of individuals, families, households, dwellings, and undertakings in 2018 Census data. Counts are calculated using fixed random rounding to base 3 (FRR3), and suppression of ‘sensitive’ counts less than six, where tables report multiple geographic variables and/or small populations. Individual figures may not always sum to stated totals.</p></p><p><p>For more information on the most recent 2018 Census confidentiality rules, see <a href=\"https://www.stats.govt.nz/methods/applying-confidentiality-rules-to-2018-census-data-and-summary-of-changes-since-2013\" ta"
                },
                "dimensions": {
                    "dataSet": [],
                    "series": [],
                    "observation": [
                        {
                            "id": "AMENITIES_CEN18_HOU_001",
                            "name": "Access to basic amenities",
                            "names": {
                                "en": "Access to basic amenities"
                            },
                            "keyPosition": 0,
                            "roles": [
                                "AMENITIES_CEN18_HOU_001"
                            ],
                            "values": []
                        },
                        {
                            "id": "AREA_CEN18_HOU_001",
                            "name": "Area",
                            "names": {
                                "en": "Area"
                            },
                            "keyPosition": 1,
                            "roles": [
                                "AREA_CEN18_HOU_001"
                            ],
                            "values": []
                        },
                        {
                            "id": "SECTORLANDLORD_CEN18_HOU_001",
                            "name": "Sector of landlord",
                            "names": {
                                "en": "Sector of landlord"
                            },
                            "keyPosition": 2,
                            "roles": [
                                "SECTORLANDLORD_CEN18_HOU_001"
                            ],
                            "values": []
                        }
                    ]
                },
                "attributes": {
                    "dataSet": [],
                    "dimensionGroup": [
                        {
                            "id": "SOURCE_CITATION",
                            "name": "Source citation",
                            "names": {
                                "en": "Source citation"
                            },
                            "values": [
                                {
                                    "value": "Notes pertaining to the dataflow"
                                }
                            ]
                        }
                    ],
                    "series": [],
                    "observation": [
                        {
                            "id": "OBS_STATUS",
                            "name": "Observation status",
                            "names": {
                                "en": "Observation status"
                            },
                            "roles": [
                                "OBS_STATUS"
                            ],
                            "relationship": {
                                "observation": {}
                            },
                            "values": []
                        },
                        {
                            "id": "NOTE_OBS",
                            "name": "Data source",
                            "names": {
                                "en": "Data source"
                            },
                            "roles": [
                                "NOTE_OBS"
                            ],
                            "relationship": {
                                "observation": {}
                            },
                            "values": []
                        },
                        {
                            "id": "NOTE_AMENITIES_CEN18_HOU_001",
                            "name": "Amenities source",
                            "names": {
                                "en": "Amenities source"
                            },
                            "roles": [
                                "NOTE_AMENITIES_CEN18_HOU_001"
                            ],
                            "relationship": {
                                "dimensions": [
                                    "AMENITIES_CEN18_HOU_001"
                                ]
                            },
                            "values": []
                        },
                        {
                            "id": "NOTE_AREA_CEN18_HOU_001",
                            "name": "Area source",
                            "names": {
                                "en": "Area source"
                            },
                            "roles": [
                                "NOTE_AREA_CEN18_HOU_001"
                            ],
                            "relationship": {
                                "dimensions": [
                                    "AREA_CEN18_HOU_001"
                                ]
                            },
                            "values": []
                        },
                        {
                            "id": "NOTE_SECTORLANDLORD_CEN18_HOU_001",
                            "name": "Sector Landlord source",
                            "names": {
                                "en": "Sector Landlord source"
                            },
                            "roles": [
                                "NOTE_SECTORLANDLORD_CEN18_HOU_001"
                            ],
                            "relationship": {
                                "dimensions": [
                                    "SECTORLANDLORD_CEN18_HOU_001"
                                ]
                            },
                            "values": []
                        }
                    ]
                },
                "annotations": [
                    {
                        "type": "NonProductionDataflow",
                        "text": "true",
                        "texts": {
                            "en": "true"
                        }
                    },
                    {
                        "id": "@SDMX",
                        "title": "AREA_CEN18_HOU_001",
                        "type": "LAYOUT_ROW"
                    },
                    {
                        "id": "@SDMX",
                        "title": "AMENITIES_CEN18_HOU_001,SECTORLANDLORD_CEN18_HOU_001",
                        "type": "LAYOUT_COLUMN"
                    },
                    {
                        "id": "@SDMX",
                        "title": "AMENITIES_CEN18_HOU_001=999,SECTORLANDLORD_CEN18_HOU_001=999,AREA_CEN18_HOU_001=9999+999999+DHB9999",
                        "type": "DEFAULT"
                    },
                    {
                        "title": "urn:sdmx:org.sdmx.infomodel.metadatastructure.MetadataStructure=STATSNZ:MSD_CEN18_HOU_001(1.0)",
                        "type": "METADATA"
                    }
                ],
                "dataSets": [
                    0
                ]
            }
        ]
    },
    "errors": []
}