{
    "data": {
        "contentConstraints": [
            {
                "id": "CR_A_CEN18_HOU_001",
                "links": [
                    {
                        "rel": "self",
                        "urn": "urn:sdmx:org.sdmx.infomodel.registry.ContentConstraint=STATSNZ:CR_A_CEN18_HOU_001(1.0)"
                    }
                ],
                "version": "1.0",
                "agencyID": "STATSNZ",
                "isFinal": false,
                "validFrom": "2023-07-31T13:28:02Z",
                "name": "Availability (A) for CEN18_HOU_001",
                "names": {
                    "en": "Availability (A) for CEN18_HOU_001"
                },
                "annotations": [
                    {
                        "title": "A",
                        "type": "ReleaseVersion"
                    },
                    {
                        "id": "obs_count",
                        "title": "22",
                        "type": "sdmx_metrics"
                    }
                ],
                "type": "Actual",
                "constraintAttachment": {
                    "dataflows": [
                        "urn:sdmx:org.sdmx.infomodel.datastructure.Dataflow=STATSNZ:CEN18_HOU_001(1.0)"
                    ]
                },
                "cubeRegions": [
                    {
                        "isIncluded": true,
                        "keyValues": [
                            {
                                "id": "AMENITIES_CEN18_HOU_001",
                                "values": [
                                    "0",
                                    "1",
                                    "3",
                                    "4",
                                    "9",
                                    "999"
                                ]
                            },
                            {
                                "id": "AREA_CEN18_HOU_001",
                                "values": [
                                    "187400",
                                    "DHB99"
                                ]
                            },
                            {
                                "id": "SECTORLANDLORD_CEN18_HOU_001",
                                "values": [
                                    "1",
                                    "2",
                                    "3",
                                    "4",
                                    "5",
                                    "6",
                                    "777",
                                    "9",
                                    "999"
                                ]
                            }
                        ]
                    }
                ]
            }
        ]
    },
    "meta": {
        "schema": "https://raw.githubusercontent.com/sdmx-twg/sdmx-json/develop/structure-message/tools/schemas/1.0/sdmx-json-structure-schema.json",
        "contentLanguages": [
            "en"
        ],
        "id": "IDREF13545",
        "prepared": "2023-07-31T13:29:47Z",
        "test": false,
        "sender": {
            "id": "Unknown"
        },
        "receiver": [
            {
                "id": "Unknown"
            }
        ]
    }
}