{
  "meta": {
      "schema": "https://raw.githubusercontent.com/sdmx-twg/sdmx-json/master/data-message/tools/schemas/2.0.0/sdmx-json-data-schema.json",
      "id": "IREF647122",
      "prepared": "2024-06-10T09:41:53Z",
      "test": true,
      "contentLanguages": [
          "en"
      ],
      "sender": {
          "id": "Stable-DotStatV8",
          "name": "unknown",
          "names": {
              "en": "unknown"
          }
      }
  },
  "data": {
      "dataSets": [
          {
              "structure": 0,
              "action": "Information",
              "links": [
                  {
                      "urn": "urn:sdmx:org.sdmx.infomodel.datastructure.DataStructure=OECD:AIR_EMISSIONS(1.1)",
                      "rel": "DataStructure"
                  }
              ],
              "annotations": [
                  0,
                  1,
                  2
              ],
              "observations": {
                  "0:0:0:0": [
                      12.626,
                      null,
                      null,
                      0,
                      null,
                      0
                  ],
                  "0:0:0:1": [
                      12.641,
                      null,
                      null,
                      0,
                      null,
                      0
                  ],
                  "0:0:0:2": [
                      10.493,
                      null,
                      null,
                      0,
                      null,
                      0
                  ],
                  "0:0:0:3": [
                      9.657,
                      null,
                      null,
                      0,
                      null,
                      0
                  ],
                  "0:0:0:4": [
                      9.971,
                      null,
                      null,
                      0,
                      null,
                      0
                  ],
                  "1:0:0:0": [
                      1.471,
                      null,
                      null,
                      0,
                      null,
                      0
                  ],
                  "1:0:0:1": [
                      1.52,
                      null,
                      null,
                      0,
                      null,
                      0
                  ],
                  "1:0:0:2": [
                      1.546,
                      null,
                      null,
                      0,
                      null,
                      0
                  ],
                  "1:0:0:3": [
                      1.341,
                      null,
                      null,
                      0,
                      null,
                      0
                  ],
                  "1:0:0:4": [
                      0.991,
                      null,
                      null,
                      0,
                      null,
                      0
                  ],
                  "2:0:0:0": [
                      2703.019,
                      null,
                      null,
                      0,
                      null,
                      0
                  ],
                  "2:0:0:1": [
                      1939.766,
                      null,
                      null,
                      0,
                      null,
                      0
                  ],
                  "2:0:0:2": [
                      2149.207,
                      null,
                      null,
                      0,
                      null,
                      0
                  ],
                  "2:0:0:3": [
                      1948.121,
                      null,
                      null,
                      0,
                      null,
                      0
                  ],
                  "2:0:0:4": [
                      2250.319,
                      null,
                      null,
                      0,
                      null,
                      0
                  ],
                  "3:0:0:0": [
                      4.429,
                      null,
                      null,
                      0,
                      null,
                      0
                  ],
                  "3:0:0:1": [
                      3.916,
                      null,
                      null,
                      0,
                      null,
                      0
                  ],
                  "3:0:0:2": [
                      3.887,
                      null,
                      null,
                      0,
                      null,
                      0
                  ],
                  "3:0:0:3": [
                      3.581,
                      null,
                      null,
                      0,
                      null,
                      0
                  ],
                  "3:0:0:4": [
                      3.45,
                      null,
                      null,
                      0,
                      null,
                      0
                  ],
                  "4:0:0:0": [
                      30.546,
                      null,
                      null,
                      0,
                      null,
                      0
                  ],
                  "4:0:0:1": [
                      29.393,
                      null,
                      null,
                      0,
                      null,
                      0
                  ],
                  "4:0:0:2": [
                      26.018,
                      null,
                      null,
                      0,
                      null,
                      0
                  ],
                  "4:0:0:3": [
                      24.296,
                      null,
                      null,
                      0,
                      null,
                      0
                  ],
                  "4:0:0:4": [
                      22.985,
                      null,
                      null,
                      0,
                      null,
                      0
                  ],
                  "5:0:0:0": [
                      86.471,
                      null,
                      null,
                      0,
                      null,
                      0
                  ],
                  "5:0:0:1": [
                      72.141,
                      null,
                      null,
                      0,
                      null,
                      0
                  ],
                  "5:0:0:2": [
                      66.307,
                      null,
                      null,
                      0,
                      null,
                      0
                  ],
                  "5:0:0:3": [
                      60.585,
                      null,
                      null,
                      0,
                      null,
                      0
                  ],
                  "5:0:0:4": [
                      51.635,
                      null,
                      null,
                      0,
                      null,
                      0
                  ],
                  "6:0:0:0": [
                      803.035,
                      null,
                      null,
                      0,
                      null,
                      0
                  ],
                  "6:0:0:1": [
                      768.096,
                      null,
                      null,
                      0,
                      null,
                      0
                  ],
                  "6:0:0:2": [
                      723.674,
                      null,
                      null,
                      0,
                      null,
                      0
                  ],
                  "6:0:0:3": [
                      711.439,
                      null,
                      null,
                      0,
                      null,
                      0
                  ],
                  "6:0:0:4": [
                      590.607,
                      null,
                      null,
                      0,
                      null,
                      0
                  ],
                  "7:0:0:0": [
                      54.913,
                      null,
                      null,
                      0,
                      null,
                      0
                  ],
                  "7:0:0:1": [
                      49.593,
                      null,
                      null,
                      0,
                      null,
                      0
                  ],
                  "7:0:0:2": [
                      45.39,
                      null,
                      null,
                      0,
                      null,
                      0
                  ],
                  "7:0:0:3": [
                      47.379,
                      null,
                      null,
                      0,
                      null,
                      0
                  ],
                  "7:0:0:4": [
                      47.342,
                      null,
                      null,
                      0,
                      null,
                      0
                  ],
                  "8:0:0:0": [
                      11.596,
                      null,
                      null,
                      0,
                      null,
                      0
                  ],
                  "8:0:0:1": [
                      13.783,
                      null,
                      null,
                      0,
                      null,
                      0
                  ],
                  "8:0:0:2": [
                      9.731,
                      null,
                      null,
                      0,
                      null,
                      0
                  ],
                  "8:0:0:3": [
                      5.428,
                      null,
                      null,
                      0,
                      null,
                      0
                  ],
                  "8:0:0:4": [
                      4.626,
                      null,
                      null,
                      0,
                      null,
                      0
                  ],
                  "9:0:0:0": [
                      15536.31,
                      0,
                      null,
                      0,
                      null,
                      0
                  ],
                  "9:0:0:1": [
                      14123.88,
                      0,
                      null,
                      0,
                      null,
                      0
                  ],
                  "9:0:0:2": [
                      13881.04,
                      0,
                      null,
                      0,
                      null,
                      0
                  ],
                  "9:0:0:3": [
                      12439.9,
                      0,
                      null,
                      0,
                      null,
                      0
                  ],
                  "9:0:0:4": [
                      11754,
                      0,
                      null,
                      0,
                      null,
                      0
                  ],
                  "10:0:0:0": [
                      2519.087,
                      null,
                      null,
                      0,
                      null,
                      0
                  ],
                  "10:0:0:1": [
                      2414.101,
                      null,
                      null,
                      0,
                      null,
                      0
                  ],
                  "10:0:0:2": [
                      2499.419,
                      null,
                      null,
                      0,
                      null,
                      0
                  ],
                  "10:0:0:3": [
                      2385.87,
                      null,
                      null,
                      0,
                      null,
                      0
                  ],
                  "10:0:0:4": [
                      2464.911,
                      null,
                      null,
                      0,
                      null,
                      0
                  ],
                  "11:0:0:0": [
                      169.709,
                      null,
                      null,
                      0,
                      null,
                      0
                  ],
                  "11:0:0:1": [
                      139.037,
                      null,
                      null,
                      0,
                      null,
                      0
                  ],
                  "11:0:0:2": [
                      117.55,
                      null,
                      null,
                      0,
                      null,
                      0
                  ],
                  "11:0:0:3": [
                      120.291,
                      null,
                      null,
                      0,
                      null,
                      0
                  ],
                  "11:0:0:4": [
                      103.703,
                      null,
                      null,
                      0,
                      null,
                      0
                  ],
                  "12:0:0:0": [
                      17.267,
                      null,
                      null,
                      0,
                      null,
                      0
                  ],
                  "12:0:0:1": [
                      14.979,
                      null,
                      null,
                      0,
                      null,
                      0
                  ],
                  "12:0:0:2": [
                      13.625,
                      null,
                      null,
                      0,
                      null,
                      0
                  ],
                  "12:0:0:3": [
                      15.165,
                      null,
                      null,
                      0,
                      null,
                      0
                  ],
                  "12:0:0:4": [
                      15.026,
                      null,
                      null,
                      0,
                      null,
                      0
                  ],
                  "13:0:0:0": [
                      119.856,
                      null,
                      null,
                      0,
                      null,
                      0
                  ],
                  "13:0:0:1": [
                      105.682,
                      null,
                      null,
                      0,
                      null,
                      0
                  ],
                  "13:0:0:2": [
                      89.128,
                      null,
                      null,
                      0,
                      null,
                      0
                  ],
                  "13:0:0:3": [
                      83.634,
                      null,
                      null,
                      0,
                      null,
                      0
                  ],
                  "13:0:0:4": [
                      60.508,
                      null,
                      null,
                      0,
                      null,
                      0
                  ],
                  "14:0:0:0": [
                      1252.06,
                      null,
                      null,
                      0,
                      null,
                      0
                  ],
                  "14:0:0:1": [
                      1239.862,
                      null,
                      null,
                      0,
                      null,
                      0
                  ],
                  "14:0:0:2": [
                      1194.543,
                      null,
                      null,
                      0,
                      null,
                      0
                  ],
                  "14:0:0:3": [
                      1060.376,
                      null,
                      null,
                      0,
                      null,
                      0
                  ],
                  "14:0:0:4": [
                      1043.361,
                      null,
                      null,
                      0,
                      null,
                      0
                  ],
                  "15:0:0:0": [
                      23.229,
                      null,
                      null,
                      0,
                      null,
                      0
                  ],
                  "15:0:0:1": [
                      23.343,
                      null,
                      null,
                      0,
                      null,
                      0
                  ],
                  "15:0:0:2": [
                      16.994,
                      null,
                      null,
                      0,
                      null,
                      0
                  ],
                  "15:0:0:3": [
                      15.14,
                      null,
                      null,
                      0,
                      null,
                      0
                  ],
                  "15:0:0:4": [
                      13.674,
                      null,
                      null,
                      0,
                      null,
                      0
                  ],
                  "16:0:0:0": [
                      42.916,
                      null,
                      null,
                      0,
                      null,
                      0
                  ],
                  "16:0:0:1": [
                      41.69,
                      null,
                      null,
                      0,
                      null,
                      0
                  ],
                  "16:0:0:2": [
                      46.83,
                      null,
                      null,
                      0,
                      null,
                      0
                  ],
                  "16:0:0:3": [
                      36.076,
                      null,
                      null,
                      0,
                      null,
                      0
                  ],
                  "16:0:0:4": [
                      34.94,
                      null,
                      null,
                      0,
                      null,
                      0
                  ],
                  "17:0:0:0": [
                      5853.824,
                      null,
                      null,
                      0,
                      null,
                      0
                  ],
                  "17:0:0:1": [
                      4800.03,
                      null,
                      null,
                      0,
                      null,
                      0
                  ],
                  "17:0:0:2": [
                      4769.119,
                      null,
                      null,
                      0,
                      null,
                      0
                  ],
                  "17:0:0:3": [
                      4464.979,
                      null,
                      null,
                      0,
                      null,
                      0
                  ],
                  "17:0:0:4": [
                      4380.37,
                      null,
                      null,
                      0,
                      null,
                      0
                  ],
                  "18:0:0:0": [
                      160.176,
                      null,
                      null,
                      0,
                      null,
                      0
                  ],
                  "18:0:0:1": [
                      145.225,
                      null,
                      null,
                      0,
                      null,
                      0
                  ],
                  "18:0:0:2": [
                      134.484,
                      null,
                      null,
                      0,
                      null,
                      0
                  ],
                  "18:0:0:3": [
                      129.367,
                      null,
                      null,
                      0,
                      null,
                      0
                  ],
                  "18:0:0:4": [
                      115.125,
                      null,
                      null,
                      0,
                      null,
                      0
                  ],
                  "19:0:0:0": [
                      375.386,
                      null,
                      null,
                      0,
                      null,
                      0
                  ],
                  "19:0:0:1": [
                      365.662,
                      null,
                      null,
                      0,
                      null,
                      0
                  ],
                  "19:0:0:2": [
                      345.623,
                      null,
                      null,
                      0,
                      null,
                      0
                  ],
                  "19:0:0:3": [
                      343.139,
                      null,
                      null,
                      0,
                      null,
                      0
                  ],
                  "19:0:0:4": [
                      319.46,
                      null,
                      null,
                      0,
                      null,
                      0
                  ],
                  "20:0:0:4": [
                      1361,
                      1,
                      null,
                      0,
                      null,
                      0
                  ],
                  "21:0:0:0": [
                      8.666,
                      null,
                      null,
                      0,
                      null,
                      0
                  ],
                  "21:0:0:1": [
                      8.086,
                      null,
                      null,
                      0,
                      null,
                      0
                  ],
                  "21:0:0:2": [
                      7.388,
                      null,
                      null,
                      0,
                      null,
                      0
                  ],
                  "21:0:0:3": [
                      5.716,
                      null,
                      null,
                      0,
                      null,
                      0
                  ],
                  "21:0:0:4": [
                      5.305,
                      null,
                      null,
                      0,
                      null,
                      0
                  ],
                  "22:0:0:0": [
                      46.928,
                      null,
                      null,
                      0,
                      null,
                      0
                  ],
                  "22:0:0:1": [
                      42.666,
                      null,
                      null,
                      0,
                      null,
                      0
                  ],
                  "22:0:0:2": [
                      40.088,
                      null,
                      null,
                      0,
                      null,
                      0
                  ],
                  "22:0:0:3": [
                      40.49,
                      null,
                      null,
                      0,
                      null,
                      0
                  ],
                  "22:0:0:4": [
                      39.051,
                      null,
                      null,
                      0,
                      null,
                      0
                  ],
                  "23:0:0:0": [
                      78.588,
                      null,
                      null,
                      0,
                      null,
                      0
                  ],
                  "23:0:0:1": [
                      76.102,
                      null,
                      null,
                      0,
                      null,
                      0
                  ],
                  "23:0:0:2": [
                      74.311,
                      null,
                      null,
                      0,
                      null,
                      0
                  ],
                  "23:0:0:3": [
                      75.827,
                      null,
                      null,
                      0,
                      null,
                      0
                  ],
                  "23:0:0:4": [
                      69.364,
                      null,
                      null,
                      0,
                      null,
                      0
                  ],
                  "24:0:0:0": [
                      177.966,
                      null,
                      null,
                      0,
                      null,
                      0
                  ],
                  "24:0:0:1": [
                      146.58,
                      null,
                      null,
                      0,
                      null,
                      0
                  ],
                  "24:0:0:2": [
                      131.599,
                      null,
                      null,
                      0,
                      null,
                      0
                  ],
                  "24:0:0:3": [
                      124.503,
                      null,
                      null,
                      0,
                      null,
                      0
                  ],
                  "24:0:0:4": [
                      116.974,
                      null,
                      null,
                      0,
                      null,
                      0
                  ],
                  "25:0:0:0": [
                      237.724,
                      1,
                      null,
                      0,
                      null,
                      0
                  ],
                  "25:0:0:1": [
                      217.271,
                      null,
                      null,
                      0,
                      null,
                      0
                  ],
                  "25:0:0:2": [
                      147.816,
                      null,
                      null,
                      0,
                      null,
                      0
                  ],
                  "25:0:0:3": [
                      153.057,
                      null,
                      null,
                      0,
                      null,
                      0
                  ],
                  "25:0:0:4": [
                      346.553,
                      1,
                      null,
                      0,
                      null,
                      0
                  ],
                  "26:0:0:0": [
                      724.164,
                      null,
                      null,
                      0,
                      null,
                      0
                  ],
                  "26:0:0:1": [
                      715.464,
                      null,
                      null,
                      0,
                      null,
                      0
                  ],
                  "26:0:0:2": [
                      706.514,
                      null,
                      null,
                      0,
                      null,
                      0
                  ],
                  "26:0:0:3": [
                      701.734,
                      null,
                      null,
                      0,
                      null,
                      0
                  ],
                  "26:0:0:4": [
                      701.011,
                      null,
                      null,
                      0,
                      null,
                      0
                  ],
                  "27:0:0:0": [
                      34.049,
                      null,
                      null,
                      0,
                      null,
                      0
                  ],
                  "27:0:0:1": [
                      30.043,
                      null,
                      null,
                      0,
                      null,
                      0
                  ],
                  "27:0:0:2": [
                      29.828,
                      null,
                      null,
                      0,
                      null,
                      0
                  ],
                  "27:0:0:3": [
                      30.601,
                      null,
                      null,
                      0,
                      null,
                      0
                  ],
                  "27:0:0:4": [
                      28.299,
                      null,
                      null,
                      0,
                      null,
                      0
                  ],
                  "28:0:0:0": [
                      236.63,
                      null,
                      null,
                      0,
                      null,
                      0
                  ],
                  "28:0:0:1": [
                      213.519,
                      null,
                      null,
                      0,
                      null,
                      0
                  ],
                  "28:0:0:2": [
                      173.227,
                      null,
                      null,
                      0,
                      null,
                      0
                  ],
                  "28:0:0:3": [
                      163.283,
                      null,
                      null,
                      0,
                      null,
                      0
                  ],
                  "28:0:0:4": [
                      144.319,
                      null,
                      null,
                      0,
                      null,
                      0
                  ],
                  "29:0:0:0": [
                      24.73,
                      null,
                      null,
                      0,
                      null,
                      0
                  ],
                  "29:0:0:1": [
                      22.278,
                      null,
                      null,
                      0,
                      null,
                      0
                  ],
                  "29:0:0:2": [
                      19.912,
                      null,
                      null,
                      0,
                      null,
                      0
                  ],
                  "29:0:0:3": [
                      17.653,
                      null,
                      null,
                      0,
                      null,
                      0
                  ],
                  "29:0:0:4": [
                      18.33,
                      null,
                      null,
                      0,
                      null,
                      0
                  ],
                  "30:0:0:0": [
                      4431,
                      null,
                      null,
                      0,
                      null,
                      0
                  ],
                  "30:0:0:1": [
                      4306,
                      null,
                      null,
                      0,
                      null,
                      0
                  ],
                  "30:0:0:2": [
                      4131,
                      null,
                      null,
                      0,
                      null,
                      0
                  ],
                  "30:0:0:3": [
                      4196,
                      null,
                      null,
                      0,
                      null,
                      0
                  ],
                  "30:0:0:4": [
                      4110,
                      null,
                      null,
                      0,
                      null,
                      0
                  ],
                  "31:0:0:0": [
                      57.01,
                      null,
                      null,
                      0,
                      null,
                      0
                  ],
                  "31:0:0:1": [
                      51.74,
                      null,
                      null,
                      0,
                      null,
                      0
                  ],
                  "31:0:0:2": [
                      44.469,
                      null,
                      null,
                      0,
                      null,
                      0
                  ],
                  "31:0:0:3": [
                      66.78,
                      null,
                      null,
                      0,
                      null,
                      0
                  ],
                  "31:0:0:4": [
                      26.257,
                      null,
                      null,
                      0,
                      null,
                      0
                  ],
                  "32:0:0:0": [
                      14.476,
                      null,
                      null,
                      0,
                      null,
                      0
                  ],
                  "32:0:0:1": [
                      14.372,
                      null,
                      null,
                      0,
                      null,
                      0
                  ],
                  "32:0:0:2": [
                      14.521,
                      null,
                      null,
                      0,
                      null,
                      0
                  ],
                  "32:0:0:3": [
                      13.858,
                      null,
                      null,
                      0,
                      null,
                      0
                  ],
                  "32:0:0:4": [
                      13.43,
                      null,
                      null,
                      0,
                      null,
                      0
                  ],
                  "33:0:0:0": [
                      16.862,
                      null,
                      null,
                      0,
                      null,
                      0
                  ],
                  "33:0:0:1": [
                      17.086,
                      null,
                      null,
                      0,
                      null,
                      0
                  ],
                  "33:0:0:2": [
                      16.966,
                      null,
                      null,
                      0,
                      null,
                      0
                  ],
                  "33:0:0:3": [
                      16.54,
                      null,
                      null,
                      0,
                      null,
                      0
                  ],
                  "33:0:0:4": [
                      15.341,
                      null,
                      null,
                      0,
                      null,
                      0
                  ],
                  "34:0:0:0": [
                      4521.158,
                      null,
                      null,
                      0,
                      null,
                      0
                  ],
                  "34:0:0:1": [
                      4334.555,
                      null,
                      null,
                      0,
                      null,
                      0
                  ],
                  "34:0:0:2": [
                      4176.349,
                      null,
                      null,
                      0,
                      null,
                      0
                  ],
                  "34:0:0:3": [
                      3278.533,
                      null,
                      null,
                      0,
                      null,
                      0
                  ],
                  "34:0:0:4": [
                      2621.311,
                      null,
                      null,
                      0,
                      null,
                      0
                  ],
                  "35:0:0:0": [
                      459.147,
                      null,
                      null,
                      0,
                      null,
                      0
                  ],
                  "35:0:0:1": [
                      396.434,
                      null,
                      null,
                      0,
                      null,
                      0
                  ],
                  "35:0:0:2": [
                      321.656,
                      null,
                      null,
                      0,
                      null,
                      0
                  ],
                  "35:0:0:3": [
                      249.5,
                      null,
                      null,
                      0,
                      null,
                      0
                  ],
                  "35:0:0:4": [
                      175.027,
                      null,
                      null,
                      0,
                      null,
                      0
                  ],
                  "36:0:0:0": [
                      50.955,
                      null,
                      null,
                      0,
                      null,
                      0
                  ],
                  "36:0:0:1": [
                      48.355,
                      null,
                      null,
                      0,
                      null,
                      0
                  ],
                  "36:0:0:2": [
                      43.228,
                      null,
                      null,
                      0,
                      null,
                      0
                  ],
                  "36:0:0:3": [
                      41.866,
                      null,
                      null,
                      0,
                      null,
                      0
                  ],
                  "36:0:0:4": [
                      39.795,
                      null,
                      null,
                      0,
                      null,
                      0
                  ],
                  "37:0:0:0": [
                      417.645,
                      null,
                      null,
                      0,
                      null,
                      0
                  ],
                  "37:0:0:1": [
                      404.66,
                      null,
                      null,
                      0,
                      null,
                      0
                  ],
                  "37:0:0:2": [
                      343.161,
                      1,
                      null,
                      0,
                      null,
                      0
                  ],
                  "37:0:0:3": [
                      352.213,
                      null,
                      null,
                      0,
                      null,
                      0
                  ],
                  "37:0:0:4": [
                      358.873,
                      null,
                      null,
                      0,
                      null,
                      0
                  ],
                  "38:0:0:0": [
                      279.47,
                      null,
                      null,
                      0,
                      null,
                      0
                  ],
                  "38:0:0:1": [
                      221.441,
                      null,
                      null,
                      0,
                      null,
                      0
                  ],
                  "38:0:0:2": [
                      243.298,
                      null,
                      null,
                      0,
                      null,
                      0
                  ],
                  "38:0:0:3": [
                      259.841,
                      null,
                      null,
                      0,
                      null,
                      0
                  ],
                  "38:0:0:4": [
                      217.583,
                      null,
                      null,
                      0,
                      null,
                      0
                  ]
              }
          }
      ],
      "structures": [
          {
              "name": "Emissions of air pollutants",
              "names": {
                  "en": "Emissions of air pollutants"
              },
              "dimensions": {
                  "dataSet": [],
                  "series": [],
                  "observation": [
                      {
                          "id": "COU",
                          "name": "Country",
                          "names": {
                              "en": "Country"
                          },
                          "keyPosition": 0,
                          "roles": [
                              "COU"
                          ],
                          "values": [
                              {
                                  "id": "DNK",
                                  "order": 5,
                                  "name": "Denmark",
                                  "names": {
                                      "en": "Denmark"
                                  }
                              },
                              {
                                  "id": "LUX",
                                  "order": 16,
                                  "name": "Luxembourg",
                                  "names": {
                                      "en": "Luxembourg"
                                  }
                              },
                              {
                                  "id": "TUR",
                                  "order": 27,
                                  "name": "Turkey",
                                  "names": {
                                      "en": "Turkey"
                                  }
                              },
                              {
                                  "id": "LVA",
                                  "order": 33,
                                  "name": "Latvia",
                                  "names": {
                                      "en": "Latvia"
                                  }
                              },
                              {
                                  "id": "HUN",
                                  "order": 10,
                                  "name": "Hungary",
                                  "names": {
                                      "en": "Hungary"
                                  }
                              },
                              {
                                  "id": "ISL",
                                  "order": 11,
                                  "name": "Iceland",
                                  "names": {
                                      "en": "Iceland"
                                  }
                              },
                              {
                                  "id": "POL",
                                  "order": 21,
                                  "name": "Poland",
                                  "names": {
                                      "en": "Poland"
                                  }
                              },
                              {
                                  "id": "PRT",
                                  "order": 22,
                                  "name": "Portugal",
                                  "names": {
                                      "en": "Portugal"
                                  }
                              },
                              {
                                  "id": "SVN",
                                  "order": 38,
                                  "name": "Slovenia",
                                  "names": {
                                      "en": "Slovenia"
                                  }
                              },
                              {
                                  "id": "OECD",
                                  "order": 39,
                                  "name": "OECD - Total",
                                  "names": {
                                      "en": "OECD - Total"
                                  }
                              },
                              {
                                  "id": "AUS",
                                  "order": 0,
                                  "name": "Australia",
                                  "names": {
                                      "en": "Australia"
                                  }
                              },
                              {
                                  "id": "ISR",
                                  "order": 32,
                                  "name": "Israel",
                                  "names": {
                                      "en": "Israel"
                                  }
                              },
                              {
                                  "id": "LTU",
                                  "order": 34,
                                  "name": "Lithuania",
                                  "names": {
                                      "en": "Lithuania"
                                  }
                              },
                              {
                                  "id": "GRC",
                                  "order": 9,
                                  "name": "Greece",
                                  "names": {
                                      "en": "Greece"
                                  }
                              },
                              {
                                  "id": "CAN",
                                  "order": 3,
                                  "name": "Canada",
                                  "names": {
                                      "en": "Canada"
                                  }
                              },
                              {
                                  "id": "IRL",
                                  "order": 12,
                                  "name": "Ireland",
                                  "names": {
                                      "en": "Ireland"
                                  }
                              },
                              {
                                  "id": "EST",
                                  "order": 31,
                                  "name": "Estonia",
                                  "names": {
                                      "en": "Estonia"
                                  }
                              },
                              {
                                  "id": "OECDE",
                                  "order": 40,
                                  "name": "OECD - Europe",
                                  "names": {
                                      "en": "OECD - Europe"
                                  }
                              },
                              {
                                  "id": "CZE",
                                  "order": 4,
                                  "name": "Czech Republic",
                                  "names": {
                                      "en": "Czech Republic"
                                  }
                              },
                              {
                                  "id": "DEU",
                                  "order": 8,
                                  "name": "Germany",
                                  "names": {
                                      "en": "Germany"
                                  }
                              },
                              {
                                  "id": "MEX",
                                  "order": 17,
                                  "name": "Mexico",
                                  "names": {
                                      "en": "Mexico"
                                  }
                              },
                              {
                                  "id": "CHE",
                                  "order": 26,
                                  "name": "Switzerland",
                                  "names": {
                                      "en": "Switzerland"
                                  }
                              },
                              {
                                  "id": "BEL",
                                  "order": 2,
                                  "name": "Belgium",
                                  "names": {
                                      "en": "Belgium"
                                  }
                              },
                              {
                                  "id": "NZL",
                                  "order": 19,
                                  "name": "New Zealand",
                                  "names": {
                                      "en": "New Zealand"
                                  }
                              },
                              {
                                  "id": "ITA",
                                  "order": 13,
                                  "name": "Italy",
                                  "names": {
                                      "en": "Italy"
                                  }
                              },
                              {
                                  "id": "CHL",
                                  "order": 30,
                                  "name": "Chile",
                                  "names": {
                                      "en": "Chile"
                                  }
                              },
                              {
                                  "id": "JPN",
                                  "order": 14,
                                  "name": "Japan",
                                  "names": {
                                      "en": "Japan"
                                  }
                              },
                              {
                                  "id": "NLD",
                                  "order": 18,
                                  "name": "Netherlands",
                                  "names": {
                                      "en": "Netherlands"
                                  }
                              },
                              {
                                  "id": "FRA",
                                  "order": 7,
                                  "name": "France",
                                  "names": {
                                      "en": "France"
                                  }
                              },
                              {
                                  "id": "SWE",
                                  "order": 25,
                                  "name": "Sweden",
                                  "names": {
                                      "en": "Sweden"
                                  }
                              },
                              {
                                  "id": "RUS",
                                  "order": 36,
                                  "name": "Russia",
                                  "names": {
                                      "en": "Russia"
                                  },
                                  "parent": "NMEC",
                                  "parents": [
                                      "NMEC"
                                  ]
                              },
                              {
                                  "id": "SVK",
                                  "order": 23,
                                  "name": "Slovak Republic",
                                  "names": {
                                      "en": "Slovak Republic"
                                  }
                              },
                              {
                                  "id": "AUT",
                                  "order": 1,
                                  "name": "Austria",
                                  "names": {
                                      "en": "Austria"
                                  }
                              },
                              {
                                  "id": "NOR",
                                  "order": 20,
                                  "name": "Norway",
                                  "names": {
                                      "en": "Norway"
                                  }
                              },
                              {
                                  "id": "USA",
                                  "order": 29,
                                  "name": "United States",
                                  "names": {
                                      "en": "United States"
                                  }
                              },
                              {
                                  "id": "GBR",
                                  "order": 28,
                                  "name": "United Kingdom",
                                  "names": {
                                      "en": "United Kingdom"
                                  }
                              },
                              {
                                  "id": "FIN",
                                  "order": 6,
                                  "name": "Finland",
                                  "names": {
                                      "en": "Finland"
                                  }
                              },
                              {
                                  "id": "KOR",
                                  "order": 15,
                                  "name": "Korea",
                                  "names": {
                                      "en": "Korea"
                                  }
                              },
                              {
                                  "id": "ESP",
                                  "order": 24,
                                  "name": "Spain",
                                  "names": {
                                      "en": "Spain"
                                  }
                              },
                              {
                                  "id": "NMEC",
                                  "order": 35,
                                  "name": "Non-OECD Economies",
                                  "names": {
                                      "en": "Non-OECD Economies"
                                  }
                              }
                          ]
                      },
                      {
                          "id": "POL",
                          "name": "Pollutant",
                          "names": {
                              "en": "Pollutant"
                          },
                          "keyPosition": 1,
                          "roles": [
                              "POL"
                          ],
                          "values": [
                              {
                                  "id": "SOX",
                                  "order": 0,
                                  "name": "Sulphur Oxides",
                                  "names": {
                                      "en": "Sulphur Oxides"
                                  }
                              }
                          ]
                      },
                      {
                          "id": "VAR",
                          "name": "Variable",
                          "names": {
                              "en": "Variable"
                          },
                          "keyPosition": 2,
                          "roles": [
                              "VAR"
                          ],
                          "values": [
                              {
                                  "id": "TOT",
                                  "order": 0,
                                  "name": "Total man-made emissions",
                                  "names": {
                                      "en": "Total man-made emissions"
                                  }
                              }
                          ]
                      },
                      {
                          "id": "TIME_PERIOD",
                          "name": "Year",
                          "names": {
                              "en": "Year"
                          },
                          "keyPosition": 3,
                          "roles": [
                              "YEA"
                          ],
                          "values": [
                              {
                                  "start": "2012-01-01T00:00:00",
                                  "end": "2012-12-31T23:59:59",
                                  "id": "2012",
                                  "name": "2012",
                                  "names": {
                                      "en": "2012"
                                  }
                              },
                              {
                                  "start": "2013-01-01T00:00:00",
                                  "end": "2013-12-31T23:59:59",
                                  "id": "2013",
                                  "name": "2013",
                                  "names": {
                                      "en": "2013"
                                  }
                              },
                              {
                                  "start": "2014-01-01T00:00:00",
                                  "end": "2014-12-31T23:59:59",
                                  "id": "2014",
                                  "name": "2014",
                                  "names": {
                                      "en": "2014"
                                  }
                              },
                              {
                                  "start": "2015-01-01T00:00:00",
                                  "end": "2015-12-31T23:59:59",
                                  "id": "2015",
                                  "name": "2015",
                                  "names": {
                                      "en": "2015"
                                  }
                              },
                              {
                                  "start": "2016-01-01T00:00:00",
                                  "end": "2016-12-31T23:59:59",
                                  "id": "2016",
                                  "name": "2016",
                                  "names": {
                                      "en": "2016"
                                  }
                              }
                          ]
                      }
                  ]
              },
              "attributes": {
                  "dataSet": [],
                  "dimensionGroup": [],
                  "series": [],
                  "observation": [
                      {
                          "id": "OBS_STATUS",
                          "name": "Observation Status",
                          "names": {
                              "en": "Observation Status"
                          },
                          "roles": [
                              "OBS_STATUS"
                          ],
                          "relationship": {
                              "observation": {}
                          },
                          "values": [
                              {
                                  "id": "E",
                                  "order": 3,
                                  "name": "Estimated value",
                                  "names": {
                                      "en": "Estimated value"
                                  }
                              },
                              {
                                  "id": "B",
                                  "order": 0,
                                  "name": "Break",
                                  "names": {
                                      "en": "Break"
                                  }
                              }
                          ]
                      },
                      {
                          "id": "TIME_FORMAT",
                          "name": "Time Format",
                          "names": {
                              "en": "Time Format"
                          },
                          "roles": [
                              "TIME_FORMAT"
                          ],
                          "relationship": {
                              "dimensions": [
                                  "COU",
                                  "POL",
                                  "VAR"
                              ]
                          },
                          "values": []
                      },
                      {
                          "id": "UNIT",
                          "name": "Unit",
                          "names": {
                              "en": "Unit"
                          },
                          "roles": [
                              "UNIT"
                          ],
                          "relationship": {
                              "dimensions": [
                                  "COU",
                                  "POL",
                                  "VAR"
                              ]
                          },
                          "values": [
                              {
                                  "id": "TONNE",
                                  "order": 83,
                                  "name": "Tonnes",
                                  "names": {
                                      "en": "Tonnes"
                                  },
                                  "parent": "4",
                                  "parents": [
                                      "4"
                                  ]
                              },
                              {
                                  "id": "4",
                                  "order": 54,
                                  "name": "PHYSICAL MEASURES",
                                  "names": {
                                      "en": "PHYSICAL MEASURES"
                                  }
                              }
                          ]
                      },
                      {
                          "id": "REFERENCEPERIOD",
                          "name": "Reference period",
                          "names": {
                              "en": "Reference period"
                          },
                          "roles": [
                              "REFERENCEPERIOD"
                          ],
                          "relationship": {
                              "dimensions": [
                                  "COU",
                                  "POL",
                                  "VAR"
                              ]
                          },
                          "values": []
                      },
                      {
                          "id": "POWERCODE",
                          "name": "Unit multiplier",
                          "names": {
                              "en": "Unit multiplier"
                          },
                          "roles": [
                              "POWERCODE"
                          ],
                          "relationship": {
                              "dimensions": [
                                  "COU",
                                  "POL",
                                  "VAR"
                              ]
                          },
                          "values": [
                              {
                                  "id": "3",
                                  "order": 3,
                                  "name": "Thousands",
                                  "names": {
                                      "en": "Thousands"
                                  }
                              }
                          ]
                      }
                  ]
              },
              "annotations": [
                  {
                      "type": "NonProductionDataflow",
                      "text": "true",
                      "texts": {
                          "en": "true"
                      }
                  },
                  {
                      "title": "VAR=TOT",
                      "type": "DEFAULT"
                  },
                  {
                      "title": "V2/structure/categoryscheme/OECD/OECDCS1/*/ENV,ENV.ENV_AC?references=dataflow",
                      "type": "RELATED_DATA"
                  }
              ],
              "dataSets": [
                  0
              ]
          }
      ]
  },
  "errors": []
}