{
    "meta": {
        "schema": "https://raw.githubusercontent.com/sdmx-twg/sdmx-json/master/data-message/tools/schemas/1.0/sdmx-json-data-schema.json",
        "id": "IREF063818",
        "prepared": "2023-09-19T14:43:53Z",
        "test": true,
        "contentLanguages": [
            "en"
        ],
        "sender": {
            "id": "SIS-CC-stable_-_DotStat_v8",
            "name": "unknown",
            "names": {
                "en": "unknown"
            }
        }
    },
    "data": {
        "dataSets": [
            {
                "action": "Information",
                "links": [
                    {
                        "urn": "urn:sdmx:org.sdmx.infomodel.datastructure.DataStructure=OECD.SDD.SDPS:DSD_DD_HCL(1.0)",
                        "rel": "DataStructure"
                    }
                ],
                "annotations": [
                    0,
                    1,
                    2,
                    3,
                    4,
                    5,
                    6,
                    7,
                    8,
                    9
                ],
                "observations": {
                    "0:0:0:0:0:0:0:0": [
                        15.08091706
                    ],
                    "0:0:0:0:1:0:1:0": [
                        34.12874478
                    ],
                    "0:0:0:0:2:0:2:0": [
                        51.43230071
                    ],
                    "0:0:0:0:3:0:3:0": [
                        82.29030898
                    ],
                    "0:0:0:0:4:0:4:0": [
                        85.32608692
                    ],
                    "0:0:0:0:5:0:5:0": [
                        18.17999999
                    ],
                    "0:0:0:0:6:0:6:0": [
                        11.78152307
                    ],
                    "0:0:0:0:7:0:7:0": [
                        66.05134691
                    ],
                    "0:0:0:0:8:0:8:0": [
                        92.95948824
                    ],
                    "0:0:0:0:9:0:9:0": [
                        99.56859403
                    ]
                }
            }
        ],
        "structure": {
            "name": "DD HCL order hierarcy test",
            "names": {
                "en": "DD HCL order hierarcy test"
            },
            "dimensions": {
                "dataset": [],
                "series": [],
                "observation": [
                    {
                        "id": "REF_AREA",
                        "name": "Reference area",
                        "names": {
                            "en": "Reference area"
                        },
                        "keyPosition": 0,
                        "roles": [
                            "REF_AREA"
                        ],
                        "values": [
                            {
                                "id": "AUS",
                                "order": 0,
                                "name": "Australia",
                                "names": {
                                    "en": "Australia"
                                },
                                "annotations": [
                                    10
                                ]
                            }
                        ]
                    },
                    {
                        "id": "FREQ",
                        "name": "Frequency of observation",
                        "names": {
                            "en": "Frequency of observation"
                        },
                        "keyPosition": 1,
                        "roles": [
                            "FREQ"
                        ],
                        "values": [
                            {
                                "id": "A",
                                "order": 0,
                                "name": "Annual",
                                "names": {
                                    "en": "Annual"
                                }
                            }
                        ]
                    },
                    {
                        "id": "MEASURE",
                        "name": "Measure",
                        "names": {
                            "en": "Measure"
                        },
                        "keyPosition": 2,
                        "roles": [
                            "MEASURE"
                        ],
                        "values": [
                            {
                                "id": "TE",
                                "order": 1,
                                "name": "Total employees",
                                "names": {
                                    "en": "Total employees"
                                }
                            }
                        ]
                    },
                    {
                        "id": "ACTIVITY",
                        "name": "Activity",
                        "names": {
                            "en": "Activity"
                        },
                        "keyPosition": 3,
                        "roles": [
                            "ACTIVITY"
                        ],
                        "values": [
                            {
                                "id": "A_B",
                                "order": 1,
                                "name": "Total Primary sector",
                                "names": {
                                    "en": "Total Primary sector"
                                },
                                "parent": "_T",
                                "annotations": [
                                    11,
                                    12
                                ]
                            }
                        ]
                    },
                    {
                        "id": "PRODUCT",
                        "name": "Product",
                        "names": {
                            "en": "Product"
                        },
                        "keyPosition": 4,
                        "roles": [
                            "PRODUCT"
                        ],
                        "values": [
                            {
                                "id": "CPA08_S941",
                                "order": 596,
                                "name": "Services furnished by business, employers and professional membership organisations",
                                "names": {
                                    "en": "Services furnished by business, employers and professional membership organisations"
                                },
                                "parent": "CPA08_S94",
                                "annotations": [
                                    13
                                ]
                            },
                            {
                                "id": "CPA08_T",
                                "order": 605,
                                "name": "Services of households as employers; undifferentiated goods and services produced by households for own use",
                                "names": {
                                    "en": "Services of households as employers; undifferentiated goods and services produced by households for own use"
                                },
                                "parent": "_T",
                                "annotations": [
                                    14
                                ]
                            },
                            {
                                "id": "CPA08_A03",
                                "order": 14,
                                "name": "Fish and other fishing products; aquaculture products; support services to fishing",
                                "names": {
                                    "en": "Fish and other fishing products; aquaculture products; support services to fishing"
                                },
                                "parent": "CPA08_A",
                                "annotations": [
                                    15
                                ]
                            },
                            {
                                "id": "CPA08_O84",
                                "order": 560,
                                "name": "Public administration and defence services; compulsory social security services",
                                "names": {
                                    "en": "Public administration and defence services; compulsory social security services"
                                },
                                "parent": "CPA08_O",
                                "annotations": [
                                    16
                                ]
                            },
                            {
                                "id": "CPA08_S94",
                                "order": 595,
                                "name": "Services furnished by membership organisations",
                                "names": {
                                    "en": "Services furnished by membership organisations"
                                },
                                "parent": "CPA08_S",
                                "annotations": [
                                    17
                                ]
                            },
                            {
                                "id": "CPA08_A01",
                                "order": 2,
                                "name": "Products of agriculture, hunting and related services",
                                "names": {
                                    "en": "Products of agriculture, hunting and related services"
                                },
                                "parent": "CPA08_A",
                                "annotations": [
                                    18
                                ]
                            },
                            {
                                "id": "CPA08_A02",
                                "order": 9,
                                "name": "Products of forestry, logging and related services",
                                "names": {
                                    "en": "Products of forestry, logging and related services"
                                },
                                "parent": "CPA08_A",
                                "annotations": [
                                    19
                                ]
                            },
                            {
                                "id": "CPA08_O",
                                "order": 559,
                                "name": "Public administration and defence services; compulsory social security services",
                                "names": {
                                    "en": "Public administration and defence services; compulsory social security services"
                                },
                                "parent": "_T",
                                "annotations": [
                                    20
                                ]
                            },
                            {
                                "id": "CPA08_S",
                                "order": 594,
                                "name": "Other services",
                                "names": {
                                    "en": "Other services"
                                },
                                "parent": "_T",
                                "annotations": [
                                    21
                                ]
                            },
                            {
                                "id": "CPA08_S942",
                                "order": 597,
                                "name": "Services furnished by trade unions",
                                "names": {
                                    "en": "Services furnished by trade unions"
                                },
                                "parent": "CPA08_S94",
                                "annotations": [
                                    22
                                ]
                            }
                        ]
                    },
                    {
                        "id": "DD_DIM",
                        "name": "Data type",
                        "names": {
                            "en": "Data type"
                        },
                        "keyPosition": 5,
                        "roles": [
                            "DD_DIM"
                        ],
                        "values": [
                            {
                                "id": "DD",
                                "order": 1,
                                "name": "Drilldown",
                                "names": {
                                    "en": "Drilldown"
                                }
                            }
                        ]
                    },
                    {
                        "id": "DD_ID",
                        "name": "DD ID",
                        "names": {
                            "en": "DD ID"
                        },
                        "keyPosition": 6,
                        "roles": [
                            "DD_ID"
                        ],
                        "values": [
                            {
                                "id": "132",
                                "order": 131,
                                "name": "132",
                                "names": {
                                    "en": "132"
                                }
                            },
                            {
                                "id": "52",
                                "order": 51,
                                "name": "52",
                                "names": {
                                    "en": "52"
                                }
                            },
                            {
                                "id": "36",
                                "order": 35,
                                "name": "36",
                                "names": {
                                    "en": "36"
                                }
                            },
                            {
                                "id": "100",
                                "order": 99,
                                "name": "100",
                                "names": {
                                    "en": "100"
                                }
                            },
                            {
                                "id": "116",
                                "order": 115,
                                "name": "116",
                                "names": {
                                    "en": "116"
                                }
                            },
                            {
                                "id": "4",
                                "order": 3,
                                "name": "4",
                                "names": {
                                    "en": "4"
                                }
                            },
                            {
                                "id": "20",
                                "order": 19,
                                "name": "20",
                                "names": {
                                    "en": "20"
                                }
                            },
                            {
                                "id": "84",
                                "order": 83,
                                "name": "84",
                                "names": {
                                    "en": "84"
                                }
                            },
                            {
                                "id": "68",
                                "order": 67,
                                "name": "68",
                                "names": {
                                    "en": "68"
                                }
                            },
                            {
                                "id": "148",
                                "order": 147,
                                "name": "148",
                                "names": {
                                    "en": "148"
                                }
                            }
                        ]
                    },
                    {
                        "id": "TIME_PERIOD",
                        "name": "Time period",
                        "names": {
                            "en": "Time period"
                        },
                        "keyPosition": 7,
                        "roles": [
                            "TIME_PERIOD"
                        ],
                        "values": [
                            {
                                "start": "2020-01-01T00:00:00",
                                "end": "2020-12-31T23:59:59",
                                "id": "2020",
                                "name": "2020",
                                "names": {
                                    "en": "2020"
                                }
                            }
                        ]
                    }
                ]
            },
            "attributes": {
                "dataSet": [],
                "series": [],
                "observation": []
            },
            "annotations": [
                {
                    "type": "NonProductionDataflow",
                    "text": "true",
                    "texts": {
                        "en": "true"
                    }
                },
                {
                    "id": "@SDMX",
                    "title": "MEASURE",
                    "type": "LAYOUT_ROW"
                },
                {
                    "id": "@SDMX",
                    "title": "TIME_PERIOD",
                    "type": "LAYOUT_COLUMN"
                },
                {
                    "id": "@SDMX",
                    "title": "ACTIVITY",
                    "type": "LAYOUT_ROW_SECTION"
                },
                {
                    "id": "@SDMX",
                    "title": "DD_DIM",
                    "type": "DRILLDOWN"
                },
                {
                    "id": "@SDMX",
                    "title": "PRODUCT,OBS_VALUE",
                    "type": "DRILLDOWN_CONCEPTS"
                },
                {
                    "id": "@SDMX",
                    "title": "DD_DIM,DD_ID",
                    "type": "NOT_DISPLAYED"
                },
                {
                    "id": "@SDMX",
                    "title": "DD_DIM=_T",
                    "type": "DEFAULT"
                },
                {
                    "id": "@SDMX",
                    "title": "PRODUCT:OECD.SDD.SDPS:HCL_PRODUCT_DD_HCL(1.0).H",
                    "type": "HIER_CONTEXT"
                },
                {
                    "title": "urn:sdmx:org.sdmx.infomodel.metadatastructure.MetadataStructure=OECD:MSD_REF_METADATA(1.0)",
                    "type": "METADATA"
                },
                {
                    "id": "@SDMX",
                    "type": "ORDER",
                    "text": "10",
                    "texts": {
                        "en": "10"
                    }
                },
                {
                    "id": "@SDMX",
                    "title": "A+B",
                    "type": "COMP_RULE"
                },
                {
                    "id": "@SDMX",
                    "type": "ORDER",
                    "text": "20",
                    "texts": {
                        "en": "20"
                    }
                },
                {
                    "id": "@SDMX",
                    "type": "ORDER",
                    "text": "5970",
                    "texts": {
                        "en": "5970"
                    }
                },
                {
                    "id": "@SDMX",
                    "type": "ORDER",
                    "text": "6060",
                    "texts": {
                        "en": "6060"
                    }
                },
                {
                    "id": "@SDMX",
                    "type": "ORDER",
                    "text": "150",
                    "texts": {
                        "en": "150"
                    }
                },
                {
                    "id": "@SDMX",
                    "type": "ORDER",
                    "text": "5610",
                    "texts": {
                        "en": "5610"
                    }
                },
                {
                    "id": "@SDMX",
                    "type": "ORDER",
                    "text": "5960",
                    "texts": {
                        "en": "5960"
                    }
                },
                {
                    "id": "@SDMX",
                    "type": "ORDER",
                    "text": "30",
                    "texts": {
                        "en": "30"
                    }
                },
                {
                    "id": "@SDMX",
                    "type": "ORDER",
                    "text": "100",
                    "texts": {
                        "en": "100"
                    }
                },
                {
                    "id": "@SDMX",
                    "type": "ORDER",
                    "text": "5600",
                    "texts": {
                        "en": "5600"
                    }
                },
                {
                    "id": "@SDMX",
                    "type": "ORDER",
                    "text": "5950",
                    "texts": {
                        "en": "5950"
                    }
                },
                {
                    "id": "@SDMX",
                    "type": "ORDER",
                    "text": "5980",
                    "texts": {
                        "en": "5980"
                    }
                }
            ]
        }
    },
    "errors": []
}