{
  "data": {
      "dataflows": [
          {
              "id": "DF_ALL_TOURISM_TRIPS",
              "links": [
                  {
                      "rel": "self",
                      "urn": "urn:sdmx:org.sdmx.infomodel.datastructure.Dataflow=OECD.CFE:DF_ALL_TOURISM_TRIPS(5.0)"
                  },
                  {
                      "href": "http://nsi-demo-stable.siscc.org/rest/dataflow/OECD.CFE/DF_ALL_TOURISM_TRIPS/5.0",
                      "rel": "external",
                      "urn": "urn:sdmx:org.sdmx.infomodel.datastructure.Dataflow=OECD.CFE:DF_ALL_TOURISM_TRIPS(5.0)"
                  }
              ],
              "version": "5.0",
              "agencyID": "OECD.CFE",
              "isExternalReference": true,
              "isFinal": true,
              "name": "Statistical database for tourism trips (unsliced hypercube)",
              "names": {
                  "en": "Statistical database for tourism trips (unsliced hypercube)"
              },
              "description": "This dataset gives access to all data within the \"hypercube\" defined by the data structure definition \"DSD_TOURISM_TRIPS\". It has no default layout or selections defined.",
              "descriptions": {
                  "en": "This dataset gives access to all data within the \"hypercube\" defined by the data structure definition \"DSD_TOURISM_TRIPS\". It has no default layout or selections defined."
              },
              "annotations": [
                  {
                      "type": "NonProductionDataflow",
                      "text": "true",
                      "texts": {
                          "en": "true"
                      }
                  }
              ]
          },
          {
              "id": "DF_DOMESTIC_TOURISM",
              "links": [
                  {
                      "rel": "self",
                      "urn": "urn:sdmx:org.sdmx.infomodel.datastructure.Dataflow=OECD.CFE:DF_DOMESTIC_TOURISM(5.0)"
                  },
                  {
                      "href": "http://nsi-demo-stable.siscc.org/rest/dataflow/OECD.CFE/DF_DOMESTIC_TOURISM/5.0",
                      "rel": "external",
                      "urn": "urn:sdmx:org.sdmx.infomodel.datastructure.Dataflow=OECD.CFE:DF_DOMESTIC_TOURISM(5.0)"
                  }
              ],
              "version": "5.0",
              "agencyID": "OECD.CFE",
              "isExternalReference": true,
              "isFinal": true,
              "name": "Domestic tourism",
              "names": {
                  "en": "Domestic tourism"
              },
              "annotations": [
                  {
                      "type": "NonProductionDataflow",
                      "text": "true",
                      "texts": {
                          "en": "true"
                      }
                  },
                  {
                      "title": "TIME_PERIOD,SOURCE",
                      "type": "LAYOUT_COLUMN"
                  },
                  {
                      "title": "REPORTING_COUNTRY",
                      "type": "LAYOUT_ROW_SECTION"
                  },
                  {
                      "title": "UNIT_MULT=0,ACTIVITY,TOURISM_FORM,FREQ",
                      "type": "NOT_DISPLAYED"
                  },
                  {
                      "title": "MEASURE,VISITOR_TYPE,ACCOMMODATION_TYPE",
                      "type": "LAYOUT_ROW"
                  },
                  {
                      "title": "SOURCE=TDS",
                      "type": "DEFAULT"
                  }
              ]
          },
          {
              "id": "DF_DOMESTIC_TOURISM_DEMO_INDICATOR",
              "links": [
                  {
                      "rel": "self",
                      "urn": "urn:sdmx:org.sdmx.infomodel.datastructure.Dataflow=OECD.CFE:DF_DOMESTIC_TOURISM_DEMO_INDICATOR(5.0)"
                  },
                  {
                      "href": "http://nsi-demo-stable.siscc.org/rest/dataflow/OECD.CFE/DF_DOMESTIC_TOURISM_DEMO_INDICATOR/5.0",
                      "rel": "external",
                      "urn": "urn:sdmx:org.sdmx.infomodel.datastructure.Dataflow=OECD.CFE:DF_DOMESTIC_TOURISM_DEMO_INDICATOR(5.0)"
                  }
              ],
              "version": "5.0",
              "agencyID": "OECD.CFE",
              "isExternalReference": true,
              "isFinal": true,
              "name": "Number of touristic visitors",
              "names": {
                  "en": "Number of touristic visitors"
              },
              "description": "The number of touristic visitors represent a key indicator that absolutely needs to be highlighted on the web site. Its content has been adapted to show a reduced selection, which varies only by reporting country and time. We could have added also a multiple selection for other dimensions. But this could be demoed with another example.",
              "descriptions": {
                  "en": "The number of touristic visitors represent a key indicator that absolutely needs to be highlighted on the web site. Its content has been adapted to show a reduced selection, which varies only by reporting country and time. We could have added also a multiple selection for other dimensions. But this could be demoed with another example."
              },
              "annotations": [
                  {
                      "type": "NonProductionDataflow",
                      "text": "true",
                      "texts": {
                          "en": "true"
                      }
                  },
                  {
                      "title": "TIME_PERIOD",
                      "type": "LAYOUT_COLUMN"
                  },
                  {
                      "title": "UNIT_MULT=0,ACTIVITY,TOURISM_FORM,FREQ,SOURCE,MEASURE",
                      "type": "NOT_DISPLAYED"
                  },
                  {
                      "title": "REPORTING_COUNTRY",
                      "type": "LAYOUT_ROW"
                  },
                  {
                      "title": "TIME_PERIOD_START=2012,TIME_PERIOD_END=2018",
                      "type": "DEFAULT"
                  }
              ]
          },
          {
              "id": "DF_INBOUND_TOURISM",
              "links": [
                  {
                      "rel": "self",
                      "urn": "urn:sdmx:org.sdmx.infomodel.datastructure.Dataflow=OECD.CFE:DF_INBOUND_TOURISM(5.0)"
                  },
                  {
                      "href": "http://nsi-demo-stable.siscc.org/rest/dataflow/OECD.CFE/DF_INBOUND_TOURISM/5.0",
                      "rel": "external",
                      "urn": "urn:sdmx:org.sdmx.infomodel.datastructure.Dataflow=OECD.CFE:DF_INBOUND_TOURISM(5.0)"
                  }
              ],
              "version": "5.0",
              "agencyID": "OECD.CFE",
              "isExternalReference": true,
              "isFinal": true,
              "name": "Inbound tourism",
              "names": {
                  "en": "Inbound tourism"
              },
              "annotations": [
                  {
                      "type": "NonProductionDataflow",
                      "text": "true",
                      "texts": {
                          "en": "true"
                      }
                  },
                  {
                      "title": "MEASURE,VISITOR_TYPE,ACCOMMODATION_TYPE,COUNTERPART_COUNTRY",
                      "type": "LAYOUT_ROW"
                  },
                  {
                      "title": "TIME_PERIOD,SOURCE",
                      "type": "LAYOUT_COLUMN"
                  },
                  {
                      "title": "REPORTING_COUNTRY",
                      "type": "LAYOUT_ROW_SECTION"
                  },
                  {
                      "title": "UNIT_MULT=0,ACTIVITY,TOURISM_FORM,FREQ",
                      "type": "NOT_DISPLAYED"
                  },
                  {
                      "title": "SOURCE=TSS",
                      "type": "DEFAULT"
                  }
              ]
          },
          {
              "id": "DF_OUTBOUND_TOURISM",
              "links": [
                  {
                      "rel": "self",
                      "urn": "urn:sdmx:org.sdmx.infomodel.datastructure.Dataflow=OECD.CFE:DF_OUTBOUND_TOURISM(5.0)"
                  },
                  {
                      "href": "http://nsi-demo-stable.siscc.org/rest/dataflow/OECD.CFE/DF_OUTBOUND_TOURISM/5.0",
                      "rel": "external",
                      "urn": "urn:sdmx:org.sdmx.infomodel.datastructure.Dataflow=OECD.CFE:DF_OUTBOUND_TOURISM(5.0)"
                  }
              ],
              "version": "5.0",
              "agencyID": "OECD.CFE",
              "isExternalReference": true,
              "isFinal": true,
              "name": "Outbound tourism",
              "names": {
                  "en": "Outbound tourism"
              },
              "annotations": [
                  {
                      "type": "NonProductionDataflow",
                      "text": "true",
                      "texts": {
                          "en": "true"
                      }
                  },
                  {
                      "title": "TIME_PERIOD",
                      "type": "LAYOUT_COLUMN"
                  },
                  {
                      "title": "REPORTING_COUNTRY",
                      "type": "LAYOUT_ROW_SECTION"
                  },
                  {
                      "title": "UNIT_MULT=0,ACTIVITY,TOURISM_FORM,FREQ",
                      "type": "NOT_DISPLAYED"
                  },
                  {
                      "title": "COUNTERPART_COUNTRY,VISITOR_TYPE",
                      "type": "LAYOUT_ROW"
                  },
                  {
                      "title": "REPORTING_COUNTRY=AU",
                      "type": "DEFAULT"
                  }
              ]
          }
      ],
      "dataStructures": [
          {
              "id": "DSD_TOURISM_TRIPS",
              "links": [
                  {
                      "rel": "self",
                      "urn": "urn:sdmx:org.sdmx.infomodel.datastructure.DataStructure=OECD.CFE:DSD_TOURISM_TRIPS(5.0)"
                  },
                  {
                      "href": "http://nsi-demo-stable.siscc.org/rest/datastructure/OECD.CFE/DSD_TOURISM_TRIPS/5.0",
                      "rel": "external",
                      "urn": "urn:sdmx:org.sdmx.infomodel.datastructure.DataStructure=OECD.CFE:DSD_TOURISM_TRIPS(5.0)"
                  }
              ],
              "version": "5.0",
              "agencyID": "OECD.CFE",
              "isExternalReference": true,
              "isFinal": true,
              "name": "DSD for tourism trips",
              "names": {
                  "en": "DSD for tourism trips"
              },
              "annotations": [
                  {
                      "title": "urn:sdmx:org.sdmx.infomodel.metadatastructure.MetadataStructure=OECD:MSD_REF_METADATA(1.0)",
                      "type": "METADATA"
                  }
              ],
              "dataStructureComponents": {}
          }
      ]
  },
  "meta": {
      "schema": "https://raw.githubusercontent.com/sdmx-twg/sdmx-json/develop/structure-message/tools/schemas/1.0/sdmx-json-structure-schema.json",
      "contentLanguages": [
          "en"
      ],
      "id": "IDREF335",
      "prepared": "2023-12-07T13:42:59Z",
      "test": false,
      "sender": {
          "id": "Unknown"
      },
      "receiver": [
          {
              "id": "Unknown"
          }
      ]
  }
}