{
    "numFound": 1,
    "start": 0,
    "dataflows": [
        {
            "dimensions": [
                "Reference area",
                "Measure",
                "Unit of measure",
                "Scale",
                "Time period"
            ],
            "name": "Satisfaction with public services - Government at a glance quantitative indicators, 2023 edition",
            "description": "Government at a Glance provides a dashboard of  indicators  assembled to help decision makers and the public analyse and benchmark governments across OECD members and partner countries. This dataset represents a selection of  indicators as presented in the 2023 edition of the Government at a Glance  publication. This eighth edition provides internationally comparative data on a range of public governance, tools and practices to help identify both strengths and weaknesses in democratic governance. The  Structure and indicators section of the Government at a Glance  publication, describes its framework and the structure by chapters, as well as the changes compared to the previous 2021 edition.The 2023 edition presents a new structure around these three broad categories: 1) Trust and satisfaction with public services (trust in public institutions, satisfaction with public services); 2) Achieving results with good governance practices (governance of the policy cycle, regulatory governance, budgeting practices, managing public procurement, infrastructure planning and delivery, digital government and open government data); and 3) What resources public institutions use and how are they managed (public finance, public employment, managing human resources). Further information on Government at a Glance 2023 edition, which includes a dedicated Government at a Glance Data dashboard (for a selection of indicators in an interactive format); Country fact sheets (key data by country); as well as the publication of qualitative data via a dedicated web platform (for the surveys collected by the Public Governance Directorate), can be found at: <a href=\"https://www.oecd.org/publication/government-at-a-glance/2023\">Government at a Glance website</a>",
            "dataflowId": "DSD_GOV_TDG_SPS_GPC@DF_GOV_SPS_2023",
            "version": "1.0",
            "agencyId": "OECD.GOV.GIP",
            "indexationDate": "2024-03-15T23:07:24.923Z",
            "lastUpdated": "2024-01-04T11:11:00.000Z",
            "id": "ds-demo-release:DSD_GOV_TDG_SPS_GPC@DF_GOV_SPS_2023",
            "datasourceId": "ds-demo-release",
            "Frequency of observation": [
                "0|Annual#A#"
            ],
            "Reference area": [
                "0|Australia#AUS#",
                "0|Austria#AUT#",
                "0|Belgium#BEL#",
                "0|Canada#CAN#",
                "0|Chile#CHL#",
                "0|Colombia#COL#",
                "0|Costa Rica#CRI#",
                "0|Czechia#CZE#",
                "0|Denmark#DNK#",
                "0|Estonia#EST#",
                "0|Finland#FIN#",
                "0|France#FRA#",
                "0|Germany#DEU#",
                "0|Greece#GRC#",
                "0|Hungary#HUN#",
                "0|Iceland#ISL#",
                "0|Ireland#IRL#",
                "0|Israel#ISR#",
                "0|Italy#ITA#",
                "0|Japan#JPN#",
                "0|Korea#KOR#",
                "0|Latvia#LVA#",
                "0|Lithuania#LTU#",
                "0|Luxembourg#LUX#",
                "0|Mexico#MEX#",
                "0|Netherlands#NLD#",
                "0|New Zealand#NZL#",
                "0|Norway#NOR#",
                "0|Poland#POL#",
                "0|Portugal#PRT#",
                "0|Slovak Republic#SVK#",
                "0|Slovenia#SVN#",
                "0|Spain#ESP#",
                "0|Sweden#SWE#",
                "0|Switzerland#CHE#",
                "0|Türkiye#TUR#",
                "0|United Kingdom#GBR#",
                "0|United States#USA#",
                "0|European Union countries in OECD#EUOECD#",
                "1|Non-OECD economies#WXOECD#|Brazil#BRA#",
                "1|Non-OECD economies#WXOECD#|Bulgaria#BGR#",
                "1|Non-OECD economies#WXOECD#|China (People’s Republic of)#CHN#",
                "1|Non-OECD economies#WXOECD#|Croatia#HRV#",
                "1|Non-OECD economies#WXOECD#|Indonesia#IDN#",
                "1|Non-OECD economies#WXOECD#|Romania#ROU#",
                "1|Non-OECD economies#WXOECD#|South Africa#ZAF#",
                "0|OECD average country#OECD_REP#"
            ],
            "Measure": [
                "0|Satisfaction with healthcare system#CS_HC#",
                "0|Satisfaction with education system#CS_ES#",
                "0|Confidence with the judicial system#CONF_JS#",
                "0|Satisfaction with adminstrative services#TRUST_S_AS#",
                "0|Ease of finding information#TRUST_E_FI#",
                "0|User support index for online services#USI_OS#",
                "0|Trust in administrative fairness#TRUST_AD_F#",
                "0|Equal treatment by public employees of the rich and poor#TRUST_FAIR#",
                "0|Practising physicians#DOC_PRACT#",
                "0|Waiting time for cataract surgery from specialist assessment to treatment#RH_CS#",
                "0|Thirty-day mortality after admission to hospital for stroke#QH_30M_ST#",
                "0|Enrolment rate at age 3 in early childhood and pre-primary education#AE_ENR_3#",
                "0|Enrolment rate at age 4 in early childhood and pre-primary education#AE_ENR_4#",
                "0|Young people not in education, employment or training#RE_Y_NEET#",
                "0|PISA mean score in mathematics#PEE_PISA_M#",
                "0|Percentage of variation in PISA mathematics score explained by socio-economic background#PEE_PISA_VMSEB#",
                "0|People can access and afford civil justice#AJ_AACJ#",
                "0|Time needed to resolve litigious civil and commercial cases#RJ_T_CC#",
                "0|Civil justice is free of improper government influence#EFJ_RLCJ_FGI#",
                "0|Satisfaction with healthcare system, male respondents#TRUST_S_HC_M#",
                "0|Satisfaction with healthcare system, female respondents#TRUST_S_HC_W#",
                "0|Satisfaction with healthcare system, young respondents#TRUST_S_HC_YOUNG#",
                "0|Satisfaction with healthcare system, elderly respondents#TRUST_S_HC_OLD#",
                "0|Satisfaction with healthcare system, low educated respondents#TRUST_S_HC_LE#",
                "0|Satisfaction with healthcare system, highly educated respondents#TRUST_S_HC_HE#",
                "0|Satisfaction with education system, male respondents#TRUST_S_EDU_M#",
                "0|Satisfaction with education system, female respondents#TRUST_S_EDU_W#",
                "0|Satisfaction with education system, young respondents#TRUST_S_EDU_YOUNG#",
                "0|Satisfaction with education system, elderly respondents#TRUST_S_EDU_OLD#",
                "0|Satisfaction with education system, low educated respondents#TRUST_S_EDU_LE#",
                "0|Satisfaction with education system, highly educated respondents#TRUST_S_EDU_HE#",
                "0|Satisfaction with administrative services, male respondents#TRUST_S_AS_M#",
                "0|Satisfaction with administrative services, female respondents#TRUST_S_AS_W#",
                "0|Satisfaction with administrative services, young respondents#TRUST_S_AS_YOUNG#",
                "0|Satisfaction with administrative services, elderly respondents#TRUST_S_AS_OLD#",
                "0|Satisfaction with administrative services, low educated respondents#TRUST_S_AS_LE#",
                "0|Satisfaction with administrative services, highly educated respondents#TRUST_S_AS_HE#"
            ],
            "Unit of measure": [
                "0|Days#D#",
                "0|Deaths per 100 patients#DT_10P2PAT#",
                "0|Per 1 000 inhabitants#10P3HB#",
                "0|Percentage of population aged 15-29 years#PT_POP_Y15T29#",
                "0|Percentage of students#PT_ST#",
                "0|Percentage of respondents#PT_RESP#",
                "0|Points#PO#",
                "0|Index#IX#"
            ],
            "Institutional sector": [
                "0|Not applicable#_Z#"
            ],
            "Edition": [
                "0|2023#2023#"
            ],
            "Scale": [
                "0|Likely#LIK#",
                "0|Satisfied#SAT#",
                "0|Confident#CON#",
                "0|Neutral#NEU#",
                "0|Unlikely#UNL#",
                "0|Don't know#DK#",
                "0|Not applicable#_Z#"
            ],
            "Category": [
                "0|Satisfaction with public services#SPS#"
            ],
            "Topic": [
                "0|Government#GOV#",
                "1|Government#GOV#|General government#GOV_GG#"
            ],
            "score": 6917.056
        }
    ],
    "facets": {
        "datasourceId": {
            "buckets": [
                {
                    "val": "ds-demo-release",
                    "count": 1
                }
            ]
        },
        "Reference area": {
            "buckets": [
                {
                    "val": "0|Australia#AUS#",
                    "count": 1,
                    "order": 10
                },
                {
                    "val": "0|Austria#AUT#",
                    "count": 1,
                    "order": 20
                },
                {
                    "val": "0|Belgium#BEL#",
                    "count": 1,
                    "order": 30
                },
                {
                    "val": "0|Canada#CAN#",
                    "count": 1,
                    "order": 40
                },
                {
                    "val": "0|Chile#CHL#",
                    "count": 1,
                    "order": 50
                },
                {
                    "val": "0|Colombia#COL#",
                    "count": 1,
                    "order": 60
                },
                {
                    "val": "0|Costa Rica#CRI#",
                    "count": 1,
                    "order": 70
                },
                {
                    "val": "0|Czechia#CZE#",
                    "count": 1,
                    "order": 80
                },
                {
                    "val": "0|Denmark#DNK#",
                    "count": 1,
                    "order": 90
                },
                {
                    "val": "0|Estonia#EST#",
                    "count": 1,
                    "order": 100
                },
                {
                    "val": "0|European Union countries in OECD#EUOECD#",
                    "count": 1,
                    "order": 710
                },
                {
                    "val": "0|Finland#FIN#",
                    "count": 1,
                    "order": 110
                },
                {
                    "val": "0|France#FRA#",
                    "count": 1,
                    "order": 120
                },
                {
                    "val": "0|Germany#DEU#",
                    "count": 1,
                    "order": 130
                },
                {
                    "val": "0|Greece#GRC#",
                    "count": 1,
                    "order": 140
                },
                {
                    "val": "0|Hungary#HUN#",
                    "count": 1,
                    "order": 150
                },
                {
                    "val": "0|Iceland#ISL#",
                    "count": 1,
                    "order": 160
                },
                {
                    "val": "0|Ireland#IRL#",
                    "count": 1,
                    "order": 170
                },
                {
                    "val": "0|Israel#ISR#",
                    "count": 1,
                    "order": 180
                },
                {
                    "val": "0|Italy#ITA#",
                    "count": 1,
                    "order": 190
                },
                {
                    "val": "0|Japan#JPN#",
                    "count": 1,
                    "order": 200
                },
                {
                    "val": "0|Korea#KOR#",
                    "count": 1,
                    "order": 210
                },
                {
                    "val": "0|Latvia#LVA#",
                    "count": 1,
                    "order": 220
                },
                {
                    "val": "0|Lithuania#LTU#",
                    "count": 1,
                    "order": 230
                },
                {
                    "val": "0|Luxembourg#LUX#",
                    "count": 1,
                    "order": 240
                },
                {
                    "val": "0|Mexico#MEX#",
                    "count": 1,
                    "order": 250
                },
                {
                    "val": "0|Netherlands#NLD#",
                    "count": 1,
                    "order": 260
                },
                {
                    "val": "0|New Zealand#NZL#",
                    "count": 1,
                    "order": 270
                },
                {
                    "val": "0|Norway#NOR#",
                    "count": 1,
                    "order": 280
                },
                {
                    "val": "0|OECD average country#OECD_REP#",
                    "count": 1,
                    "order": 990
                },
                {
                    "val": "0|Poland#POL#",
                    "count": 1,
                    "order": 290
                },
                {
                    "val": "0|Portugal#PRT#",
                    "count": 1,
                    "order": 300
                },
                {
                    "val": "0|Slovak Republic#SVK#",
                    "count": 1,
                    "order": 310
                },
                {
                    "val": "0|Slovenia#SVN#",
                    "count": 1,
                    "order": 320
                },
                {
                    "val": "0|Spain#ESP#",
                    "count": 1,
                    "order": 330
                },
                {
                    "val": "0|Sweden#SWE#",
                    "count": 1,
                    "order": 340
                },
                {
                    "val": "0|Switzerland#CHE#",
                    "count": 1,
                    "order": 350
                },
                {
                    "val": "0|Türkiye#TUR#",
                    "count": 1,
                    "order": 360
                },
                {
                    "val": "0|United Kingdom#GBR#",
                    "count": 1,
                    "order": 370
                },
                {
                    "val": "0|United States#USA#",
                    "count": 1,
                    "order": 380
                },
                {
                    "val": "1|Non-OECD economies#WXOECD#|Brazil#BRA#",
                    "count": 1,
                    "order": 1330
                },
                {
                    "val": "1|Non-OECD economies#WXOECD#|Bulgaria#BGR#",
                    "count": 1,
                    "order": 1370
                },
                {
                    "val": "1|Non-OECD economies#WXOECD#|China (People’s Republic of)#CHN#",
                    "count": 1,
                    "order": 1460
                },
                {
                    "val": "1|Non-OECD economies#WXOECD#|Croatia#HRV#",
                    "count": 1,
                    "order": 1530
                },
                {
                    "val": "1|Non-OECD economies#WXOECD#|Indonesia#IDN#",
                    "count": 1,
                    "order": 1940
                },
                {
                    "val": "1|Non-OECD economies#WXOECD#|Romania#ROU#",
                    "count": 1,
                    "order": 2580
                },
                {
                    "val": "1|Non-OECD economies#WXOECD#|South Africa#ZAF#",
                    "count": 1,
                    "order": 2800
                }
            ]
        },
        "Measure": {
            "buckets": [
                {
                    "val": "0|Civil justice is free of improper government influence#EFJ_RLCJ_FGI#",
                    "count": 1
                },
                {
                    "val": "0|Confidence with the judicial system#CONF_JS#",
                    "count": 1
                },
                {
                    "val": "0|Ease of finding information#TRUST_E_FI#",
                    "count": 1
                },
                {
                    "val": "0|Enrolment rate at age 3 in early childhood and pre-primary education#AE_ENR_3#",
                    "count": 1
                },
                {
                    "val": "0|Enrolment rate at age 4 in early childhood and pre-primary education#AE_ENR_4#",
                    "count": 1
                },
                {
                    "val": "0|Equal treatment by public employees of the rich and poor#TRUST_FAIR#",
                    "count": 1
                },
                {
                    "val": "0|PISA mean score in mathematics#PEE_PISA_M#",
                    "count": 1
                },
                {
                    "val": "0|People can access and afford civil justice#AJ_AACJ#",
                    "count": 1
                },
                {
                    "val": "0|Percentage of variation in PISA mathematics score explained by socio-economic background#PEE_PISA_VMSEB#",
                    "count": 1
                },
                {
                    "val": "0|Practising physicians#DOC_PRACT#",
                    "count": 1
                },
                {
                    "val": "0|Satisfaction with administrative services, elderly respondents#TRUST_S_AS_OLD#",
                    "count": 1
                },
                {
                    "val": "0|Satisfaction with administrative services, female respondents#TRUST_S_AS_W#",
                    "count": 1
                },
                {
                    "val": "0|Satisfaction with administrative services, highly educated respondents#TRUST_S_AS_HE#",
                    "count": 1
                },
                {
                    "val": "0|Satisfaction with administrative services, low educated respondents#TRUST_S_AS_LE#",
                    "count": 1
                },
                {
                    "val": "0|Satisfaction with administrative services, male respondents#TRUST_S_AS_M#",
                    "count": 1
                },
                {
                    "val": "0|Satisfaction with administrative services, young respondents#TRUST_S_AS_YOUNG#",
                    "count": 1
                },
                {
                    "val": "0|Satisfaction with adminstrative services#TRUST_S_AS#",
                    "count": 1
                },
                {
                    "val": "0|Satisfaction with education system#CS_ES#",
                    "count": 1
                },
                {
                    "val": "0|Satisfaction with education system, elderly respondents#TRUST_S_EDU_OLD#",
                    "count": 1
                },
                {
                    "val": "0|Satisfaction with education system, female respondents#TRUST_S_EDU_W#",
                    "count": 1
                },
                {
                    "val": "0|Satisfaction with education system, highly educated respondents#TRUST_S_EDU_HE#",
                    "count": 1
                },
                {
                    "val": "0|Satisfaction with education system, low educated respondents#TRUST_S_EDU_LE#",
                    "count": 1
                },
                {
                    "val": "0|Satisfaction with education system, male respondents#TRUST_S_EDU_M#",
                    "count": 1
                },
                {
                    "val": "0|Satisfaction with education system, young respondents#TRUST_S_EDU_YOUNG#",
                    "count": 1
                },
                {
                    "val": "0|Satisfaction with healthcare system#CS_HC#",
                    "count": 1
                },
                {
                    "val": "0|Satisfaction with healthcare system, elderly respondents#TRUST_S_HC_OLD#",
                    "count": 1
                },
                {
                    "val": "0|Satisfaction with healthcare system, female respondents#TRUST_S_HC_W#",
                    "count": 1
                },
                {
                    "val": "0|Satisfaction with healthcare system, highly educated respondents#TRUST_S_HC_HE#",
                    "count": 1
                },
                {
                    "val": "0|Satisfaction with healthcare system, low educated respondents#TRUST_S_HC_LE#",
                    "count": 1
                },
                {
                    "val": "0|Satisfaction with healthcare system, male respondents#TRUST_S_HC_M#",
                    "count": 1
                },
                {
                    "val": "0|Satisfaction with healthcare system, young respondents#TRUST_S_HC_YOUNG#",
                    "count": 1
                },
                {
                    "val": "0|Thirty-day mortality after admission to hospital for stroke#QH_30M_ST#",
                    "count": 1
                },
                {
                    "val": "0|Time needed to resolve litigious civil and commercial cases#RJ_T_CC#",
                    "count": 1
                },
                {
                    "val": "0|Trust in administrative fairness#TRUST_AD_F#",
                    "count": 1
                },
                {
                    "val": "0|User support index for online services#USI_OS#",
                    "count": 1
                },
                {
                    "val": "0|Waiting time for cataract surgery from specialist assessment to treatment#RH_CS#",
                    "count": 1
                },
                {
                    "val": "0|Young people not in education, employment or training#RE_Y_NEET#",
                    "count": 1
                }
            ]
        },
        "Topic": {
            "buckets": [
                {
                    "val": "0|Government#GOV#",
                    "count": 1,
                    "order": 8
                },
                {
                    "val": "1|Government#GOV#|General government#GOV_GG#",
                    "count": 1,
                    "order": 1
                }
            ]
        },
        "Frequency of observation": {
            "buckets": [
                {
                    "val": "0|Annual#A#",
                    "count": 1,
                    "order": 20
                }
            ]
        },
        "Unit of measure": {
            "buckets": [
                {
                    "val": "0|Days#D#",
                    "count": 1,
                    "order": 60
                },
                {
                    "val": "0|Deaths per 100 patients#DT_10P2PAT#",
                    "count": 1,
                    "order": 4140
                },
                {
                    "val": "0|Index#IX#",
                    "count": 1,
                    "order": 540
                },
                {
                    "val": "0|Per 1 000 inhabitants#10P3HB#",
                    "count": 1,
                    "order": 5170
                },
                {
                    "val": "0|Percentage of population aged 15-29 years#PT_POP_Y15T29#",
                    "count": 1,
                    "order": 5300
                },
                {
                    "val": "0|Percentage of respondents#PT_RESP#",
                    "count": 1,
                    "order": 7090
                },
                {
                    "val": "0|Percentage of students#PT_ST#",
                    "count": 1,
                    "order": 5470
                },
                {
                    "val": "0|Points#PO#",
                    "count": 1,
                    "order": 7170
                }
            ]
        },
        "Category": {
            "buckets": [
                {
                    "val": "0|Satisfaction with public services#SPS#",
                    "count": 1,
                    "order": 2
                }
            ]
        },
        "Edition": {
            "buckets": [
                {
                    "val": "0|2023#2023#",
                    "count": 1,
                    "order": 6
                }
            ]
        },
        "Scale": {
            "buckets": [
                {
                    "val": "0|Confident#CON#",
                    "count": 1,
                    "order": 4
                },
                {
                    "val": "0|Don't know#DK#",
                    "count": 1,
                    "order": 9
                },
                {
                    "val": "0|Likely#LIK#",
                    "count": 1,
                    "order": 1
                },
                {
                    "val": "0|Neutral#NEU#",
                    "count": 1,
                    "order": 5
                },
                {
                    "val": "0|Not applicable#_Z#",
                    "count": 1,
                    "order": 4470
                },
                {
                    "val": "0|Satisfied#SAT#",
                    "count": 1,
                    "order": 3
                },
                {
                    "val": "0|Unlikely#UNL#",
                    "count": 1,
                    "order": 6
                }
            ]
        },
        "Institutional sector": {
            "buckets": [
                {
                    "val": "0|Not applicable#_Z#",
                    "count": 1,
                    "order": 4470
                }
            ]
        }
    },
    "highlighting": {
        "ds-demo-release:DSD_GOV_TDG_SPS_GPC@DF_GOV_SPS_2023": {
            "description": [
                " represents a selection of  <mark>indicators</mark> as presented in the <mark>2023</mark> <mark>edition</mark> of the Government at a Glance"
            ],
            "name": [
                "Satisfaction with public services - Government at a glance quantitative <mark>indicators</mark>, <mark>2023</mark> <mark>edition</mark>"
            ],
            "Edition": [
                "0|<mark>2023</mark>#<mark>2023</mark>#"
            ]
        }
    }
}