<?xml version="1.0" encoding="utf-8"?>
<!-- Generator: Adobe Illustrator 19.2.0, SVG Export Plug-In . SVG Version: 6.00 Build 0)  -->
<svg version="1.1" id="Layer_2" xmlns="http://www.w3.org/2000/svg" xmlns:xlink="http://www.w3.org/1999/xlink" x="0px" y="0px"
	 viewBox="0 0 300 300" style="enable-background:new 0 0 300 300;" xml:space="preserve">
<style type="text/css">
	.st0{fill:#6DC1D0;}
	.st1{fill:#FECE0F;}
	.st2{fill:#F89720;}
	.st3{fill:#87C140;}
	.st4{fill:#0C6939;}
	.st5{fill:#F26524;}
	.st6{fill:#BE2332;}
	.st7{fill:#27A9E1;}
	.st8{fill:#1575BA;}
</style>
<g>
	<path class="st0" d="M43,70.2v40.4c3.9-0.2,7.6,1,10.6,3.1l10.2-7.1V70.2H43z M63.8,122.9l-2.8,2c0,0.2,0.1,0.5,0.1,0.7
		c0.8,5.7-1.2,11.1-5,14.9h7.7V122.9z M75,47.1v51.7l6-4.2c-0.1-0.4-0.2-0.8-0.3-1.3c-1.4-9.5,5.3-18.4,14.8-19.8c0.1,0,0.1,0,0.2,0
		V47.1H75z M88.8,105.6L75,115.2v25.3h20.8v-32.2C93.3,107.9,90.9,106.9,88.8,105.6L88.8,105.6z M107,7.7v68.2
		c2.7,1.6,4.9,3.9,6.4,6.7l14.4-2V7.7H107z M127.8,94.2l-13.2,1.9c-1.3,4.1-4,7.6-7.6,9.8v34.6h20.8V94.2z M139,37.5V79l4.2-0.6
		c1.3-7.3,7-13.3,14.7-14.4c0.6-0.1,1.2-0.1,1.8-0.1V37.5H139z M146.4,91.5l-7.4,1.1v47.9h20.8V98.8
		C154.4,98.5,149.5,95.8,146.4,91.5L146.4,91.5z"/>
	<path class="st1" d="M116.2,250.6c-4.9,0-9-2.4-11.5-6.6c-2.5-4.3-2.5-9,0-13.3l16.9-29.3l16.9-29.3h0.1c2.5-4.2,6.6-6.6,11.4-6.6
		c4.9,0,9,2.4,11.5,6.6l16.9,29.3l16.9,29.3c2.5,4.2,2.5,9,0,13.3c-2.5,4.2-6.6,6.6-11.5,6.6h-9.4c-5-14.8-14-27.8-24.4-27.8
		c-10.3,0-19.4,13-24.4,27.8H116.2z"/>
	<path class="st2" d="M174.7,271.2c0-15.4-11.1-38-24.7-38c-13.6,0-24.7,22.5-24.7,38c0,15.4,11.1,24.6,24.7,24.6
		C163.6,295.8,174.7,286.6,174.7,271.2L174.7,271.2z"/>
	<path class="st3" d="M229.8,229.8c-2.5,4.2-6.6,6.6-11.5,6.6c-4.9,0-9-2.4-11.5-6.6l-16.9-29.3L173,171.2l0,0
		c-2.4-4.2-2.5-9,0-13.2c2.4-4.2,6.6-6.6,11.5-6.6l33.8,0l33.8,0c4.9,0,9,2.4,11.5,6.6c2.5,4.2,2.5,9,0,13.3l-4.7,8.1
		c-15.3-3.1-31.1-1.8-36.3,7.2c-5.2,9,1.6,23.3,11.9,35L229.8,229.8L229.8,229.8z"/>
	<path class="st4" d="M276.9,189.4c-13.4-7.7-38.4-9.4-45.2,2.4c-6.8,11.8,7.2,32.7,20.5,40.4c13.4,7.7,26.8,2.7,33.6-9.1
		C292.6,211.2,290.2,197.1,276.9,189.4L276.9,189.4z"/>
	<path class="st5" d="M70.2,229.8c2.5,4.2,6.6,6.6,11.5,6.6c4.9,0,9-2.4,11.5-6.6l16.9-29.3l16.9-29.3l0,0c2.4-4.2,2.5-9,0-13.2
		c-2.4-4.2-6.6-6.6-11.5-6.6l-33.8,0l-33.8,0c-4.9,0-9,2.4-11.5,6.6c-2.5,4.2-2.5,9,0,13.3l4.7,8.1c15.3-3.1,31.1-1.8,36.3,7.2
		c5.2,9-1.6,23.3-11.9,35L70.2,229.8L70.2,229.8z"/>
	<path class="st6" d="M23.1,189.4c13.4-7.7,38.4-9.4,45.2,2.4c6.8,11.8-7.2,32.7-20.5,40.4c-13.4,7.7-26.8,2.7-33.6-9.1
		C7.4,211.2,9.8,197.1,23.1,189.4L23.1,189.4z"/>
	<path class="st7" d="M263.6,121.9c2.5,4.2,2.5,9,0,13.3c-2.5,4.3-6.6,6.6-11.5,6.6l-33.8,0l-33.8,0l0,0c-4.9,0-9-2.4-11.5-6.6
		c-2.4-4.2-2.4-9,0-13.3l16.9-29.3l16.9-29.3c2.5-4.3,6.6-6.6,11.5-6.6c4.9,0,9,2.4,11.5,6.6l4.7,8.1c-10.3,11.7-17.1,26-11.9,35
		c5.2,9,21,10.3,36.3,7.2L263.6,121.9L263.6,121.9z"/>
	<path class="st8" d="M252.2,61c-13.4,7.7-27.3,28.6-20.5,40.4c6.8,11.8,31.9,10.1,45.2,2.4c13.4-7.7,15.8-21.9,8.9-33.7
		C279,58.3,265.5,53.3,252.2,61L252.2,61z"/>
	<path class="st5" d="M201.7,17c6.3,0.4,11.6,5.1,12.5,11.5c1.1,7.4-4.1,14.2-11.4,15.2c-1.7,0.2-3.5,0.1-5.1-0.3l-1.2-0.3l-0.8,1
		l-23,28.7l-0.8,1l0.6,1.2c0.7,1.3,1.2,2.8,1.4,4.3c1.1,7.4-4.1,14.2-11.4,15.2c-5.5,0.8-10.6-1.9-13.3-6.3l-0.7-1.1l-1.3,0.2
		l-34.1,4.9l-1.4,0.2l-0.3,1.4c-1.2,5.3-5.5,9.6-11.2,10.4c-3.7,0.5-7.3-0.6-10-2.6l-1.2-0.9l-1.2,0.8l-30,20.7l-1.2,0.8l0.3,1.4
		c0.1,0.5,0.2,1.1,0.3,1.7c1.1,7.4-4,14.2-11.4,15.2c-2.1,0.3-4.2,0-6.2-0.7c0,0,0,0-0.1,0c-1.9-0.7-5.3-3.1-6.6-4.9c0,0,0,0,0,0
		c-1.2-1.7-2-3.6-2.3-5.8c-1.1-7.4,4.1-14.2,11.4-15.2c3.9-0.6,7.6,0.6,10.5,3l1.2,1l1.3-0.9l29.6-20.6l1.2-0.9l-0.4-1.4
		c-0.2-0.7-0.4-1.3-0.5-2.1c-1.1-7.4,4.1-14.2,11.4-15.2c6.2-0.9,11.9,2.6,14.2,8L111,87l1.5-0.2l32.7-4.6l1.6-0.2l0.1-1.6
		c0.5-6.2,5.1-11.4,11.5-12.3c2.9-0.4,5.6,0.1,8,1.3l1.5,0.7l1-1.3l21.7-27.1l1-1.3l-1.1-1.3c-1.6-1.9-2.7-4.2-3.1-6.7
		c-1-6.9,3.5-13.4,10.1-15c0.2-0.1,0.7-0.1,1.3-0.2C199.9,17,200.8,17,201.7,17L201.7,17z"/>
</g>
</svg>
