<?xml version="1.0" encoding="UTF-8"?>
<svg id="Layer_1" data-name="Layer 1" xmlns="http://www.w3.org/2000/svg" viewBox="0 0 832.86 288.1">
  <defs>
    <style>
      .cls-1 {
        fill: #fff;
      }

      .cls-2 {
        fill: #87c140;
      }

      .cls-3 {
        fill: #6dc1d0;
      }

      .cls-4 {
        fill: #f89720;
      }

      .cls-5 {
        fill: #0c6939;
      }

      .cls-6 {
        fill: #f26524;
      }

      .cls-7 {
        fill: #fece0f;
      }

      .cls-8 {
        fill: #27a9e1;
      }

      .cls-9 {
        fill: #1575ba;
      }

      .cls-10 {
        fill: #be2332;
      }
    </style>
  </defs>
  <path class="cls-1" d="m357.86,162.9c0,2.9-.9,5.2-2.7,7-1.8,1.8-4.1,2.7-6.9,2.7h-34.4c-2.9,0-5.2-.9-7-2.7s-2.7-4.1-2.7-7v-34.6h12.1v33.6h29.5v-32.6l-37.7-45.5c-2.6-3.1-3.9-6.6-3.9-10.4v-27.7c0-2.8.9-5.2,2.7-7,1.8-1.8,4.2-2.7,7-2.7h34.4c2.8,0,5.2.9,6.9,2.7,1.8,1.8,2.7,4.1,2.7,7v31.8h-12.1v-30.8h-29.5v28.8l37.9,45.5c2.5,3,3.7,6.4,3.8,10.2v31.7h-.1Zm34.3,9.7h-12.1V36h12.1v136.6Zm76-9.7c0,2.9-.9,5.2-2.7,7-1.8,1.8-4.1,2.7-6.9,2.7h-34.4c-2.9,0-5.2-.9-7-2.7s-2.7-4.1-2.7-7v-34.6h12.1v33.6h29.5v-32.6l-37.7-45.5c-2.6-3.1-3.9-6.6-3.9-10.4v-27.7c0-2.8.9-5.2,2.7-7,1.8-1.8,4.2-2.7,7-2.7h34.4c2.8,0,5.2.9,6.9,2.7,1.8,1.8,2.7,4.1,2.7,7v31.8h-12.1v-30.8h-29.5v28.8l37.9,45.5c2.5,3,3.7,6.4,3.7,10.2v31.7Zm54.9-37h-36v-10.8h36v10.8Zm74,37c0,2.9-.9,5.2-2.8,7-1.9,1.8-4.2,2.7-7.1,2.7h-35.2c-2.9,0-5.2-.9-7-2.7s-2.7-4.1-2.7-7V45.7c0-2.8.9-5.2,2.7-7s4.1-2.7,7-2.7h35.2c2.8,0,5.2.9,7.1,2.7,1.9,1.8,2.8,4.1,2.8,7v31.8h-12.2v-30.8h-30.4v115.1h30.4v-33.6h12.2v34.7Zm76.1,0c0,2.9-.9,5.2-2.8,7-1.9,1.8-4.2,2.7-7.1,2.7h-35.2c-2.9,0-5.2-.9-7-2.7s-2.7-4.1-2.7-7V45.7c0-2.8.9-5.2,2.7-7s4.1-2.7,7-2.7h35.2c2.8,0,5.2.9,7.1,2.7,1.9,1.8,2.8,4.1,2.8,7v31.8h-12.2v-30.8h-30.4v115.1h30.4v-33.6h12.2v34.7h0Zm-370.1,49l3.8-.4v1c0,1.1.3,2.1.8,3.1.5.9,1.4,1.6,2.6,2.2,1.2.5,2.6.8,4.2.8,2.3,0,4.1-.5,5.3-1.5,1.2-1,1.8-2.2,1.8-3.5,0-.9-.3-1.7-1-2.5-.7-.7-2.5-1.7-5.4-3-2.3-1-3.8-1.7-4.7-2.3-1.3-.9-2.3-1.8-2.9-2.8s-.9-2.2-.9-3.4c0-1.5.4-2.8,1.2-4,.8-1.2,2-2.1,3.6-2.7,1.6-.6,3.4-1,5.3-1,2.4,0,4.3.4,6,1.2,1.6.8,2.8,1.8,3.5,3.2.7,1.3,1.1,2.6,1.1,3.8v.6l-3.7.3c0-.8-.1-1.5-.2-1.9-.3-.8-.7-1.5-1.2-2-.6-.6-1.3-1-2.3-1.3s-2.1-.5-3.2-.5c-2.1,0-3.8.5-4.9,1.4-.9.7-1.3,1.7-1.3,2.9,0,.7.2,1.4.6,1.9.4.6,1,1.1,2,1.6.7.4,2.3,1.1,4.9,2.3,2.1.9,3.5,1.6,4.3,2.2,1.1.7,1.9,1.6,2.4,2.5.6,1,.8,2.1.9,3.4,0,1.6-.5,3-1.4,4.3-1,1.3-2.3,2.3-4,3.1-1.7.7-3.6,1.1-5.8,1.1-3.3,0-6-.7-8-2.1-2.4-1.7-3.4-4.3-3.4-8h0Zm33.9,6.5l-.6,2.9c-.9.2-1.7.3-2.5.3-1.4,0-2.6-.4-3.4-1-.6-.5-.9-1.2-.9-2.2,0-.5.2-1.5.5-3.2l2.6-12.2h-2.8l.6-2.8h2.8l1.1-5.2,4.1-2.5-1.6,7.6h3.5l-.6,2.8h-3.5l-2.4,11.6c-.3,1.5-.5,2.4-.5,2.6,0,.4.1.7.4,1,.2.2.6.3,1.2.3.7.2,1.4.1,2,0h0Zm17,.3c-1.2,1.1-2.4,1.8-3.6,2.3-1.1.5-2.4.7-3.7.7-1.9,0-3.5-.6-4.7-1.7-1.2-1.1-1.8-2.6-1.8-4.4,0-1.2.3-2.2.8-3.1.5-.9,1.2-1.6,2.1-2.2.9-.5,2-.9,3.2-1.2.8-.2,2.3-.3,4.6-.4,2.2-.1,3.9-.3,4.8-.7.3-1,.4-1.8.4-2.4,0-.8-.3-1.5-.9-2-.8-.7-2-1-3.6-1-1.5,0-2.7.3-3.7,1s-1.7,1.6-2.1,2.8l-3.5-.1c.7-2.1,1.9-3.7,3.5-4.8s3.6-1.7,6.1-1.7,4.7.6,6.2,1.9c1.2.9,1.7,2.1,1.7,3.6,0,1.1-.2,2.4-.5,3.9l-1.2,5.2c-.4,1.7-.6,3-.6,4.1,0,.7.1,1.6.4,2.8h-3.6c-.1-.7-.2-1.6-.3-2.6h0Zm1.3-8.1c-.5.2-1,.4-1.6.5s-1.5.2-2.9.3c-2.1.2-3.6.4-4.4.7-.9.3-1.5.7-1.9,1.4-.4.6-.7,1.3-.7,2.1,0,1,.3,1.8,1,2.5s1.7,1,3,1c1.2,0,2.3-.3,3.4-.9,1.1-.6,2-1.5,2.6-2.6.7-1.3,1.2-2.9,1.5-5h0Zm15.4,7.8l-.6,2.9c-.9.2-1.7.3-2.5.3-1.4,0-2.6-.4-3.4-1-.6-.5-.9-1.2-.9-2.2,0-.5.2-1.5.5-3.2l2.6-12.2h-2.8l.6-2.8h2.8l1.1-5.2,4.1-2.5-1.6,7.6h3.5l-.6,2.8h-3.5l-2.4,11.6c-.3,1.5-.5,2.4-.5,2.6,0,.4.1.7.4,1,.2.2.6.3,1.2.3.7.2,1.4.1,2,0h0Zm8-22.1l.8-4.1h3.6l-.9,4.1h-3.5Zm-5.2,25l4.4-21h3.6l-4.4,21h-3.6Zm9.5-7.2l3.6-.2c0,1,.2,1.9.5,2.6.3.7.9,1.3,1.7,1.8.8.5,1.8.7,3,.7,1.6,0,2.8-.3,3.6-.9.8-.6,1.2-1.4,1.2-2.2,0-.6-.2-1.2-.7-1.8-.5-.5-1.7-1.2-3.6-2s-3.1-1.4-3.6-1.7c-.9-.5-1.5-1.2-2-1.9s-.7-1.6-.7-2.5c0-1.7.7-3.1,2-4.3s3.2-1.8,5.5-1.8c2.6,0,4.6.6,6,1.8s2.1,2.8,2.1,4.8l-3.5.2c-.1-1.3-.5-2.3-1.3-3s-2-1.1-3.6-1.1c-1.2,0-2.2.3-2.9.9-.7.6-1,1.2-1,1.8,0,.7.3,1.2.9,1.7.4.3,1.4.9,3.1,1.6,2.7,1.2,4.5,2.1,5.2,2.8,1.1,1.1,1.7,2.4,1.7,4,0,1-.3,2.1-1,3.1-.6,1-1.6,1.8-2.9,2.4-1.3.6-2.9.9-4.6.9-2.4,0-4.5-.6-6.2-1.8-1.8-1.2-2.6-3.2-2.5-5.9h0Zm28.2,4.3l-.6,2.9c-.9.2-1.7.3-2.5.3-1.4,0-2.6-.4-3.4-1-.6-.5-.9-1.2-.9-2.2,0-.5.2-1.5.5-3.2l2.6-12.2h-2.8l.6-2.8h2.8l1.1-5.2,4.1-2.5-1.6,7.6h3.5l-.6,2.8h-3.5l-2.4,11.6c-.3,1.5-.5,2.4-.5,2.6,0,.4.1.7.4,1,.2.2.6.3,1.2.3.7.2,1.4.1,2,0h0Zm8-22.1l.8-4.1h3.6l-.9,4.1h-3.5Zm-5.2,25l4.4-21h3.6l-4.4,21h-3.6Zm23.6-7.7l3.6.4c-.9,2.6-2.2,4.6-3.8,5.8-1.7,1.3-3.5,1.9-5.6,1.9-2.3,0-4.1-.7-5.5-2.2s-2.1-3.5-2.1-6.2c0-2.3.5-4.5,1.4-6.8.9-2.2,2.2-3.9,3.9-5,1.7-1.1,3.6-1.7,5.8-1.7s4,.6,5.4,1.9c1.3,1.3,2,3,2,5l-3.5.2c0-1.3-.4-2.4-1.2-3.1-.8-.8-1.8-1.1-3-1.1-1.4,0-2.7.5-3.7,1.4-1.1.9-1.9,2.3-2.5,4.1-.6,1.9-.9,3.6-.9,5.4s.4,3.1,1.2,4c.8.9,1.8,1.3,2.9,1.3,1.2,0,2.3-.4,3.3-1.3.9-.8,1.7-2.2,2.3-4h0Zm19.9,5.1c-1.2,1.1-2.4,1.8-3.6,2.3-1.1.5-2.4.7-3.7.7-1.9,0-3.5-.6-4.7-1.7-1.2-1.1-1.8-2.6-1.8-4.4,0-1.2.3-2.2.8-3.1.5-.9,1.2-1.6,2.1-2.2.9-.5,2-.9,3.2-1.2.8-.2,2.3-.3,4.6-.4,2.2-.1,3.9-.3,4.8-.7.3-1,.4-1.8.4-2.4,0-.8-.3-1.5-.9-2-.8-.7-2-1-3.6-1-1.5,0-2.7.3-3.7,1s-1.7,1.6-2.1,2.8l-3.6-.3c.7-2.1,1.9-3.7,3.5-4.8s3.6-1.7,6.1-1.7,4.7.6,6.2,1.9c1.2.9,1.7,2.1,1.7,3.6,0,1.1-.2,2.4-.5,3.9l-1.2,5.2c-.4,1.7-.6,3-.6,4.1,0,.7.1,1.6.4,2.8h-3.6c0-.5-.1-1.4-.2-2.4h0Zm1.3-8.1c-.5.2-1,.4-1.6.5s-1.5.2-2.9.3c-2.1.2-3.6.4-4.4.7-.9.3-1.5.7-1.9,1.4-.4.6-.7,1.3-.7,2.1,0,1,.3,1.8,1,2.5s1.7,1,3,1c1.2,0,2.3-.3,3.4-.9,1.1-.6,2-1.5,2.6-2.6.7-1.3,1.2-2.9,1.5-5h0Zm6.8,10.7l6.1-29h3.6l-6.1,29h-3.6Zm21.5,0l6.1-29h3.9l-6.1,29h-3.9Zm10.3,0l4.4-21h3.2l-.8,3.7c1.4-1.4,2.7-2.5,4-3.1,1.2-.7,2.5-1,3.8-1,1.7,0,3,.5,4,1.4s1.5,2.2,1.5,3.7c0,.8-.2,2-.5,3.7l-2.7,12.7h-3.6l2.8-13.3c.3-1.3.4-2.2.4-2.9s-.2-1.3-.7-1.7-1.2-.7-2.1-.7c-1.8,0-3.5.7-4.9,2s-2.5,3.6-3.2,6.8l-2,9.8h-3.6v-.1Zm23,0l3.8-18.2h-3.2l.6-2.8h3.2l.6-3c.3-1.5.6-2.6,1-3.2.3-.7.9-1.2,1.6-1.6.8-.4,1.8-.6,3.1-.6.9,0,2.2.2,4,.6l-.7,3.1c-1.2-.3-2.2-.5-3-.5-.7,0-1.2.2-1.6.5-.4.3-.7,1.2-.9,2.5l-.5,2.3h4l-.6,2.8h-4l-3.8,18.2h-3.6v-.1Zm11.4-8c0-4.1,1.2-7.5,3.6-10.2,2-2.2,4.6-3.3,7.8-3.3,2.5,0,4.6.8,6.1,2.4,1.5,1.6,2.3,3.7,2.3,6.4,0,2.4-.5,4.7-1.5,6.7-1,2.1-2.4,3.7-4.2,4.8s-3.7,1.7-5.7,1.7c-1.6,0-3.1-.4-4.5-1-1.3-.7-2.4-1.7-3.1-3-.5-1.3-.8-2.8-.8-4.5h0Zm3.5-.3c0,2,.5,3.5,1.4,4.5s2.2,1.5,3.6,1.5c.8,0,1.5-.2,2.3-.5.7-.3,1.5-.8,2.1-1.4.6-.6,1.2-1.4,1.6-2.2.5-.8.8-1.7,1.1-2.6.4-1.3.6-2.6.6-3.8,0-1.9-.5-3.4-1.4-4.4-1-1-2.2-1.6-3.6-1.6-1.1,0-2.1.3-3.1.8-.9.5-1.8,1.3-2.5,2.3s-1.3,2.2-1.6,3.6c-.3,1.5-.5,2.7-.5,3.8h0Zm18.4,8.3l4.4-21h3.2l-.9,4.3c1.1-1.6,2.1-2.8,3.2-3.6,1-.8,2.1-1.2,3.2-1.2.7,0,1.6.3,2.6.8l-1.5,3.3c-.6-.4-1.3-.7-2-.7-1.3,0-2.5.7-3.9,2.1-1.3,1.4-2.4,3.9-3.1,7.5l-1.8,8.4h-3.4v.1Zm13.5,0l4.4-21h3.6l-.7,3.5c1.3-1.5,2.5-2.5,3.6-3.1,1-.6,2.2-.8,3.4-.8,1.3,0,2.4.4,3.3,1,.9.7,1.5,1.7,1.7,2.9,1.1-1.3,2.2-2.3,3.4-3s2.4-1,3.7-1c1.8,0,3.1.4,3.9,1.2.9.8,1.3,2,1.3,3.5,0,.7-.2,1.7-.5,3.2l-2.8,13.5h-3.6l2.9-13.9c.3-1.1.4-1.9.4-2.4,0-.7-.2-1.2-.7-1.6-.4-.4-1-.6-1.8-.6-1.1,0-2.2.3-3.3,1s-2,1.5-2.6,2.5c-.6,1.1-1.2,2.7-1.6,4.8l-2.1,10.2h-3.6l3-14.2c.2-1,.3-1.6.3-2.1,0-.7-.2-1.2-.6-1.7-.4-.4-1-.6-1.7-.6-1,0-2.1.3-3.2,1-1.1.7-2,1.5-2.7,2.7s-1.3,2.8-1.7,4.9l-2.1,9.9h-3.6v.2Zm47.9-2.6c-1.2,1.1-2.4,1.8-3.6,2.3-1.1.5-2.4.7-3.7.7-1.9,0-3.5-.6-4.7-1.7-1.2-1.1-1.8-2.6-1.8-4.4,0-1.2.3-2.2.8-3.1.5-.9,1.2-1.6,2.1-2.2.9-.5,2-.9,3.2-1.2.8-.2,2.3-.3,4.6-.4,2.2-.1,3.9-.3,4.8-.7.3-1,.4-1.8.4-2.4,0-.8-.3-1.5-.9-2-.8-.7-2-1-3.6-1-1.5,0-2.7.3-3.7,1s-1.7,1.6-2.1,2.8l-3.6-.3c.7-2.1,1.9-3.7,3.5-4.8s3.6-1.7,6.1-1.7,4.7.6,6.2,1.9c1.2.9,1.7,2.1,1.7,3.6,0,1.1-.2,2.4-.5,3.9l-1.2,5.2c-.4,1.7-.6,3-.6,4.1,0,.7.1,1.6.4,2.8h-3.6c0-.5-.1-1.4-.2-2.4h0Zm1.3-8.1c-.5.2-1,.4-1.6.5s-1.5.2-2.9.3c-2.1.2-3.6.4-4.4.7-.9.3-1.5.7-1.9,1.4-.4.6-.7,1.3-.7,2.1,0,1,.3,1.8,1,2.5s1.7,1,3,1c1.2,0,2.3-.3,3.4-.9,1.1-.6,2-1.5,2.6-2.6.7-1.3,1.2-2.9,1.5-5h0Zm15.4,7.8l-.5,2.9c-.9.2-1.7.3-2.5.3-1.4,0-2.6-.4-3.4-1-.6-.5-.9-1.2-.9-2.2,0-.5.2-1.5.5-3.2l2.6-12.2h-2.8l.6-2.8h2.8l1.1-5.2,4.1-2.5-1.6,7.6h3.5l-.6,2.8h-3.5l-2.4,11.6c-.3,1.5-.5,2.4-.5,2.6,0,.4.1.7.4,1,.2.2.6.3,1.2.3.6.2,1.3.1,1.9,0h0Zm8-22.1l.9-4.1h3.6l-1,4.1h-3.5Zm-5.2,25l4.4-21h3.6l-4.4,21h-3.6Zm9.8-8c0-4.1,1.2-7.5,3.6-10.2,2-2.2,4.6-3.3,7.8-3.3,2.5,0,4.6.8,6.1,2.4,1.5,1.6,2.3,3.7,2.3,6.4,0,2.4-.5,4.7-1.5,6.7-1,2.1-2.4,3.7-4.2,4.8s-3.7,1.7-5.7,1.7c-1.6,0-3.1-.4-4.5-1-1.3-.7-2.4-1.7-3.1-3-.5-1.3-.8-2.8-.8-4.5h0Zm3.5-.3c0,2,.5,3.5,1.4,4.5s2.2,1.5,3.6,1.5c.8,0,1.5-.2,2.3-.5.7-.3,1.5-.8,2.1-1.4.6-.6,1.2-1.4,1.6-2.2.5-.8.8-1.7,1.1-2.6.4-1.3.6-2.6.6-3.8,0-1.9-.5-3.4-1.4-4.4-1-1-2.2-1.6-3.6-1.6-1.1,0-2.1.3-3.1.8-.9.5-1.8,1.3-2.5,2.3s-1.3,2.2-1.6,3.6c-.3,1.5-.5,2.7-.5,3.8h0Zm18.4,8.3l4.4-21h3.2l-.8,3.7c1.4-1.4,2.7-2.5,4-3.1,1.2-.7,2.5-1,3.8-1,1.7,0,3,.5,4,1.4s1.4,2.2,1.5,3.7c0,.8-.2,2-.5,3.7l-2.7,12.7h-3.6l2.8-13.3c.3-1.3.4-2.2.4-2.9s-.2-1.3-.7-1.7-1.2-.7-2.1-.7c-1.8,0-3.5.7-4.9,2s-2.5,3.6-3.2,6.8l-2,9.8h-3.6v-.1Zm35.2-9.4l3.8-.4v1c0,1.1.3,2.1.8,3.1.5.9,1.4,1.6,2.5,2.2,1.2.5,2.6.8,4.2.8,2.3,0,4.1-.5,5.3-1.5s1.8-2.2,1.8-3.5c0-.9-.3-1.7-1-2.5-.7-.7-2.5-1.7-5.4-3-2.3-1-3.8-1.7-4.7-2.3-1.3-.9-2.3-1.8-2.9-2.8-.6-1-.9-2.2-.9-3.4,0-1.5.4-2.8,1.2-4s2-2.1,3.6-2.7c1.6-.6,3.4-1,5.3-1,2.4,0,4.3.4,6,1.2,1.6.8,2.8,1.8,3.5,3.2.7,1.3,1.1,2.6,1.1,3.8v.6l-3.7.3c0-.8-.1-1.5-.2-1.9-.3-.8-.7-1.5-1.2-2-.6-.6-1.3-1-2.3-1.3s-2.1-.5-3.2-.5c-2.1,0-3.8.5-4.9,1.4-.9.7-1.3,1.7-1.3,2.9,0,.7.2,1.4.6,1.9.4.6,1,1.1,2,1.6.7.4,2.3,1.1,4.9,2.3,2.1.9,3.5,1.6,4.3,2.2,1.1.7,1.9,1.6,2.4,2.5.6,1,.8,2.1.9,3.4,0,1.6-.5,3-1.4,4.3-1,1.3-2.3,2.3-4,3.1-1.7.7-3.6,1.1-5.8,1.1-3.3,0-6-.7-8-2.1-2.2-1.7-3.3-4.3-3.3-8h0Zm24.2,17.5l.2-3.4c.7.2,1.5.3,2.2.3s1.3-.2,1.8-.5c.6-.4,1.2-1.3,1.9-2.5l1.1-2.1-3.5-21.1h3.5l1.6,10.6c.3,2.1.6,4.2.8,6.3l9.4-16.9h3.7l-13.4,23.8c-1.3,2.3-2.4,3.9-3.4,4.6-1,.8-2.2,1.1-3.5,1.1-.8.2-1.6.1-2.4-.2h0Zm21.9-15.3l3.6-.2c0,1,.2,1.9.5,2.6.3.7.9,1.3,1.7,1.8s1.8.7,3,.7c1.6,0,2.8-.3,3.6-.9.8-.6,1.2-1.4,1.2-2.2,0-.6-.2-1.2-.7-1.8-.5-.5-1.7-1.2-3.6-2-1.9-.8-3.1-1.4-3.6-1.7-.9-.5-1.6-1.2-2-1.9s-.7-1.6-.7-2.5c0-1.7.7-3.1,2-4.3s3.2-1.8,5.5-1.8c2.6,0,4.6.6,6,1.8s2.1,2.8,2.1,4.8l-3.5.2c-.1-1.3-.5-2.3-1.3-3s-2-1.1-3.6-1.1c-1.2,0-2.2.3-2.9.9-.7.6-1,1.2-1,1.8,0,.7.3,1.2.9,1.7.4.3,1.4.9,3.1,1.6,2.7,1.2,4.5,2.1,5.2,2.8,1.1,1.1,1.7,2.4,1.7,4,0,1-.3,2.1-1,3.1-.6,1-1.6,1.8-2.9,2.4-1.3.6-2.9.9-4.6.9-2.4,0-4.5-.6-6.2-1.8-1.7-1.2-2.5-3.2-2.5-5.9h0Zm28.3,4.3l-.6,2.9c-.9.2-1.7.3-2.5.3-1.4,0-2.6-.4-3.4-1-.6-.5-.9-1.2-.9-2.2,0-.5.2-1.5.5-3.2l2.6-12.2h-2.8l.6-2.8h2.8l1.1-5.2,4.1-2.5-1.6,7.6h3.5l-.6,2.8h-3.5l-2.4,11.6c-.3,1.5-.5,2.4-.5,2.6,0,.4.1.7.4,1,.2.2.6.3,1.2.3.7.2,1.4.1,2,0h0Zm18.3-4.3l3.5.4c-.5,1.7-1.7,3.4-3.5,4.9-1.8,1.6-3.9,2.3-6.4,2.3-1.6,0-3-.4-4.3-1.1-1.3-.7-2.3-1.8-3-3.1-.7-1.4-1-2.9-1-4.7,0-2.3.5-4.5,1.6-6.7s2.4-3.8,4.1-4.8c1.7-1,3.5-1.6,5.5-1.6,2.5,0,4.5.8,6,2.3,1.5,1.6,2.2,3.7,2.2,6.4,0,1-.1,2.1-.3,3.2h-15.5c-.1.4-.1.8-.1,1.1,0,2,.5,3.5,1.4,4.5s2,1.6,3.3,1.6c1.2,0,2.4-.4,3.6-1.2,1.3-.8,2.2-1.9,2.9-3.5h0Zm-10.4-5.2h11.8v-.8c0-1.8-.5-3.2-1.3-4.1-.9-1-2-1.4-3.5-1.4s-2.9.5-4.2,1.6c-1.2,1-2.2,2.6-2.8,4.7h0Zm17.5,12.4l4.4-21h3.6l-.7,3.5c1.3-1.5,2.5-2.5,3.6-3.1,1-.6,2.2-.8,3.4-.8,1.3,0,2.4.4,3.3,1,.9.7,1.5,1.7,1.7,2.9,1.1-1.3,2.2-2.3,3.4-3s2.4-1,3.7-1c1.8,0,3.1.4,3.9,1.2.9.8,1.3,2,1.3,3.5,0,.7-.2,1.7-.5,3.2l-2.8,13.5h-3.6l2.9-13.9c.3-1.1.4-1.9.4-2.4,0-.7-.2-1.2-.7-1.6-.4-.4-1-.6-1.8-.6-1.1,0-2.2.3-3.3,1s-2,1.5-2.6,2.5c-.6,1.1-1.2,2.7-1.6,4.8l-2.1,10.2h-3.6l3-14.2c.2-1,.3-1.6.3-2.1,0-.7-.2-1.2-.6-1.7-.4-.4-1-.6-1.7-.6-1,0-2.1.3-3.2,1-1.1.7-2,1.5-2.7,2.7s-1.3,2.8-1.7,4.9l-2.1,9.9h-3.6v.2Zm-476.7,34.3l3.8.5c-1.2,3.4-3,5.9-5.3,7.6s-4.9,2.6-7.8,2.6c-3.5,0-6.3-1.1-8.4-3.2s-3.1-5.2-3.1-9.2c0-5.2,1.6-9.5,4.7-12.9,2.8-3,6.3-4.6,10.4-4.6,3.1,0,5.6.8,7.5,2.5,1.9,1.6,3,3.9,3.3,6.6l-3.6.3c-.4-2.1-1.2-3.7-2.4-4.7-1.2-1-2.7-1.6-4.6-1.6-3.5,0-6.4,1.6-8.6,4.7-1.9,2.7-2.8,5.9-2.8,9.7,0,3,.7,5.3,2.2,6.8,1.5,1.6,3.4,2.4,5.7,2.4,2,0,3.8-.7,5.4-2,1.7-1.3,2.9-3.1,3.6-5.5h0Zm6.9,2.2c0-4.1,1.2-7.5,3.6-10.2,2-2.2,4.6-3.3,7.8-3.3,2.5,0,4.6.8,6.1,2.4,1.5,1.6,2.3,3.7,2.3,6.4,0,2.4-.5,4.7-1.5,6.7-1,2.1-2.4,3.7-4.2,4.8-1.8,1.1-3.7,1.7-5.7,1.7-1.6,0-3.1-.4-4.5-1-1.3-.7-2.4-1.7-3.1-3-.5-1.3-.8-2.8-.8-4.5h0Zm3.5-.3c0,2,.5,3.5,1.4,4.5s2.2,1.5,3.6,1.5c.8,0,1.5-.2,2.3-.5.7-.3,1.5-.8,2.1-1.4s1.2-1.4,1.6-2.2c.5-.8.8-1.7,1.1-2.6.4-1.3.6-2.6.6-3.8,0-1.9-.5-3.4-1.4-4.4-1-1-2.2-1.6-3.6-1.6-1.1,0-2.1.3-3.1.8-.9.5-1.8,1.3-2.5,2.3s-1.3,2.2-1.6,3.6c-.3,1.5-.5,2.7-.5,3.8h0Zm18.1,8.3l6.1-29h3.6l-6.1,29h-3.6Zm9,0l6.1-29h3.6l-6.1,29h-3.6Zm23.5-2.6c-1.2,1.1-2.4,1.8-3.6,2.3-1.1.5-2.4.7-3.7.7-1.9,0-3.5-.6-4.7-1.7s-1.8-2.6-1.8-4.4c0-1.2.3-2.2.8-3.1s1.2-1.6,2.1-2.2c.9-.5,2-.9,3.2-1.2.8-.2,2.3-.3,4.6-.4,2.2-.1,3.9-.3,4.8-.7.3-1,.4-1.8.4-2.4,0-.8-.3-1.5-.9-2-.8-.7-2-1-3.6-1-1.5,0-2.7.3-3.7,1-1,.7-1.7,1.6-2.1,2.8l-3.6-.3c.7-2.1,1.9-3.7,3.5-4.8s3.6-1.7,6.1-1.7,4.7.6,6.2,1.9c1.2.9,1.7,2.1,1.7,3.6,0,1.1-.2,2.4-.5,3.9l-1.2,5.2c-.4,1.7-.6,3-.6,4.1,0,.7.1,1.6.4,2.8h-3.6c0-.5-.2-1.3-.2-2.4h0Zm1.3-8c-.5.2-1,.4-1.6.5s-1.5.2-2.9.3c-2.1.2-3.6.4-4.4.7-.9.3-1.5.7-1.9,1.4-.4.6-.7,1.3-.7,2.1,0,1,.3,1.8,1,2.5s1.7,1,3,1c1.2,0,2.3-.3,3.4-.9s2-1.5,2.6-2.6c.6-1.4,1.1-3,1.5-5h0Zm7,10.6l6.1-29h3.6l-2.2,10.4c1.1-1,2.2-1.8,3.1-2.2s1.9-.6,2.9-.6c2,0,3.6.7,4.9,2.2s2,3.6,2,6.4c0,1.9-.3,3.6-.8,5.1s-1.2,2.8-2,3.9-1.6,1.9-2.4,2.5-1.7,1.1-2.6,1.4-1.7.5-2.5.5c-1.4,0-2.6-.4-3.7-1.1s-1.9-1.8-2.5-3.3l-.8,4h-3.1v-.2Zm5.3-8.6v.7c0,1.8.4,3.2,1.3,4.1s1.9,1.4,3.2,1.4c1.2,0,2.4-.4,3.4-1.3s1.9-2.2,2.6-4.1,1-3.6,1-5.1c0-1.8-.4-3.1-1.3-4.1s-1.9-1.5-3.2-1.5-2.5.5-3.6,1.5-2,2.5-2.7,4.6c-.4,1.5-.7,2.8-.7,3.8h0Zm17.9.6c0-4.1,1.2-7.5,3.6-10.2,2-2.2,4.6-3.3,7.8-3.3,2.5,0,4.6.8,6.1,2.4,1.5,1.6,2.3,3.7,2.3,6.4,0,2.4-.5,4.7-1.5,6.7-1,2.1-2.4,3.7-4.2,4.8-1.8,1.1-3.7,1.7-5.7,1.7-1.6,0-3.1-.4-4.5-1-1.3-.7-2.4-1.7-3.1-3-.4-1.3-.8-2.8-.8-4.5h0Zm3.6-.3c0,2,.5,3.5,1.4,4.5s2.2,1.5,3.6,1.5c.8,0,1.5-.2,2.3-.5s1.5-.8,2.1-1.4,1.2-1.4,1.6-2.2c.5-.8.8-1.7,1.1-2.6.4-1.3.6-2.6.6-3.8,0-1.9-.5-3.4-1.4-4.4-1-1-2.2-1.6-3.6-1.6-1.1,0-2.1.3-3.1.8-.9.5-1.8,1.3-2.5,2.3s-1.3,2.2-1.6,3.6c-.4,1.5-.5,2.7-.5,3.8h0Zm18.3,8.3l4.4-21h3.2l-.9,4.3c1.1-1.6,2.1-2.8,3.2-3.6,1-.8,2.1-1.2,3.2-1.2.7,0,1.6.3,2.6.8l-1.5,3.3c-.6-.4-1.3-.7-2-.7-1.3,0-2.5.7-3.9,2.1-1.3,1.4-2.4,3.9-3.1,7.5l-1.8,8.4h-3.4v.1Zm27.7-2.6c-1.2,1.1-2.4,1.8-3.6,2.3-1.1.5-2.4.7-3.7.7-1.9,0-3.5-.6-4.7-1.7s-1.8-2.6-1.8-4.4c0-1.2.3-2.2.8-3.1s1.2-1.6,2.1-2.2c.9-.5,2-.9,3.2-1.2.8-.2,2.3-.3,4.6-.4,2.2-.1,3.9-.3,4.8-.7.3-1,.4-1.8.4-2.4,0-.8-.3-1.5-.9-2-.8-.7-2-1-3.6-1-1.5,0-2.7.3-3.7,1-1,.7-1.7,1.6-2.1,2.8l-3.6-.3c.7-2.1,1.9-3.7,3.5-4.8s3.6-1.7,6.1-1.7,4.7.6,6.2,1.9c1.2.9,1.7,2.1,1.7,3.6,0,1.1-.2,2.4-.5,3.9l-1.2,5.2c-.4,1.7-.6,3-.6,4.1,0,.7.1,1.6.4,2.8h-3.6c0-.5-.1-1.3-.2-2.4h0Zm1.3-8c-.5.2-1,.4-1.6.5s-1.5.2-2.9.3c-2.1.2-3.6.4-4.4.7-.9.3-1.5.7-1.9,1.4-.4.6-.7,1.3-.7,2.1,0,1,.3,1.8,1,2.5s1.7,1,3,1c1.2,0,2.3-.3,3.4-.9s2-1.5,2.6-2.6c.6-1.4,1.1-3,1.5-5h0Zm15.4,7.7l-.6,2.9c-.9.2-1.7.3-2.5.3-1.4,0-2.6-.4-3.4-1-.6-.5-.9-1.2-.9-2.2,0-.5.2-1.5.5-3.2l2.6-12.2h-2.8l.6-2.8h2.8l1.1-5.2,4.1-2.5-1.6,7.6h3.5l-.6,2.8h-3.5l-2.4,11.6c-.3,1.5-.5,2.4-.5,2.6,0,.4.1.7.4,1,.2.2.6.3,1.2.3.7.2,1.4.2,2,0h0Zm8-22l.8-4.1h3.6l-.9,4.1h-3.5Zm-5.2,24.9l4.4-21h3.6l-4.4,21h-3.6Zm9.7-8c0-4.1,1.2-7.5,3.6-10.2,2-2.2,4.6-3.3,7.8-3.3,2.5,0,4.6.8,6.1,2.4,1.5,1.6,2.3,3.7,2.3,6.4,0,2.4-.5,4.7-1.5,6.7-1,2.1-2.4,3.7-4.2,4.8-1.8,1.1-3.7,1.7-5.7,1.7-1.6,0-3.1-.4-4.5-1-1.3-.7-2.4-1.7-3.1-3-.4-1.3-.8-2.8-.8-4.5h0Zm3.6-.3c0,2,.5,3.5,1.4,4.5s2.2,1.5,3.6,1.5c.8,0,1.5-.2,2.3-.5s1.5-.8,2.1-1.4,1.2-1.4,1.6-2.2c.5-.8.8-1.7,1.1-2.6.4-1.3.6-2.6.6-3.8,0-1.9-.5-3.4-1.4-4.4-1-1-2.2-1.6-3.6-1.6-1.1,0-2.1.3-3.1.8-.9.5-1.8,1.3-2.5,2.3s-1.3,2.2-1.6,3.6c-.3,1.5-.5,2.7-.5,3.8h0Zm18.3,8.3l4.4-21h3.2l-.8,3.7c1.4-1.4,2.7-2.5,4-3.1,1.2-.7,2.5-1,3.8-1,1.7,0,3,.5,4,1.4s1.5,2.2,1.5,3.7c0,.8-.2,2-.5,3.7l-2.7,12.7h-3.6l2.8-13.3c.3-1.3.4-2.2.4-2.9s-.2-1.3-.7-1.7c-.5-.4-1.2-.7-2.1-.7-1.8,0-3.5.7-4.9,2-1.4,1.3-2.5,3.6-3.2,6.8l-2,9.8h-3.6v-.1Zm56.9-10.2l3.8.5c-1.2,3.4-3,5.9-5.3,7.6s-4.9,2.6-7.8,2.6c-3.5,0-6.3-1.1-8.4-3.2-2.1-2.1-3.1-5.2-3.1-9.2,0-5.2,1.6-9.5,4.7-12.9,2.8-3,6.3-4.6,10.4-4.6,3.1,0,5.6.8,7.5,2.5,1.9,1.6,3,3.9,3.3,6.6l-3.6.3c-.4-2.1-1.2-3.7-2.4-4.7s-2.7-1.6-4.6-1.6c-3.5,0-6.4,1.6-8.6,4.7-1.9,2.7-2.8,5.9-2.8,9.7,0,3,.7,5.3,2.2,6.8,1.5,1.6,3.4,2.4,5.7,2.4,2,0,3.8-.7,5.4-2,1.7-1.3,2.8-3.1,3.6-5.5h0Zm6.8,2.2c0-4.1,1.2-7.5,3.6-10.2,2-2.2,4.6-3.3,7.8-3.3,2.5,0,4.6.8,6.1,2.4,1.5,1.6,2.3,3.7,2.3,6.4,0,2.4-.5,4.7-1.5,6.7-1,2.1-2.4,3.7-4.2,4.8-1.8,1.1-3.7,1.7-5.7,1.7-1.6,0-3.1-.4-4.5-1-1.3-.7-2.4-1.7-3.1-3-.5-1.3-.8-2.8-.8-4.5h0Zm3.6-.3c0,2,.5,3.5,1.4,4.5s2.2,1.5,3.6,1.5c.8,0,1.5-.2,2.3-.5.7-.3,1.4-.8,2.1-1.4.6-.6,1.2-1.4,1.6-2.2.5-.8.8-1.7,1.1-2.6.4-1.3.6-2.6.6-3.8,0-1.9-.5-3.4-1.4-4.4-1-1-2.2-1.6-3.6-1.6-1.1,0-2.1.3-3.1.8-.9.5-1.8,1.3-2.5,2.3s-1.3,2.2-1.6,3.6c-.4,1.5-.5,2.7-.5,3.8h0Zm18.3,8.3l4.4-21h3.6l-.7,3.5c1.3-1.5,2.5-2.5,3.6-3.1,1-.6,2.2-.8,3.4-.8,1.3,0,2.4.4,3.3,1,.9.7,1.5,1.7,1.7,2.9,1.1-1.3,2.2-2.3,3.4-3s2.4-1,3.7-1c1.7,0,3.1.4,3.9,1.2.9.8,1.3,2,1.3,3.5,0,.7-.2,1.7-.5,3.2l-2.8,13.5h-3.6l2.9-13.9c.3-1.1.4-1.9.4-2.4,0-.7-.2-1.2-.7-1.6-.4-.4-1-.6-1.8-.6-1.1,0-2.2.3-3.3,1-1.1.7-2,1.5-2.6,2.5-.6,1.1-1.2,2.7-1.6,4.8l-2.1,10.2h-3.6l3-14.2c.2-1,.3-1.6.3-2.1,0-.7-.2-1.2-.6-1.7-.4-.4-1-.6-1.7-.6-1,0-2.1.3-3.2,1-1.1.7-2,1.5-2.7,2.7-.7,1.2-1.3,2.8-1.7,4.9l-2.1,9.9h-3.6v.2Zm33.7,0l4.4-21h3.6l-.7,3.5c1.3-1.5,2.5-2.5,3.6-3.1,1-.6,2.2-.8,3.4-.8,1.3,0,2.4.4,3.3,1,.9.7,1.4,1.7,1.7,2.9,1.1-1.3,2.2-2.3,3.4-3s2.4-1,3.7-1c1.7,0,3.1.4,3.9,1.2.9.8,1.3,2,1.3,3.5,0,.7-.2,1.7-.5,3.2l-2.8,13.5h-3.6l2.9-13.9c.3-1.1.4-1.9.4-2.4,0-.7-.2-1.2-.7-1.6-.4-.4-1-.6-1.8-.6-1.1,0-2.2.3-3.3,1-1.1.7-2,1.5-2.6,2.5-.6,1.1-1.2,2.7-1.6,4.8l-2.1,10.2h-3.6l3-14.2c.2-1,.3-1.6.3-2.1,0-.7-.2-1.2-.6-1.7-.4-.4-1-.6-1.7-.6-1,0-2.1.3-3.2,1-1.1.7-2,1.5-2.7,2.7-.7,1.2-1.3,2.8-1.7,4.9l-2.1,9.9h-3.6v.2Zm48.2-3.8c-2.5,2.8-5.1,4.3-7.7,4.3-1.6,0-2.9-.5-3.9-1.4s-1.5-2.1-1.5-3.4c0-.9.2-2.4.7-4.6l2.5-12.1h3.6l-2.8,13.4c-.2,1.1-.4,2-.4,2.6,0,.8.2,1.4.7,1.9.5.4,1.2.7,2.1.7,1,0,2-.2,2.9-.7,1-.5,1.8-1.1,2.5-2,.7-.8,1.3-1.8,1.7-2.9.3-.7.6-2,1-3.8l1.9-9.1h3.6l-4.4,21h-3.3l.8-3.9Zm8.2,3.8l4.4-21h3.2l-.8,3.7c1.4-1.4,2.7-2.5,4-3.1,1.2-.7,2.5-1,3.8-1,1.7,0,3,.5,4,1.4s1.4,2.2,1.5,3.7c0,.8-.2,2-.5,3.7l-2.7,12.7h-3.6l2.8-13.3c.3-1.3.4-2.2.4-2.9s-.2-1.3-.7-1.7c-.5-.4-1.2-.7-2.1-.7-1.8,0-3.5.7-4.9,2-1.4,1.3-2.5,3.6-3.2,6.8l-2,9.8h-3.6v-.1Zm27.6-24.9l.8-4.1h3.6l-.9,4.1h-3.5Zm-5.2,24.9l4.4-21h3.6l-4.4,21h-3.6Zm17.5-2.9l-.6,2.9c-.9.2-1.7.3-2.5.3-1.4,0-2.6-.4-3.4-1-.6-.5-.9-1.2-.9-2.2,0-.5.2-1.5.5-3.2l2.6-12.2h-2.8l.6-2.8h2.8l1.1-5.2,4.1-2.5-1.6,7.6h3.5l-.6,2.8h-3.5l-2.4,11.6c-.3,1.5-.5,2.4-.5,2.6,0,.4.1.7.4,1,.2.2.6.3,1.2.3.7.2,1.4.2,2,0h0Zm1.5,11l.2-3.4c.7.2,1.5.3,2.2.3s1.3-.2,1.8-.5c.6-.4,1.2-1.3,1.9-2.5l1.1-2.1-3.5-21.1h3.5l1.6,10.6c.3,2.1.6,4.2.8,6.3l9.4-16.9h3.7l-13.4,23.8c-1.3,2.3-2.4,3.9-3.4,4.6-1,.8-2.2,1.1-3.5,1.1-.8.2-1.6.1-2.4-.2h0Z"/>
  <g>
    <path class="cls-3" d="m32.46,62.5v40.4c3.9-.2,7.6,1,10.6,3.1l10.2-7.1v-36.4h-20.8Zm20.8,52.7l-2.8,2c0,.2.1.5.1.7.8,5.7-1.2,11.1-5,14.9h7.7v-17.6Zm11.2-75.8v51.7l6-4.2c-.1-.4-.2-.8-.3-1.3-1.4-9.5,5.3-18.4,14.8-19.8h.2v-26.4h-20.7Zm13.9,58.5l-13.8,9.6v25.3h20.7v-32.2c-2.5-.4-4.8-1.4-6.9-2.7h0ZM96.46,0v68.2c2.7,1.6,4.9,3.9,6.4,6.7l14.4-2V0h-20.8Zm20.8,86.5l-13.2,1.9c-1.3,4.1-4,7.6-7.6,9.8v34.6h20.8v-46.3Zm11.2-56.7v41.5l4.2-.6c1.3-7.3,7-13.3,14.7-14.4.6-.1,1.2-.1,1.8-.1v-26.4h-20.7Zm7.4,54l-7.4,1.1v47.9h20.8v-41.7c-5.4-.3-10.3-3-13.4-7.3h0Z"/>
    <path class="cls-7" d="m105.66,242.9c-4.9,0-9-2.4-11.5-6.6-2.5-4.3-2.5-9,0-13.3l16.9-29.3,16.9-29.3h.1c2.5-4.2,6.6-6.6,11.4-6.6s9,2.4,11.5,6.6l16.9,29.3,16.9,29.3c2.5,4.2,2.5,9,0,13.3-2.5,4.2-6.6,6.6-11.5,6.6h-9.4c-5-14.8-14-27.8-24.4-27.8s-19.4,13-24.4,27.8h-9.4Z"/>
    <path class="cls-4" d="m164.16,263.5c0-15.4-11.1-38-24.7-38s-24.7,22.5-24.7,38,11.1,24.6,24.7,24.6c13.7,0,24.7-9.2,24.7-24.6h0Z"/>
    <path class="cls-2" d="m219.26,222.1c-2.5,4.2-6.6,6.6-11.5,6.6s-9-2.4-11.5-6.6l-16.9-29.3-16.9-29.3h0c-2.4-4.2-2.5-9,0-13.2,2.4-4.2,6.6-6.6,11.5-6.6h67.6c4.9,0,9,2.4,11.5,6.6,2.5,4.2,2.5,9,0,13.3l-4.7,8.1c-15.3-3.1-31.1-1.8-36.3,7.2s1.6,23.3,11.9,35l-4.7,8.2h0Z"/>
    <path class="cls-5" d="m266.36,181.7c-13.4-7.7-38.4-9.4-45.2,2.4-6.8,11.8,7.2,32.7,20.5,40.4,13.4,7.7,26.8,2.7,33.6-9.1,6.8-11.9,4.4-26-8.9-33.7h0Z"/>
    <path class="cls-6" d="m59.66,222.1c2.5,4.2,6.6,6.6,11.5,6.6s9-2.4,11.5-6.6l16.9-29.3,16.9-29.3h0c2.4-4.2,2.5-9,0-13.2-2.4-4.2-6.6-6.6-11.5-6.6H37.36c-4.9,0-9,2.4-11.5,6.6-2.5,4.2-2.5,9,0,13.3l4.7,8.1c15.3-3.1,31.1-1.8,36.3,7.2s-1.6,23.3-11.9,35l4.7,8.2h0Z"/>
    <path class="cls-10" d="m12.66,181.7c13.4-7.7,38.4-9.4,45.2,2.4,6.8,11.8-7.2,32.7-20.5,40.4-13.4,7.7-26.8,2.7-33.6-9.1-6.9-11.9-4.5-26,8.9-33.7h0Z"/>
    <path class="cls-8" d="m253.06,114.2c2.5,4.2,2.5,9,0,13.3s-6.6,6.6-11.5,6.6h-67.6c-4.9,0-9-2.4-11.5-6.6-2.4-4.2-2.4-9,0-13.3l16.9-29.3,16.9-29.3c2.5-4.3,6.6-6.6,11.5-6.6s9,2.4,11.5,6.6l4.7,8.1c-10.3,11.7-17.1,26-11.9,35,5.2,9,21,10.3,36.3,7.2l4.7,8.3h0Z"/>
    <path class="cls-9" d="m241.66,53.3c-13.4,7.7-27.3,28.6-20.5,40.4s31.9,10.1,45.2,2.4c13.4-7.7,15.8-21.9,8.9-33.7-6.8-11.8-20.3-16.8-33.6-9.1h0Z"/>
    <path class="cls-6" d="m191.16,9.3c6.3.4,11.6,5.1,12.5,11.5,1.1,7.4-4.1,14.2-11.4,15.2-1.7.2-3.5.1-5.1-.3l-1.2-.3-.8,1-23,28.7-.8,1,.6,1.2c.7,1.3,1.2,2.8,1.4,4.3,1.1,7.4-4.1,14.2-11.4,15.2-5.5.8-10.6-1.9-13.3-6.3l-.7-1.1-1.3.2-34.1,4.9-1.4.2-.3,1.4c-1.2,5.3-5.5,9.6-11.2,10.4-3.7.5-7.3-.6-10-2.6l-1.2-.9-1.2.8-30,20.7-1.2.8.3,1.4c.1.5.2,1.1.3,1.7,1.1,7.4-4,14.2-11.4,15.2-2.1.3-4.2,0-6.2-.7h-.1c-1.9-.7-5.3-3.1-6.6-4.9h0c-1.2-1.7-2-3.6-2.3-5.8-1.1-7.4,4.1-14.2,11.4-15.2,3.9-.6,7.6.6,10.5,3l1.2,1,1.3-.9,29.6-20.6,1.2-.9-.4-1.4c-.2-.7-.4-1.3-.5-2.1-1.1-7.4,4.1-14.2,11.4-15.2,6.2-.9,11.9,2.6,14.2,8l.6,1.4,1.5-.2,32.7-4.6,1.6-.2.1-1.6c.5-6.2,5.1-11.4,11.5-12.3,2.9-.4,5.6.1,8,1.3l1.5.7,1-1.3,21.7-27.1,1-1.3-1.1-1.3c-1.6-1.9-2.7-4.2-3.1-6.7-1-6.9,3.5-13.4,10.1-15,.2-.1.7-.1,1.3-.2,1-.2,1.9-.2,2.8-.2h0Z"/>
  </g>
</svg>