<?xml version="1.0" encoding="utf-8"?>
<!-- Generator: Adobe Illustrator 27.3.1, SVG Export Plug-In . SVG Version: 6.00 Build 0)  -->
<svg version="1.1" id="Layer_2_00000117650351594047167830000003759314857652367278_"
	 xmlns="http://www.w3.org/2000/svg" xmlns:xlink="http://www.w3.org/1999/xlink" x="0px" y="0px" viewBox="0 0 6706.9 1890.1"
	 style="enable-background:new 0 0 6706.9 1890.1;" xml:space="preserve">
<style type="text/css">
	.st0{fill:#FFFFFF;}
	.st1{fill:#CCCCCC;}
	.st2{fill:#999999;}
	.st3{opacity:0.1;enable-background:new    ;}
	.st4{opacity:0.2;enable-background:new    ;}
</style>
<g>
	<g>
		<path class="st0" d="M1437.8,771.8l-266.3-47v349.1c0,53.9-43.7,97.6-97.6,97.6H999c27.7,23.6,58.6,42.8,92.2,57
			c29.8,12.6,60.8,21,92.7,25.1V900.1c0-25.4,20.6-46,46-46l0,0h327.6L1437.8,771.8L1437.8,771.8z"/>
		<polygon class="st0" points="1632.3,905.5 1624.4,900.1 1229.9,900.1 1229.9,1302.5 1632.3,1302.5 		"/>
		<path class="st0" d="M2010.9,1165.8c15.4,42.7,23.8,88.7,23.8,136.7c0,222.2-180.2,402.4-402.4,402.4H827.5v-402.4h402.4
			c-117.6,0-223.5-50.5-297.1-131H532.5v620.9c0,53.9,43.7,97.6,97.6,97.6h1562c53.9,0,97.6-43.7,97.6-97.6v-434.9L2010.9,1165.8z"
			/>
	</g>
	<g>
		<polygon class="st1" points="1437.8,900.1 1437.8,1302.5 1632.3,1302.5 1632.3,900.1 1632.3,900.1 		"/>
		<rect x="1437.8" y="825" class="st1" width="550.9" height="29.1"/>
		<path class="st1" d="M2289.8,825h-255.1v75.1h-402.4c222.3,0,402.4,180.2,402.4,402.4c0,18.7-1.3,37-3.7,55h258.8V825z"/>
	</g>
	<g>
		<path class="st2" d="M2034.7,825h255V390.2c0.1-54-43.6-97.7-97.6-97.7h-754.4v205.2h597V825z"/>
		<rect x="1437.7" y="543.7" class="st2" width="551" height="281.3"/>
	</g>
	<g>
		<path class="st1" d="M1171.5,292.5v209.4c19.1-2.8,38.6-4.2,58.4-4.2h207.8V292.5H1171.5z"/>
		<path class="st1" d="M1171.5,548.5V825h266.2V543.7h-207.8C1210.2,543.7,1190.7,545.3,1171.5,548.5z"/>
	</g>
</g>
<g>
	<path class="st3" d="M1171.5,292.5v781.4c0,53.9-43.7,97.6-97.6,97.6H532.5V1278h647.9c53.8-0.2,97.4-43.8,97.6-97.6V292.5H1171.5z
		"/>
</g>
<g>
	<path class="st4" d="M1171.5,292.5v781.4c0,53.9-43.7,97.6-97.6,97.6H532.5v159.7h594.6c53.9-0.1,97.5-43.7,97.7-97.6V292.5H1171.5
		z"/>
</g>
<g>
	<path class="st4" d="M1171.5,292.5v781.4c0,53.9-43.7,97.6-97.6,97.6H532.5v53.2h594.6c53.9-0.1,97.5-43.7,97.7-97.6V292.5H1171.5z
		"/>
</g>
<path class="st0" d="M1073.9,0H97.6C43.7,0,0,43.7,0,97.6v976.3c0,53.9,43.7,97.6,97.6,97.6h976.3c53.9,0,97.6-43.7,97.6-97.6V97.6
	C1171.5,43.7,1127.8,0,1073.9,0z M721.4,903L602.8,680.9c-5.6-9.5-10.3-19.4-14.2-29.7h-1.8c-3.5,10.1-8.1,19.7-13.7,28.8l-122,223
	H302.3l205.3-318.2L319.5,268.4h151.3l102.7,202.4c9.5,19.2,16,33.5,19.5,42.9h1.3c6.7-15.3,13.8-30.2,21.3-44.7l109.8-200.5h138.9
	L671.4,583.1L869.2,903H721.4z"/>
<g class="st4">
	<path d="M1073.9,1171.5H532.5v53.3h541.4c53.8-0.2,97.4-43.8,97.6-97.6v-53.3C1171.5,1127.8,1127.8,1171.5,1073.9,1171.5z"/>
</g>
<path class="st0" d="M2647.1,903h103.4v98.7h-103.4V903z"/>
<path class="st0" d="M2797.4,871.6h97c7.6,35.4,33.1,59.8,78.4,59.8c40.6,0,66.8-18,66.8-47c0-20.9-13.4-34.3-43.6-40.1l-84.8-16.8
	c-67.4-13.4-105.1-46.5-105.1-113.8c0-73.2,65.6-126.6,158.5-126.6s156.2,49.4,160.3,130.7h-95.8c-5.2-30.2-26.7-52.3-65-52.3
	s-61,13.9-61,40.7c0,19.2,11.6,27.9,36,32.5l92.3,17.4c68.5,12.8,105.1,51.7,105.1,115.6c0,81.9-69.1,138.2-164.9,138.2
	S2806.2,955.8,2797.4,871.6z"/>
<path class="st0" d="M3203.9,893.1V775.2h-44.1v-77.8h44.1v-80.1h97.6v80.1h64.5v77.8h-64.5v113.2c0,23.2,11.6,36,34.8,36
	c13.4,0,23.8-2.3,30.2-4.7v77.8c-13.4,5.2-36.6,8.1-61,8.1C3238.8,1005.8,3203.9,968,3203.9,893.1L3203.9,893.1z"/>
<path class="st0" d="M3529.7,816.5l61.6-5.2v-12.8c0-21.5-13.4-36.6-41.2-36.6s-43,14.5-45.3,33.7h-92.3
	c9.3-63.3,61.6-105.1,138.2-105.1c88.3,0,138.2,45.9,138.2,117.3v194h-94.6V961c-11.6,26.7-44.7,47.6-87.7,47.6
	c-63.3,0-103.9-37.2-103.9-95.2C3402.5,851.9,3443.7,823.4,3529.7,816.5L3529.7,816.5z M3537.2,943.6c34.3,0,54-19.8,54-54.6v-16.8
	l-45.9,4.7c-27.9,2.9-48.2,9.9-48.2,33.1C3497.2,930.9,3512.8,943.6,3537.2,943.6L3537.2,943.6z"/>
<path class="st0" d="M3761.4,893.1V775.2h-44.1v-77.8h44.1v-80.1h97.6v80.1h64.5v77.8h-64.5v113.2c0,23.2,11.6,36,34.8,36
	c13.4,0,23.8-2.3,30.2-4.7v77.8c-13.4,5.2-36.6,8.1-61,8.1C3796.2,1005.8,3761.4,968,3761.4,893.1L3761.4,893.1z"/>
<path class="st0" d="M4087.1,595.2h169c121.4,0,209.1,88.3,209.1,203.2s-87.7,203.2-209.1,203.2h-169L4087.1,595.2L4087.1,595.2z
	 M4243.3,916.3c71.4,0,122-48.2,122-117.9s-50.5-117.9-122-117.9h-56.9v235.8L4243.3,916.3L4243.3,916.3z"/>
<path class="st0" d="M4517.4,595.2h99.9v319.4h189.9v87.1h-289.8V595.2z"/>
<path class="st0" d="M4858.2,595.2h124.3l104,272.9l104-272.9h124.3v406.5h-93.5V732.9l-98.1,268.9h-73.2l-98.1-268.9v268.9h-93.5
	L4858.2,595.2L4858.2,595.2z"/>
<path class="st0" d="M2797.4,1149.2H3107v86.5h-209.6v70.3h202.1v86.5h-202.1v76.7h214.3v86.5h-314.2L2797.4,1149.2L2797.4,1149.2z"
	/>
<path class="st0" d="M3237,1400.6l-91.2-149.2h105.1l46.5,84.2l46.4-84.2H3449l-91.2,149.2l93.5,155.1H3345l-47.6-85.4l-47.6,85.4
	h-106.3L3237,1400.6L3237,1400.6z"/>
<path class="st0" d="M3621.4,1244.4c86.5,0,144,54,151,130.1h-92.9c-6.4-26.7-25.6-48.2-57.5-48.2c-43,0-62.7,37.2-62.7,77.2
	s19.8,77.2,62.7,77.2c31.9,0,51.1-21.5,57.5-48.2h92.9c-7,76.1-64.5,130.1-151,130.1c-98.1,0-159.7-71.4-159.7-159.1
	S3523.3,1244.4,3621.4,1244.4L3621.4,1244.4z"/>
<path class="st0" d="M3957.6,1244.4c98.7,0,151,69.7,151,161.4v18.6h-213.7c2.9,37.2,26.7,64.5,65.6,64.5
	c32.5,0,49.9-14.5,58.1-32.5h87.7c-13.4,62.1-70.9,106.3-144.6,106.3c-101,0-160.3-67.9-160.3-159.1S3864.1,1244.4,3957.6,1244.4
	L3957.6,1244.4z M4016.3,1363.5c-4.6-30.8-26.7-51.7-58.6-51.7s-54,21.5-61,51.7H4016.3L4016.3,1363.5z"/>
<path class="st0" d="M4153.9,1131.8h97.5v423.9h-97.5V1131.8z"/>
<path class="st0" d="M4562.6,1149.2h105.7l158,406.5h-104.5l-27.9-80.7h-156.8l-27.9,80.7h-104.5L4562.6,1149.2L4562.6,1149.2z
	 M4663.7,1388.4l-48.2-139.9l-48.2,139.9H4663.7L4663.7,1388.4z"/>
<path class="st0" d="M5066.1,1555.7v-41.2c-15.1,28.5-43.5,48.2-88.9,48.2c-81.9,0-139.4-69.7-139.4-159.1s56.9-159.1,138.8-159.1
	c44.7,0,72,19.7,86.5,48.2v-160.9h97.6v423.9H5066.1L5066.1,1555.7z M4999.9,1325.1c-40.6,0-64.5,38.3-64.5,78.4
	s23.8,78.4,64.5,78.4s63.3-32.5,63.3-78.4S5039.4,1325.1,4999.9,1325.1z"/>
<path class="st0" d="M5430.2,1555.7v-41.2c-15.1,28.5-43.5,48.2-88.9,48.2c-81.9,0-139.4-69.7-139.4-159.1s56.9-159.1,138.8-159.1
	c44.7,0,72,19.7,86.5,48.2v-160.9h97.6v423.9H5430.2L5430.2,1555.7z M5364,1325.1c-40.6,0-64.5,38.3-64.5,78.4s23.8,78.4,64.5,78.4
	s63.3-32.5,63.3-78.4S5403.5,1325.1,5364,1325.1z"/>
<path class="st0" d="M5578.8,1339.1h166.7v79.6h-166.7V1339.1L5578.8,1339.1z"/>
<path class="st0" d="M5801.8,1131.8h98.7v85.4h-98.7V1131.8z M5802.4,1251.4h97.5v304.3h-97.5V1251.4z"/>
<path class="st0" d="M5959.7,1251.4h94.6v43.6c13.4-30.2,38.9-50.5,83-50.5c72.6,0,107.4,50.5,107.4,125.4v185.8h-97.6v-173.6
	c0-29.6-12.8-54-44.1-54s-45.9,20.3-45.9,53.4v174.2h-97.6V1251.4z"/>
</svg>
